{
    "parent": "builtin/entity",
    "display": {
        "gui": {
            "rotation": [ 10, -30, 0 ],
            "translation": [ -4, 11.75, 0],
            "scale":[ 0.9, 0.9, 0.9 ]
        },
        "ground": {
            "rotation": [ -90, 0, 0 ],
            "translation": [ -6, -0.5, -13],
            "scale":[ 1, 1, 1 ]
        },
        "head": {
            "rotation": [ 0, 0, 0 ],
            "translation": [ 0, 0, 0],
            "scale":[ 1, 1, 1]
        },
        "fixed": {
            "rotation": [ 0, 180, 0 ],
            "translation": [ 4, 14, 0],
            "scale":[ 1, 1, 1 ]
        },
        "thirdperson_righthand": {
            "rotation": [ 45, 180, 0 ],
            "translation": [ 6, 8, 9],
            "scale": [ 1, 1, 1 ]
        },
        "thirdperson_lefthand": {
            "rotation": [ 45, 180, 0 ],
            "translation": [ -6, 8, 9],
            "scale": [ 1, 1, 1 ]
        },
        "firstperson_righthand": {
            "rotation": [ 0, -50, 0 ],
            "translation": [ 0, 10, -5],
            "scale": [ 0.6, 0.6, 0.6 ]
        },
        "firstperson_lefthand": {
            "rotation": [ 0, -50, 0 ],
            "translation": [ 5, 10, 0],
            "scale": [ 0.6, 0.6, 0.6 ]
        }
    }
}
