{
	"repulsor_on": {
		"category": "player",
		"sounds": ["ironman:repulsor_on"],
		"subtitle": "subtitles.repulsor_on"
	},
	
	"repulsor_off": {
		"category": "player",
		"sounds": ["ironman:repulsor_off"],
		"subtitle": "subtitles.repulsor_off"
	},
	
	"repulsor_shot": {
		"category": "player",
		"sounds": ["ironman:repulsor_shot"],
		"subtitle": "subtitles.repulsor_shot"
	}

}