{
  "pools": [
    {
	  "name": "heroesexpansion:superman_suit_instruction",
      "rolls": 1,
      "entries": [
        {
          "type": "item",
          "name": "lucraftcore:instruction",
          "weight": 1,
          "functions": [
            {
              "function": "set_data",
              "data": 0
            },
            {
              "function": "set_count",
              "count": 1
            },
            {
              "function": "set_nbt",
              "tag": "{Recipes:[\"heroesexpansion:superman_chestplate\", \"heroesexpansion:superman_legs\", \"heroesexpansion:superman_boots\"]}"
            }
          ]
        }
      ]
    }
  ]
}