{
  "output": {
    "item": "heroesexpansion:spider_man_boots"
  },
  "requirements": [
    {
      "item": "heroesexpansion:spider_man_homemade_boots"
    },
    {
      "item": "lucraftcore:tri_polymer_red",
      "amount": 4
    }
  ]
}