{
  "required": true,
  "package": "net.threetag.threecore.mixin",
  "compatibilityLevel": "JAVA_8",
  "refmap": "threecore.refmap.json",
  "mixins": [
	"MinecraftServerMixin",
	"RecipeManagerMixin"
  ],
  "client": [
    "BipedModelMixin"
  ],
  "minVersion": "0.8"
}