{
  "parent": "builtin/entity",
  "display": {

    "thirdperson_righthand": {
      "rotation": [0, 0, 0],
      "translation": [0, 4, 0],
      "scale": [0.25, 0.25, 0.25]
    },

    "thirdperson_lefthand": {
      "rotation": [0, 0, 0],
      "translation": [0, 4, 0],
      "scale": [0.25, 0.25, 0.25]
    },

    "firstperson_righthand": {
      "rotation": [0, 0, 0],
      "translation": [0, 4, 0],
      "scale": [0.25, 0.25, 0.25]
    },
    "firstperson_lefthand": {
      "rotation": [0, 0, 0],
      "translation": [0, 4, 0],
      "scale": [0.25, 0.25, 0.25]
    },
    "gui": {
      "rotation": [0, 0, 0],
      "translation": [0, 4, 0],
      "scale": [0.5, 0.5, 0.5]
    },

    "ground": {
      "rotation": [0, 0, 0],
      "translation":[0, 4, 0],
      "scale": [0.25, 0.25, 0.25]
    },

    "fixed": {
      "rotation": [180, 180, 0],
      "translation": [0, 0, 0],
      "scale": [0.6, 0.6, 0.6]
    },
    "head": {
      "rotation": [0, 90, 0],
      "translation": [0, 0, 0]
    }
  }

}