{
	"credit": "Made with Blockbench",
	"textures": {
		"1": "galaxysedge:blocks/crystals",
		"particle": "galaxysedge:blocks/crystals"
	},
	"elements": [
		{
			"name": "base1",
			"from": [5, 0, 6],
			"to": [11, 1, 12],
			"rotation": {"angle": 0, "axis": "y", "origin": [8, 16, 11]},
			"faces": {
				"north": {"uv": [0, 15, 8, 16], "texture": "#1"},
				"east": {"uv": [0, 15, 8, 16], "texture": "#1"},
				"south": {"uv": [0, 15, 8, 16], "texture": "#1"},
				"west": {"uv": [0, 15, 8, 16], "texture": "#1"},
				"up": {"uv": [8, 8, 16, 16], "texture": "#1"},
				"down": {"uv": [8, 0, 16, 8], "texture": "#1"}
			}
		},
		{
			"name": "ground1",
			"from": [8, 0, 9],
			"to": [12, 0.5, 13],
			"rotation": {"angle": 0, "axis": "y", "origin": [8, 16, 11]},
			"faces": {
				"north": {"uv": [0, 15, 8, 16], "texture": "#1"},
				"east": {"uv": [0, 15, 8, 16], "texture": "#1"},
				"south": {"uv": [0, 15, 8, 16], "texture": "#1"},
				"west": {"uv": [0, 15, 8, 16], "texture": "#1"},
				"up": {"uv": [8, 8, 16, 16], "texture": "#1"},
				"down": {"uv": [8, 0, 16, 8], "texture": "#1"}
			}
		},
		{
			"name": "ground2",
			"from": [9, 0, 5],
			"to": [13, 0.5, 10],
			"rotation": {"angle": 0, "axis": "y", "origin": [8, 16, 11]},
			"faces": {
				"north": {"uv": [0, 15, 8, 16], "texture": "#1"},
				"east": {"uv": [0, 15, 8, 16], "texture": "#1"},
				"south": {"uv": [0, 15, 8, 16], "texture": "#1"},
				"west": {"uv": [0, 15, 8, 16], "texture": "#1"},
				"up": {"uv": [8, 8, 16, 16], "texture": "#1"},
				"down": {"uv": [8, 0, 16, 8], "texture": "#1"}
			}
		},
		{
			"name": "ground3",
			"from": [5, 0, 4],
			"to": [9, 0.5, 6],
			"rotation": {"angle": 0, "axis": "y", "origin": [8, 16, 11]},
			"faces": {
				"north": {"uv": [0, 15, 8, 16], "texture": "#1"},
				"east": {"uv": [0, 15, 8, 16], "texture": "#1"},
				"south": {"uv": [0, 15, 8, 16], "texture": "#1"},
				"west": {"uv": [0, 15, 8, 16], "texture": "#1"},
				"up": {"uv": [8, 8, 16, 16], "texture": "#1"},
				"down": {"uv": [8, 0, 16, 8], "texture": "#1"}
			}
		},
		{
			"name": "ground4",
			"from": [4, 0, 6.5],
			"to": [8, 0.5, 10.5],
			"rotation": {"angle": 0, "axis": "y", "origin": [8, 16, 11]},
			"faces": {
				"north": {"uv": [0, 15, 8, 16], "texture": "#1"},
				"east": {"uv": [0, 15, 8, 16], "texture": "#1"},
				"south": {"uv": [0, 15, 8, 16], "texture": "#1"},
				"west": {"uv": [0, 15, 8, 16], "texture": "#1"},
				"up": {"uv": [8, 8, 16, 16], "texture": "#1"},
				"down": {"uv": [8, 0, 16, 8], "texture": "#1"}
			}
		},
		{
			"name": "crystal1",
			"from": [6.27518, 1.54744, 7],
			"to": [8.27518, 7.54744, 9],
			"rotation": {"angle": 22.5, "axis": "z", "origin": [10, 0, 9]},
			"faces": {
				"north": {"uv": [0, 0, 8, 16], "texture": "#1"},
				"east": {"uv": [0, 0, 8, 16], "texture": "#1"},
				"south": {"uv": [0, 0, 8, 16], "texture": "#1"},
				"west": {"uv": [0, 0, 8, 16], "texture": "#1"},
				"up": {"uv": [8, 8, 16, 16], "texture": "#1"},
				"down": {"uv": [8, 0, 16, 8], "texture": "#1"}
			}
		},
		{
			"name": "crystal2",
			"from": [8.27518, 0.4, 7.2],
			"to": [10.27518, 4.4, 9.2],
			"rotation": {"angle": -45, "axis": "z", "origin": [10, 0, 9]},
			"faces": {
				"north": {"uv": [0, 0, 8, 16], "texture": "#1"},
				"east": {"uv": [0, 0, 8, 16], "texture": "#1"},
				"south": {"uv": [0, 0, 8, 16], "texture": "#1"},
				"west": {"uv": [0, 0, 8, 16], "texture": "#1"},
				"up": {"uv": [8, 8, 16, 16], "texture": "#1"},
				"down": {"uv": [8, 0, 16, 8], "texture": "#1"}
			}
		},
		{
			"name": "crystal3",
			"from": [6.8, 1.6, 5.5],
			"to": [8.8, 7.6, 7.5],
			"rotation": {"angle": -22.5, "axis": "x", "origin": [10, 0, 9]},
			"faces": {
				"north": {"uv": [0, 0, 8, 16], "texture": "#1"},
				"east": {"uv": [0, 0, 8, 16], "texture": "#1"},
				"south": {"uv": [0, 0, 8, 16], "texture": "#1"},
				"west": {"uv": [0, 0, 8, 16], "texture": "#1"},
				"up": {"uv": [8, 8, 16, 16], "texture": "#1"},
				"down": {"uv": [8, 0, 16, 8], "texture": "#1"}
			}
		},
		{
			"name": "crystal4",
			"from": [8, 1, 9],
			"to": [10, 5, 11],
			"rotation": {"angle": 22.5, "axis": "x", "origin": [10, 0, 9]},
			"faces": {
				"north": {"uv": [0, 0, 8, 16], "texture": "#1"},
				"east": {"uv": [0, 0, 8, 16], "texture": "#1"},
				"south": {"uv": [0, 0, 8, 16], "texture": "#1"},
				"west": {"uv": [0, 0, 8, 16], "texture": "#1"},
				"up": {"uv": [8, 8, 16, 16], "texture": "#1"},
				"down": {"uv": [8, 0, 16, 8], "texture": "#1"}
			}
		},
		{
			"name": "crystal5",
			"from": [7, 0, 7],
			"to": [9.5, 8, 9.5],
			"rotation": {"angle": 0, "axis": "y", "origin": [8, 16, 11]},
			"faces": {
				"north": {"uv": [0, 0, 8, 16], "texture": "#1"},
				"east": {"uv": [0, 0, 8, 16], "texture": "#1"},
				"south": {"uv": [0, 0, 8, 16], "texture": "#1"},
				"west": {"uv": [0, 0, 8, 16], "texture": "#1"},
				"up": {"uv": [8, 8, 16, 16], "texture": "#1"},
				"down": {"uv": [8, 0, 16, 8], "texture": "#1"}
			}
		}
	],
	"display": {
		"firstperson_lefthand": {
			"translation": [-1, 2.5, 1.25]
		},
		"ground": {
			"translation": [0, 9, 0],
			"scale": [2, 2, 2]
		}
	}
}