{
  "type": "minecraft:crafting_shaped",
  "pattern":
  [
    "  f",
    " b ",
    "   "
  ],
  "key":
  {
    "b" : {
      "item" : "galaxysedge:blueprint"
    },
    "f" : {
      "item" : "galaxysedge:focusing_lens"
    }
  },
  "result": {
    "item": "galaxysedge:emitter_blueprint",
    "count": 1
  }
}