{
  "result": {
    "item": "craftfallessentials:snowed_stone",
    "count": 4
  },
  "ingredients": [
    {
      "item": "minecraft:stone",
      "data": 0
    },
    {
      "item": "minecraft:stone",
      "data": 0
    },
    {
      "item": "minecraft:stone",
      "data": 0
    },
    {
      "item": "minecraft:snowball"
    }
  ],
  "conditions": [
    {
      "item": "craftfallessentials:snowed_stone",
      "type": "minecraft:item_exists"
    },
    {
      "item": "minecraft:stone",
      "type": "minecraft:item_exists"
    },
    {
      "item": "minecraft:snowball",
      "type": "minecraft:item_exists"
    }
  ],
  "type": "minecraft:crafting_shapeless"
}