{

  "type": "lucraftcore:recolor",
  
  "result": {
    "item": "craftfallessentials:snowbreaker"
  },

  "original": "heroesexpansion:stormbreaker",

  "ingredients": [
    {
      "item": "craftfallessentials:craftfall_badge"
    }
  ],

  "conditions": [
    {
      "item": "craftfallessentials:snowbreaker",
      "type": "minecraft:item_exists"
    },
    {
      "item": "heroesexpansion:stormbreaker",
      "type": "minecraft:item_exists"
    }
  ]

}