{
  "result": {
    "item": "craftfallessentials:b41_block",
    "count": 4
  },
  "ingredients": [
    {
      "item": "craftfallessentials:iron_light_cross"
    },
    {
      "item": "craftfallessentials:iron_light_cross"
    },
    {
      "item": "craftfallessentials:iron_light_cross"
    },
    {
      "item": "craftfallessentials:iron_light_cross"
    }
  ],
  "conditions": [
    {
      "item": "craftfallessentials:b41_block",
      "type": "minecraft:item_exists"
    },
    {
      "item": "craftfallessentials:iron_light_cross",
      "type": "minecraft:item_exists"
    }
  ],
  "type": "minecraft:crafting_shapeless",
  "group": "craftfallessentials:iron_lights"
}