{
  "result": {
    "item": "craftfallessentials:steel_divider_right",
    "count": 4
  },
  "ingredients": [
    {
      "item": "craftfallessentials:steel_divider_left"
    },
    {
      "item": "craftfallessentials:steel_divider_left"
    },
    {
      "item": "craftfallessentials:steel_divider_left"
    },
    {
      "item": "craftfallessentials:steel_divider_left"
    }
  ],
  "conditions": [
    {
      "item": "craftfallessentials:steel_divider_right",
      "type": "minecraft:item_exists"
    },
    {
      "item": "craftfallessentials:steel_divider_left",
      "type": "minecraft:item_exists"
    }
  ],
  "type": "minecraft:crafting_shapeless",
  "group": "craftfallessentials:steel_divider"
}