{
  "result": {
    "item": "craftfallessentials:steel_divider_horizontal",
    "count": 4
  },
  "ingredients": [
    {
      "item": "craftfallessentials:steel_divider_cross"
    },
    {
      "item": "craftfallessentials:steel_divider_cross"
    },
    {
      "item": "craftfallessentials:steel_divider_cross"
    },
    {
      "item": "craftfallessentials:steel_divider_cross"
    }
  ],
  "conditions": [
    {
      "item": "craftfallessentials:steel_divider_horizontal",
      "type": "minecraft:item_exists"
    },
    {
      "item": "craftfallessentials:steel_divider_cross",
      "type": "minecraft:item_exists"
    }
  ],
  "type": "minecraft:crafting_shapeless",
  "group": "craftfallessentials:steel_divider"
}