{
  "__comment": "Designed by Jedicus10 with Cubik Studio - https://cubik.studio",
  "textures": {
    "texture": "blocks/planks_oak"
  },
  "elements": [
    {
      "__comment": "Box1",
      "from": [
        1.5,
        0,
        17.5
      ],
      "to": [
        14.5,
        1,
        30.5
      ],
      "faces": {
        "down": {
          "uv": [
            0,
            9,
            7,
            16
          ],
          "texture": "#texture"
        },
        "up": {
          "uv": [
            0,
            9,
            7,
            16
          ],
          "texture": "#texture"
        },
        "north": {
          "uv": [
            0,
            9,
            7,
            10
          ],
          "texture": "#texture"
        },
        "south": {
          "uv": [
            0,
            15,
            7,
            16
          ],
          "texture": "#texture"
        },
        "west": {
          "uv": [
            0,
            9,
            1,
            16
          ],
          "texture": "#texture",
          "rotation": 90
        },
        "east": {
          "uv": [
            6,
            9,
            7,
            16
          ],
          "texture": "#texture",
          "rotation": 90
        }
      }
    },
    {
      "__comment": "Box2",
      "from": [
        2,
        1,
        19.25
      ],
      "to": [
        14,
        2,
        28.75
      ],
      "faces": {
        "down": {
          "uv": [
            7,
            10.5,
            13,
            15.5
          ],
          "texture": "#texture"
        },
        "up": {
          "uv": [
            7,
            11,
            13,
            15
          ],
          "texture": "#texture"
        },
        "north": {
          "uv": [
            7,
            11,
            13,
            12
          ],
          "texture": "#texture"
        },
        "south": {
          "uv": [
            7,
            14,
            13,
            15
          ],
          "texture": "#texture"
        },
        "west": {
          "uv": [
            7,
            11,
            8,
            15
          ],
          "texture": "#texture",
          "rotation": 90
        },
        "east": {
          "uv": [
            12,
            11,
            13,
            15
          ],
          "texture": "#texture",
          "rotation": 90
        }
      }
    },
    {
      "__comment": "Box3",
      "from": [
        3.25,
        0.875,
        18
      ],
      "to": [
        12.75,
        1.875,
        30
      ],
      "faces": {
        "down": {
          "uv": [
            7.5,
            10,
            12.5,
            16
          ],
          "texture": "#texture"
        },
        "up": {
          "uv": [
            8,
            10,
            12,
            16
          ],
          "texture": "#texture"
        },
        "north": {
          "uv": [
            8,
            10,
            12,
            11
          ],
          "texture": "#texture"
        },
        "south": {
          "uv": [
            8,
            15,
            12,
            16
          ],
          "texture": "#texture"
        },
        "west": {
          "uv": [
            7,
            10,
            8,
            16
          ],
          "texture": "#texture",
          "rotation": 90
        },
        "east": {
          "uv": [
            12,
            10,
            13,
            16
          ],
          "texture": "#texture",
          "rotation": 90
        }
      }
    },
    {
      "__comment": "Box4",
      "from": [
        2.25,
        0.75,
        18.25
      ],
      "to": [
        13.75,
        1.75,
        29.75
      ],
      "faces": {
        "down": {
          "uv": [
            7,
            10,
            13,
            16
          ],
          "texture": "#texture"
        },
        "up": {
          "uv": [
            7,
            10,
            13,
            16
          ],
          "texture": "#texture"
        },
        "north": {
          "uv": [
            7,
            10,
            13,
            11
          ],
          "texture": "#texture"
        },
        "south": {
          "uv": [
            7,
            15,
            13,
            16
          ],
          "texture": "#texture"
        },
        "west": {
          "uv": [
            7,
            10,
            8,
            16
          ],
          "texture": "#texture",
          "rotation": 90
        },
        "east": {
          "uv": [
            12,
            10,
            13,
            16
          ],
          "texture": "#texture",
          "rotation": 90
        }
      }
    },
    {
      "__comment": "Box5",
      "from": [
        0,
        0,
        -16
      ],
      "to": [
        16,
        1,
        0
      ],
      "faces": {
        "down": {
          "uv": [
            0,
            0,
            8,
            8
          ],
          "texture": "#texture"
        },
        "up": {
          "uv": [
            0,
            0,
            8,
            8
          ],
          "texture": "#texture"
        },
        "north": {
          "uv": [
            0,
            0,
            8,
            1
          ],
          "texture": "#texture"
        },
        "south": {
          "uv": [
            0,
            7,
            8,
            8
          ],
          "texture": "#texture"
        },
        "west": {
          "uv": [
            0,
            0,
            1,
            8
          ],
          "texture": "#texture",
          "rotation": 90
        },
        "east": {
          "uv": [
            7,
            0,
            8,
            8
          ],
          "texture": "#texture",
          "rotation": 90
        }
      }
    },
    {
      "__comment": "Box6",
      "from": [
        0.5,
        1,
        -15
      ],
      "to": [
        15.5,
        2,
        1
      ],
      "faces": {
        "down": {
          "uv": [
            8,
            0.5,
            15,
            7
          ],
          "texture": "#texture"
        },
        "up": {
          "uv": [
            8,
            0.5,
            15,
            7
          ],
          "texture": "#texture"
        },
        "north": {
          "uv": [
            8,
            0,
            15,
            1
          ],
          "texture": "#texture"
        },
        "south": {
          "uv": [
            8,
            6,
            15,
            7
          ],
          "texture": "#texture"
        },
        "west": {
          "uv": [
            8,
            0.5,
            9,
            7
          ],
          "texture": "#texture",
          "rotation": 90
        },
        "east": {
          "uv": [
            14,
            0.5,
            15,
            7
          ],
          "texture": "#texture",
          "rotation": 90
        }
      }
    },
    {
      "__comment": "Box7",
      "from": [
        1,
        0.875,
        -15.75
      ],
      "to": [
        15,
        1.875,
        -14.75
      ],
      "faces": {
        "down": {
          "uv": [
            8,
            0,
            15,
            1
          ],
          "texture": "#texture"
        },
        "up": {
          "uv": [
            8,
            0,
            15,
            1
          ],
          "texture": "#texture"
        },
        "north": {
          "uv": [
            8,
            0,
            15,
            1
          ],
          "texture": "#texture"
        },
        "south": {
          "uv": [
            8,
            0,
            15,
            1
          ],
          "texture": "#texture"
        },
        "west": {
          "uv": [
            8,
            0,
            9,
            1
          ],
          "texture": "#texture"
        },
        "east": {
          "uv": [
            14,
            0,
            15,
            1
          ],
          "texture": "#texture"
        }
      }
    },
    {
      "__comment": "Box8",
      "from": [
        3.5,
        1.375,
        -1.75
      ],
      "to": [
        12.5,
        2.375,
        25.75
      ],
      "faces": {
        "down": {
          "uv": [
            13,
            7,
            16,
            16
          ],
          "texture": "#texture"
        },
        "up": {
          "uv": [
            13,
            7,
            16,
            16
          ],
          "texture": "#texture"
        },
        "north": {
          "uv": [
            13,
            7,
            16,
            8
          ],
          "texture": "#texture"
        },
        "south": {
          "uv": [
            13,
            15,
            16,
            16
          ],
          "texture": "#texture"
        },
        "west": {
          "uv": [
            13,
            7,
            16,
            16
          ],
          "texture": "#texture",
          "rotation": 90
        },
        "east": {
          "uv": [
            13,
            7,
            16,
            16
          ],
          "texture": "#texture",
          "rotation": 90
        }
      }
    }
  ],
  "display": {
    "thirdperson_righthand": {
      "rotation": [
        85,
        0,
        0
      ],
      "translation": [
        0,
        -1,
        2
      ],
      "scale": [
        0.3,
        0.3,
        0.3
      ]
    },
    "thirdperson_lefthand": {
      "rotation": [
        85,
        0,
        0
      ],
      "translation": [
        0,
        -1,
        2
      ],
      "scale": [
        0.3,
        0.3,
        0.3
      ]
    },
    "firstperson_righthand": {
      "translation": [
        5,
        4,
        0
      ]
    },
    "firstperson_lefthand": {
      "translation": [
        5,
        4,
        0
      ]
    },
    "gui": {
      "rotation": [
        16,
        155,
        -5
      ],
      "translation": [
        0.5,
        3,
        0
      ],
      "scale": [
        0.5,
        0.5,
        0.5
      ]
    },
    "head": {
      "translation": [
        0,
        14.5,
        16
      ]
    },
    "ground": {
      "translation": [
        0,
        1,
        0
      ],
      "scale": [
        0.3,
        0.3,
        0.3
      ]
    },
    "fixed": {
      "rotation": [
        -90,
        90,
        0
      ],
      "translation": [
        0,
        0,
        -2.5
      ],
      "scale": [
        0.4,
        0.4,
        0.4
      ]
    }
  }
}