{
	"credit": "Made with Blockbench by dhi_awesome",
	"textures": {
		"0": "blocks/planks_jungle",
		"1": "blocks/planks_oak",
		"particle": "blocks/planks_jungle"
	},
	"elements": [
		{
			"from": [0.75, 0.75, 0.75],
			"to": [15.25, 15.25, 15.25],
			"faces": {
				"north": {"uv": [0.75, 0.75, 15.25, 15.25], "texture": "#0"},
				"east": {"uv": [15.25, 15.25, 0.75, 0.75], "texture": "#0"},
				"south": {"uv": [0.75, 0.75, 15.25, 15.25], "texture": "#0"},
				"west": {"uv": [0.75, 0.75, 15.25, 15.25], "texture": "#0"},
				"up": {"uv": [0.75, 0.75, 15.25, 15.25], "texture": "#0"},
				"down": {"uv": [0.75, 0.75, 15.25, 15.25], "texture": "#0"}
			}
		},
		{
			"from": [0, 0, 0],
			"to": [16, 1.25, 1.25],
			"faces": {
				"north": {"uv": [0, 14.75, 16, 16], "texture": "#1"},
				"east": {"uv": [16, 16, 14.75, 14.75], "texture": "#1"},
				"south": {"uv": [0, 14.75, 16, 16], "texture": "#1"},
				"west": {"uv": [0, 14.75, 1.25, 16], "texture": "#1"},
				"up": {"uv": [0, 0, 16, 1.25], "texture": "#1"},
				"down": {"uv": [0, 14.75, 16, 16], "texture": "#1"}
			}
		},
		{
			"from": [0, 0, 14.75],
			"to": [16, 1.25, 16],
			"faces": {
				"north": {"uv": [0, 14.75, 16, 16], "texture": "#1"},
				"east": {"uv": [1.25, 16, 0, 14.75], "texture": "#1"},
				"south": {"uv": [0, 14.75, 16, 16], "texture": "#1"},
				"west": {"uv": [14.75, 14.75, 16, 16], "texture": "#1"},
				"up": {"uv": [0, 14.75, 16, 16], "texture": "#1"},
				"down": {"uv": [0, 0, 16, 1.25], "texture": "#1"}
			}
		},
		{
			"from": [0, 14.75, 14.75],
			"to": [16, 16, 16],
			"faces": {
				"north": {"uv": [0, 0, 16, 1.25], "texture": "#1"},
				"east": {"uv": [1.25, 1.25, 0, 0], "texture": "#1"},
				"south": {"uv": [0, 0, 16, 1.25], "texture": "#1"},
				"west": {"uv": [14.75, 0, 16, 1.25], "texture": "#1"},
				"up": {"uv": [0, 14.75, 16, 16], "texture": "#1"},
				"down": {"uv": [0, 0, 16, 1.25], "texture": "#1"}
			}
		},
		{
			"from": [0, 14.75, 0],
			"to": [16, 16, 1.25],
			"faces": {
				"north": {"uv": [0, 0, 16, 1.25], "texture": "#1"},
				"east": {"uv": [16, 1.25, 14.75, 0], "texture": "#1"},
				"south": {"uv": [0, 0, 16, 1.25], "texture": "#1"},
				"west": {"uv": [0, 0, 1.25, 1.25], "texture": "#1"},
				"up": {"uv": [0, 0, 16, 1.25], "texture": "#1"},
				"down": {"uv": [0, 14.75, 16, 16], "texture": "#1"}
			}
		},
		{
			"from": [0, 0, 1.25],
			"to": [1.25, 1.25, 14.75],
			"faces": {
				"north": {"uv": [14.75, 14.75, 16, 16], "texture": "#1"},
				"east": {"uv": [14.75, 16, 1.25, 14.75], "texture": "#1"},
				"south": {"uv": [0, 14.75, 1.25, 16], "texture": "#1"},
				"west": {"uv": [1.25, 14.75, 14.75, 16], "texture": "#1"},
				"up": {"uv": [0, 1.25, 1.25, 14.75], "texture": "#1"},
				"down": {"uv": [0, 1.25, 1.25, 14.75], "rotation": 270, "texture": "#1"}
			}
		},
		{
			"from": [14.75, 0, 1.25],
			"to": [16, 1.25, 14.75],
			"faces": {
				"north": {"uv": [0, 14.75, 1.25, 16], "texture": "#1"},
				"east": {"uv": [14.75, 16, 1.25, 14.75], "texture": "#1"},
				"south": {"uv": [14.75, 14.75, 16, 16], "texture": "#1"},
				"west": {"uv": [1.25, 14.75, 14.75, 16], "texture": "#1"},
				"up": {"uv": [14.75, 1.25, 16, 14.75], "texture": "#1"},
				"down": {"uv": [14.75, 1.25, 16, 14.75], "rotation": 270, "texture": "#1"}
			}
		},
		{
			"from": [0, 14.75, 1.25],
			"to": [1.25, 16, 14.75],
			"faces": {
				"north": {"uv": [14.75, 0, 16, 1.25], "texture": "#1"},
				"east": {"uv": [14.75, 1.25, 1.25, 0], "texture": "#1"},
				"south": {"uv": [0, 0, 1.25, 1.25], "texture": "#1"},
				"west": {"uv": [1.25, 0, 14.75, 1.25], "texture": "#1"},
				"up": {"uv": [0, 1.25, 1.25, 14.75], "texture": "#1"},
				"down": {"uv": [0, 1.25, 1.25, 14.75], "rotation": 270, "texture": "#1"}
			}
		},
		{
			"from": [14.75, 14.75, 1.25],
			"to": [16, 16, 14.75],
			"faces": {
				"north": {"uv": [0, 0, 1.25, 1.25], "texture": "#1"},
				"east": {"uv": [14.75, 1.25, 1.25, 0], "texture": "#1"},
				"south": {"uv": [14.75, 0, 16, 1.25], "texture": "#1"},
				"west": {"uv": [1.25, 0, 14.75, 1.25], "texture": "#1"},
				"up": {"uv": [14.75, 1.25, 16, 14.75], "texture": "#1"},
				"down": {"uv": [14.75, 1.25, 16, 14.75], "rotation": 270, "texture": "#1"}
			}
		},
		{
			"from": [0, 1.25, 0],
			"to": [1.25, 14.75, 1.25],
			"faces": {
				"north": {"uv": [14.75, 1.25, 16, 14.75], "texture": "#1"},
				"east": {"uv": [16, 14.75, 14.75, 1.25], "texture": "#1"},
				"south": {"uv": [0, 1.25, 1.25, 14.75], "texture": "#1"},
				"west": {"uv": [0, 1.25, 1.25, 14.75], "texture": "#1"},
				"up": {"uv": [0, 0, 1.25, 1.25], "texture": "#1"},
				"down": {"uv": [0, 14.75, 1.25, 16], "texture": "#1"}
			}
		},
		{
			"from": [0, 1.25, 14.75],
			"to": [1.25, 14.75, 16],
			"faces": {
				"north": {"uv": [14.75, 1.25, 16, 14.75], "texture": "#1"},
				"east": {"uv": [1.25, 14.75, 0, 1.25], "texture": "#1"},
				"south": {"uv": [0, 1.25, 1.25, 14.75], "texture": "#1"},
				"west": {"uv": [14.75, 1.25, 16, 14.75], "texture": "#1"},
				"up": {"uv": [0, 14.75, 1.25, 16], "texture": "#1"},
				"down": {"uv": [0, 0, 1.25, 1.25], "texture": "#1"}
			}
		},
		{
			"from": [14.75, 1.25, 14.75],
			"to": [16, 14.75, 16],
			"faces": {
				"north": {"uv": [0, 1.25, 1.25, 14.75], "texture": "#1"},
				"east": {"uv": [1.25, 14.75, 0, 1.25], "texture": "#1"},
				"south": {"uv": [14.75, 1.25, 16, 14.75], "texture": "#1"},
				"west": {"uv": [14.75, 1.25, 16, 14.75], "texture": "#1"},
				"up": {"uv": [14.75, 14.75, 16, 16], "texture": "#1"},
				"down": {"uv": [14.75, 0, 16, 1.25], "texture": "#1"}
			}
		},
		{
			"from": [14.75, 1.25, 0],
			"to": [16, 14.75, 1.25],
			"faces": {
				"north": {"uv": [0, 1.25, 1.25, 14.75], "texture": "#1"},
				"east": {"uv": [16, 14.75, 14.75, 1.25], "texture": "#1"},
				"south": {"uv": [14.75, 1.25, 16, 14.75], "texture": "#1"},
				"west": {"uv": [0, 1.25, 1.25, 14.75], "texture": "#1"},
				"up": {"uv": [14.75, 0, 16, 1.25], "texture": "#1"},
				"down": {"uv": [14.75, 14.75, 16, 16], "texture": "#1"}
			}
		},
		{
			"from": [-1.5, 15, 7.25],
			"to": [17.5, 15.75, 9],
			"rotation": {"angle": -45, "axis": "y", "origin": [8, 8, 8]},
			"faces": {
				"north": {"uv": [0, 0.25, 16, 1], "texture": "#1"},
				"east": {"uv": [8.75, 1, 7, 0.25], "texture": "#1"},
				"south": {"uv": [0, 0.25, 16, 1], "texture": "#1"},
				"west": {"uv": [7.25, 0.25, 9, 1], "texture": "#1"},
				"up": {"uv": [0, 0, 15, 3], "texture": "#1"},
				"down": {"uv": [0, 8, 15, 11], "texture": "#1"}
			}
		},
		{
			"from": [-1.5, 0.25, 7.25],
			"to": [17.5, 1, 9],
			"rotation": {"angle": -45, "axis": "y", "origin": [8, 8, 8]},
			"faces": {
				"north": {"uv": [0, 0.25, 16, 1], "texture": "#1"},
				"east": {"uv": [8.75, 1, 7, 0.25], "texture": "#1"},
				"south": {"uv": [0, 0.25, 16, 1], "texture": "#1"},
				"west": {"uv": [7.25, 0.25, 9, 1], "texture": "#1"},
				"up": {"uv": [0, 0, 15, 3], "texture": "#1"},
				"down": {"uv": [0, 8, 15, 11], "texture": "#1"}
			}
		},
		{
			"from": [-1.5, 7, 0.25],
			"to": [17.5, 8.75, 1],
			"rotation": {"angle": 45, "axis": "z", "origin": [8, 8, 8]},
			"faces": {
				"north": {"uv": [0, 0, 15, 3], "texture": "#1"},
				"east": {"uv": [15.75, 9, 15, 7.25], "texture": "#1"},
				"south": {"uv": [0, 8, 15, 11], "texture": "#1"},
				"west": {"uv": [0.25, 7.25, 1, 9], "texture": "#1"},
				"up": {"uv": [0, 0.25, 16, 1], "texture": "#1"},
				"down": {"uv": [0, 15, 16, 15.75], "texture": "#1"}
			}
		},
		{
			"from": [-1.5, 7, 15],
			"to": [17.5, 8.75, 15.75],
			"rotation": {"angle": 45, "axis": "z", "origin": [8, 8, 8]},
			"faces": {
				"north": {"uv": [0, 0, 15, 3], "texture": "#1"},
				"east": {"uv": [15.75, 9, 15, 7.25], "texture": "#1"},
				"south": {"uv": [0, 8, 15, 11], "texture": "#1"},
				"west": {"uv": [0.25, 7.25, 1, 9], "texture": "#1"},
				"up": {"uv": [0, 0.25, 16, 1], "texture": "#1"},
				"down": {"uv": [0, 15, 16, 15.75], "texture": "#1"}
			}
		},
		{
			"from": [15, 7, -1.5],
			"to": [15.75, 8.75, 17.5],
			"rotation": {"angle": -45, "axis": "x", "origin": [8, 8, 8]},
			"faces": {
				"north": {"uv": [0.25, 7.25, 1, 9], "texture": "#1"},
				"east": {"uv": [0, 0, 15, 3], "texture": "#1"},
				"south": {"uv": [0, 0, 0.75, 1.75], "texture": "#1"},
				"west": {"uv": [0, 8, 15, 11], "texture": "#1"},
				"up": {"uv": [0, 0, 0.75, 16], "texture": "#1"},
				"down": {"uv": [0, 0, 0.75, 16], "texture": "#1"}
			}
		},
		{
			"from": [0.25, 7, -1.5],
			"to": [1, 8.75, 17.5],
			"rotation": {"angle": -45, "axis": "x", "origin": [8, 8, 8]},
			"faces": {
				"north": {"uv": [0.25, 7.25, 1, 9], "texture": "#1"},
				"east": {"uv": [0, 0, 15, 3], "texture": "#1"},
				"south": {"uv": [0, 0, 0.75, 1.75], "texture": "#1"},
				"west": {"uv": [0, 8, 15, 11], "texture": "#1"},
				"up": {"uv": [0, 0, 0.75, 16], "texture": "#1"},
				"down": {"uv": [0, 0, 0.75, 16], "texture": "#1"}
			}
		}
	],
	"display": {
		"thirdperson_righthand": {
			"scale": [0.375, 0.375, 0.375],
			"translation": [0, 2.5, 0],
			"rotation": [75, 45, 0]
		},
		"thirdperson_lefthand": {
			"scale": [0.375, 0.375, 0.375],
			"rotation": [75, 45, 0],
			"translation": [0, 2.5, 0]
		},
		"firstperson_righthand": {
			"scale": [0.4, 0.4, 0.4],
			"rotation": [0, 45, 0],
			"translation": [0, 0, 0]
		},
		"firstperson_lefthand": {
			"scale": [0.4, 0.4, 0.4],
			"rotation": [0, 45, 0],
			"translation": [0, 0, 0]
		},
		"ground": {
			"scale": [0.25, 0.25, 0.25],
			"translation": [0, 3, 0],
			"rotation": [0, 0, 0]
		},
		"fixed": {
			"scale": [0.5, 0.5, 0.5],
			"rotation": [0, 0, 0],
			"translation": [0, 0, 0]
		},
		"gui": {
			"scale": [0.625, 0.625, 0.625],
			"rotation": [30, 225, 0],
			"translation": [0, 0, 0]
		}
	}
}