{
    "variants": {
        "facing=north": { "model": "craftfallessentials:shelf" },
        "facing=south": { "model": "craftfallessentials:shelf", "y": 180 },
        "facing=west":  { "model": "craftfallessentials:shelf", "y": 270 },
        "facing=east":  { "model": "craftfallessentials:shelf", "y": 90 }
    }
}