{

  "type": "lucraftcore:recolor",
  
  "result": {
    "item": "craftfallessentials:ultimate_frostnir"
  },

  "original": "heroesexpansion:ultimate_mjolnir",

  "ingredients": [
    {
      "item": "craftfallessentials:craftfall_badge"
    }
  ],

  "conditions": [
    {
      "item": "craftfallessentials:ultimate_frostnir",
      "type": "minecraft:item_exists"
    },
    {
      "item": "heroesexpansion:ultimate_mjolnir",
      "type": "minecraft:item_exists"
    }
  ]

}