{
  "result": {
    "item": "craftfallessentials:b13_block",
    "count": 4
  },
  "ingredients": [
    {
      "item": "craftfallessentials:b12_block"
    },
    {
      "item": "craftfallessentials:b12_block"
    },
    {
      "item": "craftfallessentials:b12_block"
    },
    {
      "item": "craftfallessentials:b12_block"
    }
  ],
  "conditions": [
    {
      "item": "craftfallessentials:b13_block",
      "type": "minecraft:item_exists"
    },
    {
      "item": "craftfallessentials:b12_block",
      "type": "minecraft:item_exists"
    }
  ],
  "type": "minecraft:crafting_shapeless",
  "group": "craftfallessentials:iron_accents"
}