{
  "result": {
    "item": "craftfallessentials:steel_light_ne",
    "count": 4
  },
  "ingredients": [
    {
      "item": "craftfallessentials:steel_light_we"
    },
    {
      "item": "craftfallessentials:steel_light_we"
    },
    {
      "item": "craftfallessentials:steel_light_we"
    },
    {
      "item": "craftfallessentials:steel_light_we"
    }
  ],
  "conditions": [
    {
      "item": "craftfallessentials:steel_light_ne",
      "type": "minecraft:item_exists"
    },
    {
      "item": "craftfallessentials:steel_light_we",
      "type": "minecraft:item_exists"
    }
  ],
  "type": "minecraft:crafting_shapeless",
  "group": "craftfallessentials:steel_lights"
}