{
  "type": "minecraft:crafting_shapeless",
  "ingredients": [
    {
      "item": "craftablecomforts:candle"
    },
    {
      "tag": "forge:dyes/light_gray"
    }
  ],
  "result": {
    "item": "craftablecomforts:light_gray_candle"
  }
}