{
  "parent": "minecraft:recipes/root",
  "rewards": {
    "recipes": [
      "craftablecomforts:cyan_candle"
    ]
  },
  "criteria": {
    "has_dyes/cyan": {
      "trigger": "minecraft:inventory_changed",
      "conditions": {
        "items": [
          {
            "tag": "forge:dyes/cyan"
          }
        ]
      }
    },
    "has_the_recipe": {
      "trigger": "minecraft:recipe_unlocked",
      "conditions": {
        "recipe": "craftablecomforts:cyan_candle"
      }
    }
  },
  "requirements": [
    [
      "has_dyes/cyan",
      "has_the_recipe"
    ]
  ]
}