{
  "parent": "craftablecomforts:block/template_four_candles",
  "textures": {
    "all": "craftablecomforts:block/light_gray_candle",
    "particle": "craftablecomforts:block/light_gray_candle"
  }
}