{
  "multipart": [
    {
      "apply": {
        "model": "craftablecomforts:block/wave_railing_post_ends"
      }
    },
    {
      "when": {
        "north": false,
        "east": false,
        "south": false,
        "west": false
      },
      "apply": {
        "model": "craftablecomforts:block/wave_railing_post"
      }
    },
    {
      "when": {
        "north": true,
        "east": false,
        "south": false,
        "west": false
      },
      "apply": {
        "model": "craftablecomforts:block/wave_railing_cap"
      }
    },
    {
      "when": {
        "north": false,
        "east": true,
        "south": false,
        "west": false
      },
      "apply": {
        "model": "craftablecomforts:block/wave_railing_cap",
        "y": 90
      }
    },
    {
      "when": {
        "north": false,
        "east": false,
        "south": true,
        "west": false
      },
      "apply": {
        "model": "craftablecomforts:block/wave_railing_cap_alt"
      }
    },
    {
      "when": {
        "north": false,
        "east": false,
        "south": false,
        "west": true
      },
      "apply": {
        "model": "craftablecomforts:block/wave_railing_cap_alt",
        "y": 90
      }
    },
    {
      "when": {
        "north": true
      },
      "apply": {
        "model": "craftablecomforts:block/wave_railing_side"
      }
    },
    {
      "when": {
        "east": true
      },
      "apply": {
        "model": "craftablecomforts:block/wave_railing_side",
        "y": 90
      }
    },
    {
      "when": {
        "south": true
      },
      "apply": {
        "model": "craftablecomforts:block/wave_railing_side_alt"
      }
    },
    {
      "when": {
        "west": true
      },
      "apply": {
        "model": "craftablecomforts:block/wave_railing_side_alt",
        "y": 90
      }
    }
  ]
}
