{
  "type": "minecraft:block",
  "pools": [
    {
      "name": "craftablecomforts:acacia_crate",
      "rolls": 1,
      "entries": [
        {
          "type": "minecraft:item",
          "functions": [
            {
              "function": "minecraft:copy_name",
              "source": "block_entity"
            }
          ],
          "name": "craftablecomforts:acacia_crate"
        }
      ],
      "conditions": [
        {
          "condition": "minecraft:survives_explosion"
        }
      ]
    }
  ]
}