{
  "parent": "craftablecomforts:block/template_cake_with_candle",
  "textures": {
    "candle": "craftablecomforts:block/green_candle",
    "bottom": "block/cake_bottom",
    "side": "block/cake_side",
    "top": "block/cake_top",
    "particle": "block/cake_side"
  }
}