{
	"type": "threecore:armor",
	
	"properties": {
		"group": "suits_and_armor"
	},
	
	"slot": "head",
	
	"armor_material": "leather",
	
	"abilities": {
		"opening": {
			"ability": "threecore:opening_nbt_timer",
			"max_timer": 1,
			"icon": {
				"type": "threecore:item",
				"item": "pymtech:ant_man_helmet"
			},
			"conditions": [
				{
					"type": "threecore:action",
					"enabling": true
				},
				{
					"type": "threecore:equipment_slot",
					"slot": "head"
				}
			],
			"additional_data": {
				"pymtech:helmet_sound": true
			}
		}
	},
	
	"layers": "pymtech:ant_man_helmet"
}