{
  "parent": "minecraft:recipes/root",
  "rewards": {
    "recipes": [
      "pymtech:wasp_tier2_helmet"
    ]
  },
  "criteria": {
    "has_steel": {
      "trigger": "minecraft:inventory_changed",
      "conditions": {
        "items": [
          {
            "tag": "forge:ingots/steel"
          }
        ]
      }
    },
    "has_the_recipe": {
      "trigger": "minecraft:recipe_unlocked",
      "conditions": {
        "recipe": "pymtech:wasp_tier2_helmet"
      }
    }
  },
  "requirements": [
    [
      "has_steel",
      "has_the_recipe"
    ]
  ]
}