{
    "variants": {
        "facing=north": { "model": "pymtech:block/structure_shrinker" },
        "facing=south": { "model": "pymtech:block/structure_shrinker", "y": 180 },
        "facing=west":  { "model": "pymtech:block/structure_shrinker", "y": 270 },
        "facing=east":  { "model": "pymtech:block/structure_shrinker", "y": 90 }
    }
}
