{
  "type": "minecraft:crafting_shaped",
  "pattern": [
    "PP ",
    "PRG",
    " II"
  ],
  "key": {
    "P": {
      "tag": "forge:plates/iron"
    },
    "R": {
      "tag": "forge:dusts/redstone"
    },
    "G": {
      "tag": "forge:dusts/glowstone"
    },
    "I": {
      "tag": "forge:ingots/iron"
    }
  },
  "result": {
    "item": "pymtech:emp_communication_device"
  }
}