<mxfile host="app.diagrams.net" agent="Mozilla/5.0 (Windows NT 10.0; Win64; x64; rv:131.0) Gecko/20100101 Firefox/131.0" version="24.8.0">
  <diagram name="Seite-1" id="Mbc_QkeREteKK8Hx-Ld3">
    <mxGraphModel dx="683" dy="407" grid="0" gridSize="10" guides="1" tooltips="1" connect="1" arrows="1" fold="1" page="1" pageScale="1" pageWidth="827" pageHeight="1169" math="0" shadow="0">
      <root>
        <mxCell id="0" />
        <mxCell id="1" parent="0" />
        <mxCell id="1eC-E_-9BSWqRnGS_nTG-1" value="Trigger" style="swimlane;fontStyle=0;childLayout=stackLayout;horizontal=1;startSize=30;horizontalStack=0;resizeParent=1;resizeParentMax=0;resizeLast=0;collapsible=1;marginBottom=0;whiteSpace=wrap;html=1;fillColor=#1ba1e2;fontColor=#ffffff;strokeColor=#006EAF;" parent="1" vertex="1">
          <mxGeometry x="130" y="330" width="140" height="60" as="geometry">
            <mxRectangle x="130" y="330" width="80" height="30" as="alternateBounds" />
          </mxGeometry>
        </mxCell>
        <mxCell id="1eC-E_-9BSWqRnGS_nTG-2" value="Zyklisch jede Nacht..." style="text;strokeColor=none;fillColor=none;align=left;verticalAlign=middle;spacingLeft=4;spacingRight=4;overflow=hidden;points=[[0,0.5],[1,0.5]];portConstraint=eastwest;rotatable=0;whiteSpace=wrap;html=1;" parent="1eC-E_-9BSWqRnGS_nTG-1" vertex="1">
          <mxGeometry y="30" width="140" height="30" as="geometry" />
        </mxCell>
        <mxCell id="1eC-E_-9BSWqRnGS_nTG-9" value="Vorgang / Funktion" style="swimlane;fontStyle=0;childLayout=stackLayout;horizontal=1;startSize=30;horizontalStack=0;resizeParent=1;resizeParentMax=0;resizeLast=0;collapsible=1;marginBottom=0;whiteSpace=wrap;html=1;fillColor=#60a917;fontColor=#ffffff;strokeColor=#2D7600;" parent="1" vertex="1">
          <mxGeometry x="130" y="440" width="140" height="140" as="geometry" />
        </mxCell>
        <mxCell id="1eC-E_-9BSWqRnGS_nTG-10" value="sollen genehmigte Dienstreisen in den Personio Kalender eingefügt werden" style="text;strokeColor=none;fillColor=none;align=left;verticalAlign=middle;spacingLeft=4;spacingRight=4;overflow=hidden;points=[[0,0.5],[1,0.5]];portConstraint=eastwest;rotatable=0;whiteSpace=wrap;html=1;" parent="1eC-E_-9BSWqRnGS_nTG-9" vertex="1">
          <mxGeometry y="30" width="140" height="110" as="geometry" />
        </mxCell>
        <mxCell id="1eC-E_-9BSWqRnGS_nTG-13" value="Visualisierung" style="swimlane;fontStyle=0;childLayout=stackLayout;horizontal=1;startSize=30;horizontalStack=0;resizeParent=1;resizeParentMax=0;resizeLast=0;collapsible=1;marginBottom=0;whiteSpace=wrap;html=1;fillColor=#d80073;fontColor=#ffffff;strokeColor=#A50040;" parent="1" vertex="1">
          <mxGeometry x="130" y="640" width="140" height="110" as="geometry" />
        </mxCell>
        <mxCell id="1eC-E_-9BSWqRnGS_nTG-14" value="In Personio - keine zusätzliche Visualisierung erforderlich" style="text;strokeColor=none;fillColor=none;align=left;verticalAlign=middle;spacingLeft=4;spacingRight=4;overflow=hidden;points=[[0,0.5],[1,0.5]];portConstraint=eastwest;rotatable=0;whiteSpace=wrap;html=1;" parent="1eC-E_-9BSWqRnGS_nTG-13" vertex="1">
          <mxGeometry y="30" width="140" height="80" as="geometry" />
        </mxCell>
        <mxCell id="q0hTp9g1ltpsEYyW7GZH-1" value="" style="triangle;whiteSpace=wrap;html=1;fillColor=#1ba1e2;fontColor=#ffffff;strokeColor=#006EAF;rotation=90;" vertex="1" parent="1">
          <mxGeometry x="180" y="370" width="30" height="90" as="geometry" />
        </mxCell>
        <mxCell id="q0hTp9g1ltpsEYyW7GZH-2" value="" style="triangle;whiteSpace=wrap;html=1;fillColor=#60a917;fontColor=#ffffff;strokeColor=#2D7600;rotation=90;" vertex="1" parent="1">
          <mxGeometry x="179" y="550" width="30" height="120" as="geometry" />
        </mxCell>
        <mxCell id="q0hTp9g1ltpsEYyW7GZH-6" value="Trigger" style="swimlane;fontStyle=0;childLayout=stackLayout;horizontal=1;startSize=30;horizontalStack=0;resizeParent=1;resizeParentMax=0;resizeLast=0;collapsible=1;marginBottom=0;whiteSpace=wrap;html=1;fillColor=#1ba1e2;fontColor=#ffffff;strokeColor=#006EAF;" vertex="1" parent="1">
          <mxGeometry x="350" y="330" width="140" height="60" as="geometry">
            <mxRectangle x="130" y="330" width="80" height="30" as="alternateBounds" />
          </mxGeometry>
        </mxCell>
        <mxCell id="q0hTp9g1ltpsEYyW7GZH-7" value="Zyklisch jede Nacht..." style="text;strokeColor=none;fillColor=none;align=left;verticalAlign=middle;spacingLeft=4;spacingRight=4;overflow=hidden;points=[[0,0.5],[1,0.5]];portConstraint=eastwest;rotatable=0;whiteSpace=wrap;html=1;" vertex="1" parent="q0hTp9g1ltpsEYyW7GZH-6">
          <mxGeometry y="30" width="140" height="30" as="geometry" />
        </mxCell>
        <mxCell id="q0hTp9g1ltpsEYyW7GZH-8" value="Vorgang / Funktion" style="swimlane;fontStyle=0;childLayout=stackLayout;horizontal=1;startSize=30;horizontalStack=0;resizeParent=1;resizeParentMax=0;resizeLast=0;collapsible=1;marginBottom=0;whiteSpace=wrap;html=1;fillColor=#60a917;fontColor=#ffffff;strokeColor=#2D7600;" vertex="1" parent="1">
          <mxGeometry x="350" y="440" width="140" height="140" as="geometry" />
        </mxCell>
        <mxCell id="q0hTp9g1ltpsEYyW7GZH-9" value="sollen Actions aus SPARC, Monday, LPA... in eine zugriffsgeschützte Seite in Confluence eingespielt werden" style="text;strokeColor=none;fillColor=none;align=left;verticalAlign=middle;spacingLeft=4;spacingRight=4;overflow=hidden;points=[[0,0.5],[1,0.5]];portConstraint=eastwest;rotatable=0;whiteSpace=wrap;html=1;" vertex="1" parent="q0hTp9g1ltpsEYyW7GZH-8">
          <mxGeometry y="30" width="140" height="110" as="geometry" />
        </mxCell>
        <mxCell id="q0hTp9g1ltpsEYyW7GZH-10" value="Visualisierung" style="swimlane;fontStyle=0;childLayout=stackLayout;horizontal=1;startSize=30;horizontalStack=0;resizeParent=1;resizeParentMax=0;resizeLast=0;collapsible=1;marginBottom=0;whiteSpace=wrap;html=1;fillColor=#d80073;fontColor=#ffffff;strokeColor=#A50040;" vertex="1" parent="1">
          <mxGeometry x="350" y="640" width="140" height="110" as="geometry" />
        </mxCell>
        <mxCell id="q0hTp9g1ltpsEYyW7GZH-11" value="und über" style="text;strokeColor=none;fillColor=none;align=left;verticalAlign=middle;spacingLeft=4;spacingRight=4;overflow=hidden;points=[[0,0.5],[1,0.5]];portConstraint=eastwest;rotatable=0;whiteSpace=wrap;html=1;" vertex="1" parent="q0hTp9g1ltpsEYyW7GZH-10">
          <mxGeometry y="30" width="140" height="80" as="geometry" />
        </mxCell>
        <mxCell id="q0hTp9g1ltpsEYyW7GZH-12" value="" style="triangle;whiteSpace=wrap;html=1;fillColor=#1ba1e2;fontColor=#ffffff;strokeColor=#006EAF;rotation=90;" vertex="1" parent="1">
          <mxGeometry x="400" y="370" width="30" height="90" as="geometry" />
        </mxCell>
        <mxCell id="q0hTp9g1ltpsEYyW7GZH-13" value="" style="triangle;whiteSpace=wrap;html=1;fillColor=#60a917;fontColor=#ffffff;strokeColor=#2D7600;rotation=90;" vertex="1" parent="1">
          <mxGeometry x="399" y="550" width="30" height="120" as="geometry" />
        </mxCell>
        <mxCell id="q0hTp9g1ltpsEYyW7GZH-14" value="Trigger" style="swimlane;fontStyle=0;childLayout=stackLayout;horizontal=1;startSize=30;horizontalStack=0;resizeParent=1;resizeParentMax=0;resizeLast=0;collapsible=1;marginBottom=0;whiteSpace=wrap;html=1;fillColor=#1ba1e2;fontColor=#ffffff;strokeColor=#006EAF;" vertex="1" parent="1">
          <mxGeometry x="130" y="870" width="140" height="110" as="geometry">
            <mxRectangle x="130" y="330" width="80" height="30" as="alternateBounds" />
          </mxGeometry>
        </mxCell>
        <mxCell id="q0hTp9g1ltpsEYyW7GZH-15" value="&lt;div&gt;Zyklischer Trigger&lt;/div&gt;&lt;div&gt;&lt;br&gt;&lt;/div&gt;" style="text;strokeColor=none;fillColor=none;align=left;verticalAlign=middle;spacingLeft=4;spacingRight=4;overflow=hidden;points=[[0,0.5],[1,0.5]];portConstraint=eastwest;rotatable=0;whiteSpace=wrap;html=1;" vertex="1" parent="q0hTp9g1ltpsEYyW7GZH-14">
          <mxGeometry y="30" width="140" height="80" as="geometry" />
        </mxCell>
        <mxCell id="q0hTp9g1ltpsEYyW7GZH-16" value="Vorgang / Funktion" style="swimlane;fontStyle=0;childLayout=stackLayout;horizontal=1;startSize=30;horizontalStack=0;resizeParent=1;resizeParentMax=0;resizeLast=0;collapsible=1;marginBottom=0;whiteSpace=wrap;html=1;fillColor=#60a917;fontColor=#ffffff;strokeColor=#2D7600;" vertex="1" parent="1">
          <mxGeometry x="348" y="870" width="140" height="110" as="geometry" />
        </mxCell>
        <mxCell id="q0hTp9g1ltpsEYyW7GZH-17" value="Ausführung desautomatisierten Vorgange auf Spherea-Server (exe)" style="text;strokeColor=none;fillColor=none;align=left;verticalAlign=middle;spacingLeft=4;spacingRight=4;overflow=hidden;points=[[0,0.5],[1,0.5]];portConstraint=eastwest;rotatable=0;whiteSpace=wrap;html=1;" vertex="1" parent="q0hTp9g1ltpsEYyW7GZH-16">
          <mxGeometry y="30" width="140" height="80" as="geometry" />
        </mxCell>
        <mxCell id="q0hTp9g1ltpsEYyW7GZH-18" value="Visualisierung" style="swimlane;fontStyle=0;childLayout=stackLayout;horizontal=1;startSize=30;horizontalStack=0;resizeParent=1;resizeParentMax=0;resizeLast=0;collapsible=1;marginBottom=0;whiteSpace=wrap;html=1;fillColor=#d80073;fontColor=#ffffff;strokeColor=#A50040;" vertex="1" parent="1">
          <mxGeometry x="560" y="870" width="140" height="110" as="geometry" />
        </mxCell>
        <mxCell id="q0hTp9g1ltpsEYyW7GZH-19" value="Darstellung in SPARC" style="text;strokeColor=none;fillColor=none;align=left;verticalAlign=middle;spacingLeft=4;spacingRight=4;overflow=hidden;points=[[0,0.5],[1,0.5]];portConstraint=eastwest;rotatable=0;whiteSpace=wrap;html=1;" vertex="1" parent="q0hTp9g1ltpsEYyW7GZH-18">
          <mxGeometry y="30" width="140" height="80" as="geometry" />
        </mxCell>
        <mxCell id="q0hTp9g1ltpsEYyW7GZH-20" value="" style="triangle;whiteSpace=wrap;html=1;fillColor=#1ba1e2;fontColor=#ffffff;strokeColor=#006EAF;rotation=0;" vertex="1" parent="1">
          <mxGeometry x="279" y="902" width="30" height="70" as="geometry" />
        </mxCell>
        <mxCell id="q0hTp9g1ltpsEYyW7GZH-21" value="" style="triangle;whiteSpace=wrap;html=1;fillColor=#60a917;fontColor=#ffffff;strokeColor=#2D7600;rotation=0;" vertex="1" parent="1">
          <mxGeometry x="498" y="900" width="30" height="70" as="geometry" />
        </mxCell>
        <mxCell id="q0hTp9g1ltpsEYyW7GZH-22" value="Trigger" style="swimlane;fontStyle=0;childLayout=stackLayout;horizontal=1;startSize=30;horizontalStack=0;resizeParent=1;resizeParentMax=0;resizeLast=0;collapsible=1;marginBottom=0;whiteSpace=wrap;html=1;fillColor=#1ba1e2;fontColor=#ffffff;strokeColor=#006EAF;" vertex="1" parent="1">
          <mxGeometry x="130" y="1010" width="140" height="130" as="geometry">
            <mxRectangle x="130" y="330" width="80" height="30" as="alternateBounds" />
          </mxGeometry>
        </mxCell>
        <mxCell id="q0hTp9g1ltpsEYyW7GZH-23" value="&lt;div&gt;Jede Nacht um 2:00 &lt;br&gt;&lt;/div&gt;" style="text;strokeColor=none;fillColor=none;align=left;verticalAlign=middle;spacingLeft=4;spacingRight=4;overflow=hidden;points=[[0,0.5],[1,0.5]];portConstraint=eastwest;rotatable=0;whiteSpace=wrap;html=1;" vertex="1" parent="q0hTp9g1ltpsEYyW7GZH-22">
          <mxGeometry y="30" width="140" height="100" as="geometry" />
        </mxCell>
        <mxCell id="q0hTp9g1ltpsEYyW7GZH-24" value="Vorgang / Funktion" style="swimlane;fontStyle=0;childLayout=stackLayout;horizontal=1;startSize=30;horizontalStack=0;resizeParent=1;resizeParentMax=0;resizeLast=0;collapsible=1;marginBottom=0;whiteSpace=wrap;html=1;fillColor=#60a917;fontColor=#ffffff;strokeColor=#2D7600;" vertex="1" parent="1">
          <mxGeometry x="348" y="1010" width="140" height="130" as="geometry" />
        </mxCell>
        <mxCell id="q0hTp9g1ltpsEYyW7GZH-25" value="sollen Actions aus SPARC, Monday, LPA... in eine zugriffsgeschützte Seite in Confluence eingespielt werden" style="text;strokeColor=none;fillColor=none;align=left;verticalAlign=middle;spacingLeft=4;spacingRight=4;overflow=hidden;points=[[0,0.5],[1,0.5]];portConstraint=eastwest;rotatable=0;whiteSpace=wrap;html=1;" vertex="1" parent="q0hTp9g1ltpsEYyW7GZH-24">
          <mxGeometry y="30" width="140" height="100" as="geometry" />
        </mxCell>
        <mxCell id="q0hTp9g1ltpsEYyW7GZH-26" value="Visualisierung" style="swimlane;fontStyle=0;childLayout=stackLayout;horizontal=1;startSize=30;horizontalStack=0;resizeParent=1;resizeParentMax=0;resizeLast=0;collapsible=1;marginBottom=0;whiteSpace=wrap;html=1;fillColor=#d80073;fontColor=#ffffff;strokeColor=#A50040;" vertex="1" parent="1">
          <mxGeometry x="560" y="1010" width="140" height="130" as="geometry" />
        </mxCell>
        <mxCell id="q0hTp9g1ltpsEYyW7GZH-27" value="Den Nutzer über die Anzahl an offenen Actions mittels eines Icons im iPhone-Style mit &quot;Nachrichten-Counter&quot; informieren" style="text;strokeColor=none;fillColor=none;align=left;verticalAlign=middle;spacingLeft=4;spacingRight=4;overflow=hidden;points=[[0,0.5],[1,0.5]];portConstraint=eastwest;rotatable=0;whiteSpace=wrap;html=1;" vertex="1" parent="q0hTp9g1ltpsEYyW7GZH-26">
          <mxGeometry y="30" width="140" height="100" as="geometry" />
        </mxCell>
        <mxCell id="q0hTp9g1ltpsEYyW7GZH-28" value="" style="triangle;whiteSpace=wrap;html=1;fillColor=#1ba1e2;fontColor=#ffffff;strokeColor=#006EAF;rotation=0;" vertex="1" parent="1">
          <mxGeometry x="279" y="1040" width="30" height="90" as="geometry" />
        </mxCell>
        <mxCell id="q0hTp9g1ltpsEYyW7GZH-29" value="" style="triangle;whiteSpace=wrap;html=1;fillColor=#60a917;fontColor=#ffffff;strokeColor=#2D7600;rotation=0;" vertex="1" parent="1">
          <mxGeometry x="498" y="1040" width="30" height="90" as="geometry" />
        </mxCell>
      </root>
    </mxGraphModel>
  </diagram>
</mxfile>
