bnb1mkjq25mes24edt35deue93klc0s633yzss95y9	1001060
bnb15khvelp3gyla26zfj850a0wt69lmxw8e5zuk2c	1730
bnb1tuq2xap4t05zzm6d3s7j4pxkj4j37khpwvaf07	2465327
bnb1h7p5l9ft3lu48wexad83hnqc5uk7rgv44yplxl	28532
bnb12tkrm0qhrn3pe3vnrfkt2vj0d3el5h5ncs3gh8	1288566
bnb12f0p2wn8whmykymundfrkua6xrzvxhl5mu8dtv	8000
bnb1kldfyslphmpn70frclgptncfjyf0pyp243fh5x	11974
bnb1859r478lkzxl3y33uht7dw75r5xmr53gh543vh	3675000
bnb1mmhmjqsenyy2xsa3eefqff73u8s3kakp6exfj7	137032
bnb1329q5t8k6qwm3yu736p7rlpcg6qp25rtzyp2d6	166907
bnb13gmnynvlkxkzpnpfttuxsww7kt2jskp6wntqv9	51338
bnb13t2uuxcjelhysamdy0pqw7m6g79zv8ddng5wng	27050
bnb1u602laswtdejrmykkn7c8e7akvgm82waeljt25	1689.9999999999998
bnb1ylyf0auut2sx3y30kgwd5ss2zm9uqeuwr77y6s	661772
bnb1cmr48486xw3hda63gygx4wkvuvt5yzecastcwe	10666
bnb1q8l5auwwq7flq5vlq08fxxzurznv0v8m6gx0gj	1166659
bnb12vl2vpy5xmv4ahs4k5fh0flle5vluyj8ufx8mw	31051
bnb1t8mua25fp0pfu25z9np08nzn0v3mjgy7fvvl9y	998033
bnb18te0xhxpqwd3ddsmxq6nlwcghhwtvfm047axqj	71970
bnb1zr90fjgxjsjzsj9fjsd0rd7zkm5hqqdd6d5ncq	516246
bnb1p06d5wsuuqsvl4s35zesumpn0svpynluwmymjr	1368700
bnb1nqckk6repqcx32a9suu3dgy2hcml0ws4j4tpan	79582
bnb1fndp0jmwft2tf4hlx244yvunlch665mapga8vr	28012
bnb1xutm7nm9l46c9p5xvx94xuz08r3qadd28teygq	5568211
bnb1c2x0363wtr60quzy483u9xewgesqswpqrvav5e	568156
bnb1v87dy28978et8vsrssrpcfqdn2v59y60nvgkvx	12190
bnb1qyl5m0zh0a9v7zkgm7xlrzx3jhrnx3vn557nv7	11751
bnb1fumegt3dmkzy09zdt0sfxz282m8dlkca47q5lw	10193
bnb1rlhp5uhsysz9qf5gq78kxgvpkfcg0qv0ldu5r8	1919808.0000000002
bnb1ms6s0juntctw9rl95mv87rkhae5uu0mna9004h	100000
bnb16zj2fthk7yhydekuffxljykv3uugetl3u08tt0	1936
bnb1xe76ctfpxefwrunle6j8gryu82zcegu270x0zx	239639
bnb1j45qd8xsdkf9uda93k0eh63js2sus4ng5xtnmt	136500
bnb17dgg2uuvqc75lg437r32wzs636fwp6xkmf3396	3800
bnb167r4n7guzm924nhccshhhum004hn8eu3p78a0g	1649461
bnb1dhtyg5jgvw0j9jw37tstznyz0f6kt9epzyq2sp	44830
bnb16tvezd4v32eze76vfpve64s4fka5lfhcuvdy9x	26819
bnb1y0nk7nz4gc4wpgxwq0ld9g488vpuqnzr4t7a3c	59173
bnb1e9avaj624p2m2auhxd44jsqhffxvp8jpcvf8rz	452352.00000000006
bnb18m42xp89ykqz7gljyjtwers703lj4u33vhytjm	91401
bnb16znr4gq8a89eg40qzkvnp8vr30efxu9mntgykq	21499
bnb1fzu4nnvg5vjthee5j2qsmj9kywxg6mvvg4t884	163129
bnb194pk5f7asjt4hm8ez6hvsvxzgeurf3qzk4cneg	38297
bnb1nt08gyeqpaq23wwt70652q7qxsc7ue6mgphdav	12878
bnb17kwk6esla0rk0yzxk80gmpg4xgk3rek796s59p	300
bnb1zyvkhqr5c3520rhwerntdxt2az556fwqg3s6q5	99392
bnb1rlyg29lfl9rhjnztjtrd9daqt4sd9s97mu03ey	600923
bnb1ypl77fddyeqrx2h2gpkq63ztnulta6f65utwzw	236525
bnb1unrx9zfqvyqplka7hydzgsydt8p0y5hw7ehk4y	51341
bnb18s0yptz5205ql87jgmc24ud58v8t0z7sdp45sy	123086.99999999999
bnb1lcsrekgqrt07yl070d22l8q7ajuatc7jmaa4fj	1788
bnb1f040c8he9tswy7qckn6qnttnh239uyw9hg8efe	10641
bnb1qtl978856v9864s6npal57wu08tyn30f9npr5e	3390
bnb15znh3ahlmfhkf4zcmhdyh2zsa6s0xa4rt4hra9	21959
bnb10n3qdcxwm4h4karwqhz5ywknmj5cxc7x7mew04	300176
bnb1t843eldgxzwlll70dj0zwr4phzgtx0nrtu6e2z	105893
bnb1myst9x9cy57vqf3z9d23du9x0cq4asmkyxez45	34066
bnb1446dmc8u7jssynxhmjzay9wcx0vd6mh0v4l07u	458806.00000000006
bnb14sqxu0c0s53g3n8rfh9tk7f3qlhsuph6x65cwv	31827
bnb1gtcvdjs66ayk8ftal7z37qgk863s7wyhzl3u3x	68155
bnb1u22vyjjx6v4yhy70n8e4hyl32wym6dy8tw62zj	13593
bnb133sp2s58cjlqlrgh7s6a4fqwg5auua0j4v5rpd	58617.99999999999
bnb1vkw0rsjv4ygjd0cwczay6t23re52e79zu8wj7j	434064.99999999994
bnb1szspkerkvnl3qy6t0g5jgfntpl4m79c429xqsd	153982
bnb16sydpwht9zvvehyajnctggy3dm7yfhkrqfvr55	12033
bnb1n6vfgk3r8rcml34tvwldhwav7deynyvln2prsc	20140
bnb1sea7shprks76xqwqm4xyyzszuupnsc8w7dmd5l	1749245
bnb1au60fnr53k822h3dt2lurtac8q75eafzr8nl6x	2989
bnb1e4rz9lcgv8p5kk7f0tvr5wk9ar2l8scy2wk04g	1713
bnb186e4j52vfaec4fyyw2g8csaunwcgjvgphzrh4y	122294
bnb1sj6vzk3vrvdnwwhmldxxtn0t8mzg0h5ll4cqgm	144
bnb1rsxmnwf7lhgrgzr6878kjlatlk08mmysc6wns3	199001
bnb12lzpedec5p3325stlpny4feahh54zawywatqze	1069
bnb17rgya8gw4nnelnlt342y5cm6sylz40upjc8ml4	6709
bnb14lsxfueydec3wm0xmqhemeejzt2nk2t8twkxjk	45767
bnb1vwq2as8p63jvgl64cxs73al04s7n6wp65nv9dl	77311
bnb16zd8p8geutyqwld4u9uwf0fk7u9ps7k3pxp95y	11385
bnb1jfck260nln85qy9lacc5c7dfxppueaa2g976vh	64640
bnb1yyyhpp4q0apn4qeuyqqrx2jueg2c587wf8flf8	2900
bnb1yrzqptqn4ycks4svwt5a7jdfwutndr0q29j7ax	2070799.0000000002
bnb1rjjx7382fzjw92chx0n5pcs9gvd0c44tltt7qf	21636
bnb124w0yzh5fl82pjkcs6vn8khq90zsexmeng9qn6	28794
bnb15gxjn4hffqkag3vv6djqecr2cg09uldd9ht762	7527
bnb1am5590t7tev9wlp7hlrp2qsjp693p4f8wn699v	844587.9999999999
bnb1087n7v9vdh2j3semze30tesn7h6zuth6tsxdyt	545411
bnb1637hwjptdrmln46v7vvj3d9mzktrxdlrsnqhj4	301212
bnb1tnrsm5dfwt6yt5ejqyz0hmhpnfsu7w3z22x59a	7665.000000000001
bnb1jrgf2fvkjfwzywrndrnykkc6p36mt3ytfzq95j	105705
bnb1ee26vcmxqpnjj2zkpmaaa4jsdx8dev6m3hzgnr	15000
bnb1fc5dm669l25lznql5jlscnltjxcnk6s8n7sag5	564347
bnb107lpz8zcxrqsl2pfdzm6ajnkmf0dshltuzxpmr	557731
bnb10w94uklqzmf3ed70qw8xt729kvd6jlrw2fkqme	39028
bnb18sj7alq4xjwpm65swjk4a7acnekqymgedfe3lv	23003
bnb1qkmtzr72mpvayl4gq4y9kdyzv7r473q9kryn6w	2335781
bnb12c37jwarlcfl4svxdryqu89dxzjrduejkz6tss	90863
bnb1sums0xu5waxhwd30d965tvp7ayezu5z4dh4gv6	150096
bnb1rkrkr7gjpc5n3lwulqmdrvygup9zyhzy799t3t	10062
bnb17uyy50cg9kkqrv4j26ym2759e4ezs6fyk89zcq	132433
bnb1xdfnxqp9cuzcslkft39ny6rwzeulkx6lfk27az	1877
bnb1r5dh7yvxn8atazt6sjcgu9jvahcgmmm3fffwaz	191534
bnb1azlzyuu27tdxjg874qr494247z6jj97dv3y486	612066
bnb1egx5rqs7yaj5au0npwhjgny0s0gpthsk2snc0t	35052
bnb1646yxaa8qk6w3u8gyprecg9kzfwc8ged67w5pm	15841
bnb19dxth5fqfcxyykkftd4yydvdxxejp63ym8yymz	53500
bnb1suk7qa9fyeylx7cx7smyl9rk6qxt9fk49cpy6u	5426
bnb1hz8f8ejs6uy3fdyg99fk38pkmm3grxf2n643y4	20100
bnb1h066plzq6xr5v94jft9laqys0afl7fdeg4h3px	24655
bnb1j7ksdx7zkadze7xnuk7n0d96s8esr2ywh9llmw	126327
bnb1jvulqla3m60duttrkcq4yv8l7zfm8aly5ddlka	41485
bnb1z9hhrckwtvgkuylw7audd5w8406xu9q3qnrsf3	59660
bnb1un9e99dlc0zmfajnm8f7gwdd9j97suxr9fxe59	28675
bnb1zcsrdhzfd5vvsx65psww78vvj7y9c6tuh3sk9w	1108772
bnb1t4nac022fxhwpz7gpwt5vvvjncmcwf73gda5ka	1930.9999999999998
bnb1kgfr5468a7vu94mp5jt7qpzfuqcn8ryc82q52w	88549
bnb1nlxa3z3nrgdg8zkv550ua3pllm5sqc66vwc9ca	63990
bnb1qhefqvcfgg7y3m3wvg29g4r50958nwnt776eay	8079.000000000001
bnb1dhtezx56u362a7609pmtd8jw3ccrpvah3qksg9	49710
bnb1cj72vmdqfkskdfwdglr7duknp7gqrvy24hked7	239665
bnb10hhfeyykqdj9h6le4sd2r4r3pcey5sjj9exj8z	12156
bnb1dqr0qjy7v0srhr9e0g7trcjsdsvu8p09jf5n33	309197
bnb1ykja4rnkrav0xlcrr5y4mczujm7f5ast95tv6h	55863
bnb1qx2xkgmz27t0s7f8fc4xlyc7485ytr37rpely7	63066
bnb1uhm7phhcw3a4tn8k4jq50e7lh0z695am0gu2yw	70721
bnb18x9tr8garka4zsrfjq640tlegw3r4a22y43etw	30600
bnb1tu4h2yeumjh3dyf26jfcfl4nv54rfh58yyhs42	206060
bnb180hp2ms3a862j4u0wm5l5gl4z9t33fddhfwea6	78591
bnb1x0nz9hjxy4x4k23v6j7f3ts8eznq8gdzp7d04w	21470
bnb1x7dswr6c4u8g02cnd6z5lqk4tvc6v86v6mjxkw	887496.9999999999
bnb1y4m7jrvmvnsxhzghayyy5295gwfcn7uc9r0x4e	1891496
bnb1ju6eehwue87tayz5u7pvuh33eke8l84dumf0mp	3419590
bnb1eyqt550qgf982nd2jyduq9wpmsyaua54d4fevr	10772
bnb1yfyxdqfmwua4wj75wnc30tv0ll0m2jwxyx6xyl	58270.00000000001
bnb16zcr7p6tzfcnhlp2glehge3zm3c06wgfkk3ppd	932285
bnb1refww948ngpzhmc2jfxc8r50cacwmmr7jw2vtt	735947
bnb1f2t5gr99srrv6gr0ldna8xufztdgfhxttgy7kg	74409
bnb19wk4uxv903masjla37qu0epmg06snd6cf6fdre	271621
bnb1f3setp3my3yz9mqu3u2zc7vgcjvas9vd0u3dle	175149
bnb16nxntteq8x9qmqle8m60ndadp3cw002q04j9dd	101000
bnb15tcnmznknk9xdza5faqe03pymfj3a8u3tmc8l3	868554.0000000001
bnb1xunf2r7ssh42qshhhsxtqvhralezgdnjnvk003	18704
bnb1zv93hlu96jeg6k2qxdrwkvu37f4ylgy9cpt6dy	14712
bnb1tc3kve9lkwxjrpslwx4w0fhd06s9yavgpxqrdd	16286.000000000002
bnb1zpn7fyv9kfrvcf7xuc09qmcqgsgwh3hm2mxfsm	2800
bnb1jed0duuua28cnd9f845kdx9e9y0h7hkzcmxypj	12471
bnb16k475042gh550qwn5re3j7wfc484c743cdns7s	16831
bnb1uyyw4agetvvm6mvfrp5u6h9wx75nd6ncynyt64	81302
bnb17a8cc9wamlj25fgwpvym3e9n3sqsslfe76m5s6	114249
bnb1kg5wpqz242mhhxxqx0xmw3xkjl2qn3smaw2j0x	4711
bnb1vclzda3lcy2m05e6vx9h8308e9f948lqqcrj8r	335546
bnb1n7vd2frs2lltn07r333dmgtl7574j6cedgsjkx	6912
bnb1k6dqfm05y5jlx2r4afwyqazsmlqzcdxgu9p54c	2010.0000000000002
bnb1g70pfy6m5f5pvxd5du5aqtdgvxz2z7flln96lz	51479
bnb1w4ktt8uf0gqju50w5v8g3jw5u6gpyvy9z0ke9s	70982
bnb180vu8m9zsw8m9ty4qvjsczh5rlrtmzs6ct8mx3	90145
bnb1xqrsghjjcqcpv0uftth7klwy35h4nta46nexc4	7781
bnb1pj04e3nkkgd3t3xcxwe8z4p25vg5svm7rqjm8j	57650
bnb1zrjnml3sxf306p3jaezt23xle5z2cy74wxr369	720
bnb1jluwr2nl68naxs9nvx0mux6m2amdy32atteepf	476085.00000000006
bnb18yez6ept6x089cukeqcj4lnfpvwl6ca2x67jgu	22893
bnb14gx273k72u9rh9ue4ecfpeu0yg3lglt5cp5z7d	3470.0000000000005
bnb1y06j2aacngrxeqnajgpsuyxhtxg6av704yq58l	1137453
bnb100r3jnyydvu6r800h0hjtu5jkrn3llk22ppxr3	15706
bnb1lgyux9fp3qnff6zkjdjknxdkaw3cwclyx43khp	219794.99999999997
bnb1d0ch3xr8gggdecmvaeklrsmpmcjg6dcm0segsp	174026
bnb1qv3lehm9t705qt0mg9nzzkcymjkv8j7ymk7klm	142405
bnb1nudt74776dequ8lxwwdl49j0j362krqglae662	26498
bnb1j7yldl63fxjhsk064dnvywaa9f0g3ka940xd73	15113.999999999998
bnb15xnf34069exax34m954p52vn4tltldtq7yp494	70479
bnb1tj8wzl7xrpqs4xmyeequ8sw2vqjny326mnyhzx	495351
bnb1qelv08zkl623u5uv98cwpqrcdrjweyf9ufz09q	82061
bnb1se0kwzsmzwepx9pxzrfycpar86xsys93ahp8lu	57691
bnb1dmqq9k5dghc3992q45wsheqq9wvjeumszpldx9	38505
bnb1c8whfhqet3w4v6u3vw3xa8mlxstja82lght2v7	25000
bnb1myzyxl9c5hxvk62pvsn57s3w596af998y3lxwa	31593
bnb1gvnneevr42ree4ylsh5sd2f3cqwrk2kkpy02j0	23290
bnb1pjexmh4fx5xdymlpfjtzvl23xnz00e6l2f79aa	77362
bnb1mu4dge3np02qmxwjcvvjcg72czcm3pa5ax79gr	39230
bnb1x4vn6rn6rujsqd2wnmg6exq900jv20rqdfl7jt	13976
bnb1ugskclmklwhdl3wqwnk0c88ampcu6luuuqyjcv	158
bnb16ue8aypmp7xteeq7wysw8qtewxytz98dwamrwf	63700
bnb17n204j3qp7n5nrcxve808svfjhyfqr2hacm4k4	89668
bnb1m0p6anm3hrucpdcguk5r7gsfkwan37h6x9dj0w	89214
bnb1tw3rhz2n96c5mdgyf4c0y7zd66gmajjde2aq7x	9206
bnb1gjq5dqkwpxc06x5jcp58rg64kex590t03ucrss	2530
bnb10fg8z9dumqhmfhm5s4ghyh9che07hplvk38k6t	12905.000000000002
bnb1w7hc9rltf8l5st9rrptrmjdrgryk9uqruk65c8	9927
bnb1c0ehe7tlyurqhvrd3zx8fnafekhxe9m0htzquk	51117
bnb1vvv3k6kjpqrre8fr3htjhutxwan9vag6jrj9dk	102130
bnb1dgdxwulcepwdjdlmvx2q9cz5td0tdklqyuv0fc	7279.000000000001
bnb16p0sp5nlphcr9y6v02lan7z3739udvwagrg85x	76575
bnb1v3k8nkyn022jva9lczxd9r7wfeu9udz8qywcux	150820
bnb1vt0sy6l4r72ua9gjynky03um3gux8u0s3xfvpm	22700
bnb1ndke6h3sylnar0sszryjaccnhhxt2mzxkpgvkc	34525
bnb1hfyj6nqnsge8zjlxneyun6gnl43e3kscgvgk8s	100210
bnb12ta2lrz4h8stv9t6ku6za88gwhhpncmkdhdg2f	4517
bnb1mn4wl7fn78a08f62ctxnt6kl2jgkrra9mwuzsn	29185.000000000004
bnb1kqm2ecnxpydr5hpcv7x9rpqzv7zxk2gl6y6454	13332
bnb178yfv4mtshsnect90y9twkt3tnu9wdfz2jj96d	48704
bnb12me6l98g9tc5jmdw5x544f28zn36sktru5akkg	2500000
bnb1devefureacvt9lhwlwshs3j5w78m967clghws2	1527273
bnb1mwchwe6lq4m5f78clp05ermumzv0wwapzv09d4	720478
bnb1nckmzqs3tgaernfllxkw60v0cvj553dwuegz8d	565850
bnb177xy982fqxc6qk9zwfnhhqgd4n55vd5wfsgx7m	509512
bnb1zk22tfw3fyl7z0wdmxl668y5qq70yvz84gf6xw	319800
bnb1qfexvdqmd43lnndy36c2ckd4elahaxd0q9nfg0	310200
bnb1kckre5jptlxwdrwjwruc93nh3tqh3y2m864hp8	220444
bnb1fg4zezx3w7k27l3rg03te46m9russws8djz2uq	219437
bnb1y23lz9an6540gw0xfcryjznrstg32ksl024d7r	199851
bnb1ep3nf4mafemfrwlgyl7vksruezngweq3udmxj4	197424
bnb1p0mn2sh4p72zqvzjaw8h0nk57s9re506y4j8lt	151293
bnb122hfjhyu62qrshf2rhsfs2xvag09xxx5mtqu9r	141350
bnb134fk6ywlrhaxwg9jzuyjhsj2sedrvy0k7upsap	140000
bnb1sj0sedrus7tnnywr0astw7a44809jljrtwx8td	137477
bnb1tzjlppltm7pre6v0aanuntx8p6rcrqdgdpm22q	133000
bnb1nlwp6zwg5gk0r6prtl339at5mzun006l0s7a40	102268
bnb1y4q892gh6c0d6qwcntn7elen6xjtfz8gyc44uq	102000
bnb136vyll3taevqahu8l63plc43yqa0ku729g7tdp	74849
bnb166fw6frtj8duaatgsulmy7wkm40484ada7j2pa	68700
bnb1vlkzn7d03n9xtz0f4tuq0nfpplvxeenqdepmv8	68592
bnb1ehdfr4lt60adtwa529gf9va7xscm0vg45up42r	67430
bnb18r3d5qv5w77jz9gap890swqa8mg6fwx883lts9	64416
bnb1xr5e7ep9pfflp4gy4e6md0mk986uw34awg3ktu	60645.00000000001
bnb1pytd0u3s87zma89ge0ae92k4mlygkml5culygx	57784
bnb1t6q635w940ml8az63g0fu4nr6xaa0gdjpq7fur	57694.00000000001
bnb1mw0dse480untejufrkfgchkn4y55uqnpqt2sq5	52104
bnb1sfj05y8gdu0w2mn7w7d9n2dyvm0x4yvq0lfdp0	51100
bnb1ptv557fzzfr9qagqss4nlqj2pueahztul8jygt	50000
bnb1vhf53um9ypt36lytwyy84206paz6hgq70sl4cr	49177
bnb1hwhwyhjya400zd55c6l95s82s7g4xdtapaa8v5	47615
bnb1ka5lalveaqafq32a0g0cva5nvs98mm3v35ufcf	36596
bnb1at96vtr6jcllqp4c23z29ch4drwemkfyzgj3th	36596
bnb1prdkexdzkr5mhw0zw8nlysgt7wtum0r2eltgr6	34384
bnb1y8xazlf36kencpsmp5mvwwhj7eepfkf4ztykea	33724
bnb16j70p6clkgtvhrnm72xd8f5gwplsyuyt0rc6we	28300
bnb1plgrnrmemjap06lc0fs5gyndwhv3m8dvef76pp	22744
bnb1xnh2uarjk6hlun7a6h8htq86j82x3rpmves08e	22160
bnb1z426hfsc4fq9ssu426vfnsz2eruggynkwnla6g	20760
bnb1whjp9gk9zlpjjve33r0y7w5lfcswtyp4m608wr	20447
bnb18c0qur6s6adayhhfgxgyy07cltrsmw64y38dts	20400
bnb1gymht9ffkxxj2ecdw5epcx6ua5nslr3mnw2u39	20367
bnb1tkfdgcn0ccuyelu3zf98a5p2g3pj70fe8pxrgl	18740
bnb1nw4e57udwj2yykrpa94wftm3vrkwq8zpf53zxz	17992
bnb17hacevwe0flmkvzr46uut28j0dmgmv7mmlh82m	16857
bnb10m7r845y84ya9ttdc2d7rny9kwap6dq3p9acct	15960
bnb12ecnrm7tjxkvzxvrg6udyreh2550tjw55kuxce	14631
bnb1aynjm6jfvk3sc450xqk3tjy20x26ek80cm4uvg	11980
bnb1ktjfj6ze9c6fgq493r5qmd08ar9z5kqp85wu7q	11500
bnb1qk5ugzxcavh2z4l9ayru36xclnjp4g9hnx4twv	10200
bnb1w2f0h0rn0lqj4mpk2un0cvzaxaqh7jctyg32nj	10160
bnb138kf8hffzye3fzr93426dnk8hz3f0v2uy3jws5	10069
bnb1sk70g9c2mm5rcdqqwlrez35ethhxgejjelgrlz	10000
bnb1nlun9rtdcyerg3vqu97mfcx3svdtuset58jrzm	10000
bnb1qruk490p8932q6yrgdu2fq3vky3xc7jyfm6fxf	10000
bnb100cv83e6egqtnav9c08www3y377uwhx3gr8um9	9828
bnb1yhaletwspqzw05agefcsh6ufr94h9g5l8trc62	8984
bnb1ekxr0ac6wka7nntstu7wucndytkkwu76prf7j7	8900
bnb17h2ws5j6k9y36dq2r2j4ut6alzlqpvslrxer0y	8576
bnb1tdcdcvskw6077qdw0tlvlhpd3hem9ddx3pafwr	8280
bnb1w49eg0lguy9vaq4ke3qxsazd6qe6ex3m6zpag8	8272
bnb1hmwz4e37685j2tzlt8guv5cn4dtwz4vj2zmnu6	7576.000000000001
bnb1n7tx92khlcrjj6ugpehnat72kmp47umk68gff7	6750
bnb1xsmsnp7gu5gyjlzvzp4gzaxwdavhfpgxznsnlr	6592
bnb1kqv28qez2l0yngwsz0x57h9zmfckv2xtv8wwlk	5264
bnb1ac8yph5pqj2q0h5wmtwqm49d8gm6a7gw5mvpwu	5131
bnb1rs3ddenu00p8p7cpw6vnat9cxz2qc2ayxxx4qz	3510
bnb1em9nsygepjt5zx9h75y05wgjluz8ywgehhc2yr	3400
bnb15kargly2atr90gswqsv2weqcr90l3jrugxqquj	3165
bnb1mmydtak38chkasc2fs9qd80g3kp9uccr9jfmvr	2470
bnb1s0t2zm3ylhfjhzlh60euj6wz4mrm97d5y0r9gm	2330
bnb1mr9rq7x3tjqqp8mgxe2sxak6jkwwc5xla32u3e	2250
bnb1rkz8wzt5e3csccuray95mt5g3sjzrehl4yudk2	1290
bnb1syf0ue5sdaqvz8pnynmnnpvhj7n57dufnkgd9t	1087
bnb1n3klj982pseatz8d5g85g2hg8k24l7d85vrzzv	1056
bnb1dayvu3md66ncgh2vlpzyrl3us05auumn0lrj7k	1000
bnb1xl0x8faat7atrl2q2nxxjp57tvjctcldgmx809	600
bnb1s38q5rt9fxnq5nhf6ln3g06p4kkuexedqs8vq9	579
bnb1alx80gqa7xt2kqgshj2e383s4ule6lc36h7usp	520
bnb1dgye497wf6l6dhkh24yqkfzqr7hv80a69n2ugp	520
bnb1gmk0an24ljkxgx04hueykqg88vwmvn8sevekgh	486.00000000000006
bnb1rve8xzp032x9l08ej402jxakcjymf572klzrnt	451.99999999999994
bnb1ja6m05v7ccejcwqdys6cz2vfu2q37pj92zrx4x	246
bnb1p3rnd40u084jdxx5lx3t9q7zh3n62jv0tdtmc2	100