bnb1859r478lkzxl3y33uht7dw75r5xmr53gh543vh	4070081.4
bnb1ju6eehwue87tayz5u7pvuh33eke8l84dumf0mp	3475332
bnb1c3aezsxgh58fq2y2nwywxtg9jfgv2psyayvd7n	3390245.6
bnb19uvv83huy7925hpfmyu7974srxvxem2r4gv5pd	3167701.6
bnb1wsg43lqyllnwx4tq0tascknsr22u9m2sn8yhph	3097806.6
bnb1xutm7nm9l46c9p5xvx94xuz08r3qadd28teygq	3088188.6
bnb1kwhutx2kgcz9wpnyx2lrwq7zz25ckwa0y4k3c0	2904907.6
bnb1r6hpmhmjgmw240quzujanlt6k3nzqgt7ledf0p	2885738.7999999993
bnb1wcqhkzkmp67f5c9qcspmmr7mddktj5xl5t2e62	2865139.2
bnb1zhpqqc35amhtmamhcwwynyyyjzg6z0f7a3hm8a	2630418
bnb1jccz63p5nufzgts9cdd0cxcrftgxaf9g29msal	2571248.4
bnb1nk9y3fdqj8vwg9zzy2ewxfkn6x430vxc5dj9uh	2170119
bnb1sea7shprks76xqwqm4xyyzszuupnsc8w7dmd5l	2142142.8
bnb1lnpddlgpwtzysgwmhfn5vcgfmewjxg0awg8d0e	2080278.2
bnb1z07wjmhpmnww98edpdf2sd7weauhl905jse34p	2031936.2
bnb1cpwrzcmpsdy5xm0yd3d6wlqlr506uawsykuz99	1836961
bnb13vedtsftqjywaj074dneknyr6adpxttrand20e	1948728.6
bnb13h88jdmfgu5mrd4yu9q23gtg6lt4nytwyaqdtk	1738504.6
bnb1devefureacvt9lhwlwshs3j5w78m967clghws2	1516509.3999999997
bnb1mjpj7lvgymhz9vzkzc7vpt0q80cnx77valvpgq	1526817.6
bnb1grf3guxfrphukjs5gu8pf7e6jtxgq202ur3u2q	1518038.2
bnb1suua2l65n00f6r56n89sep7rcwe6yk8sq5pjle	1500030
bnb18s9wcpe0d0tvxc7vp6yz4d2g7dkg7n382p5url	1301483.4
bnb1mkjq25mes24edt35deue93klc0s633yzss95y9	1268463
bnb1t8mua25fp0pfu25z9np08nzn0v3mjgy7fvvl9y	1241361.8
bnb1q8l5auwwq7flq5vlq08fxxzurznv0v8m6gx0gj	1221966.2
bnb16zcr7p6tzfcnhlp2glehge3zm3c06wgfkk3ppd	1199262.4
bnb16a95z4chxq9w0erj9mhrkrkf7zt3guajxddtve	1176704.2
bnb174tkeu48hqd4dcky3vwdkl7h6q3aux9l4zekgt	1152179
bnb1y3jw5un2nkyha8wy5tf7yavcsnt0grlfjs95qm	1128986.6
bnb1e2dzpcdaqs9vxmscdk2rc7y8fxxepxv34u47vz	1119714.4
bnb1zzeux0hds8nqe8ng34uhvgsye72mjy8j94j5y2	1104371.8
bnb1xuz5rfrtktfe9zfh0z7a0ystmgy68fg75gfjtz	1084689.2
bnb185k8v8t6utwz20ngcdy3dkwl4hydg224nsjuwr	1079538.6
bnb1m6uvglhskrrpwgt6qzhrgdenqsvyt2yxk7u35v	1065272.6
bnb1dgx4kq72khej4z0hvve495l47736nducy2zjyt	1026327.4
bnb12tkrm0qhrn3pe3vnrfkt2vj0d3el5h5ncs3gh8	1022410.2
bnb1367fjtjcugtdyvjnlykmxrr7987zct2vqstt76	1007364.4
bnb10hecw5ml5zleyhrz7xt0k05pf4ma7mzykf34v4	992951.4
bnb15w49r6caypgklgm8phjep0sa2l4vdf5qleaysd	988400
bnb1d7p0hulh58tzv0g4x7x5y9r0k4qvews5cessnm	958203.4
bnb18lu2l78mlrmrukvs06kf4dmtnwrezme7hraclv	940531.2
bnb1h5lc8ynlum4jt2l33uw9lmmg202arwmda6r24j	857640
bnb1tua6uwvwk38nv9tcdqhz60uulk76q488qketqd	893656.4
bnb1e9avaj624p2m2auhxd44jsqhffxvp8jpcvf8rz	859934.6
bnb1qew564y4av4n2l9wwy6n7nluy5glk05xqhs9gg	857967.6
bnb1y4m7jrvmvnsxhzghayyy5295gwfcn7uc9r0x4e	855883
bnb1dwe7fw6wn6nnljd9m5ty293wygyh6uq9t8rdsp	841524.6
bnb1u4u020f9tfxwheuz49knr93d3cyrmkaf9qjrmr	789461.4
bnb1u8jxqw7jylneh60l8sn3pk7kwejejyd8g7hphq	760711
bnb1t360q7zpepd8ljpdtgvyav9e8a8ff2cw5mhwch	767302.1999999998
bnb1yws0a7fdk9l8x9mkd352q05xyrutvx5arkeura	766196.2
bnb12tevktzcu7adzds0qa9lu0mx64mfauwudmxru4	715047.1999999998
bnb145x6fvha7mgx2g5y45rx22qd2vym5cl405s5tn	643354.6
bnb1jfundmcdsugw490rewkrm0atejrlegnfarw422	621429.2
bnb1644ltagd7n2jx2a8r5x9lpnymcahpxt5wevfjf	617766.8
bnb1twa0h0a0sx8wm27mvpzggx6gazuzxakzm40cdp	611115.4
bnb1fc5dm669l25lznql5jlscnltjxcnk6s8n7sag5	596225
bnb1zr90fjgxjsjzsj9fjsd0rd7zkm5hqqdd6d5ncq	595772.8000000002
bnb1azlzyuu27tdxjg874qr494247z6jj97dv3y486	595771.4
bnb1f4xl0jvnz04sdx9n59jtxs6w98weulnrdae93w	585065.6
bnb16uxqjzkfzcngux7nkkhzgztnjl8ethh2h4whs8	579593
bnb1pszusstt9fnctws87m3eewxj36jr5cladj750y	537668.6
bnb1gpuypp4f24hheupkxdrac98rzwtawwvtdwu0jc	573732.6
bnb1z8s4c0g3qznfxkv6zwf5x5r4jn3pmsav4tuc4g	556375.4
bnb189p5gyzktj9u774tredf5t8cqelfg66segjx4y	541209.2
bnb1am5590t7tev9wlp7hlrp2qsjp693p4f8wn699v	496476.4000000001
bnb1mqm5sn5ydvl7p9qxw9rmrf48lgx92f3cn45zzd	400964.2
bnb1rq5z3k2e42nrsujc7w2sgc3glu46m0e48s2zes	479964.8
bnb1da9hxsw93gddhuta30lc3f2936j35y93gdqv6g	473909.8
bnb1c0ehe7tlyurqhvrd3zx8fnafekhxe9m0htzquk	454945.4
bnb16p0sp5nlphcr9y6v02lan7z3739udvwagrg85x	434072.8
bnb1l6exfwglm575lh2gspp6pm73qumpfhl4ndq2t0	408980.6
bnb1zk22tfw3fyl7z0wdmxl668y5qq70yvz84gf6xw	413726.6
bnb1r009aaudhlacjmnq965k644tcsr4rj4ewh7uyt	398340.6
bnb1yhenddk5w7nl3uuj5msxvl3pa5k3snmkc6044g	397181.4000000001
bnb1u0fztkdccczgl4h8dp3qfjyq62an8d78wg8uqs	395428.5999999999
bnb1dqr0qjy7v0srhr9e0g7trcjsdsvu8p09jf5n33	387146.2
bnb1vkw0rsjv4ygjd0cwczay6t23re52e79zu8wj7j	379787.8
bnb1rlhp5uhsysz9qf5gq78kxgvpkfcg0qv0ldu5r8	376693.8
bnb1zp9yqmqkz69tnrpd53dpjyca2zuj6usanup79j	364616
bnb18xhwea4hkh32v6en48ksfr45zcwq9km9hnpq7q	347433.8
bnb1va2akjq4lmy2xcaj9ljk067dhktty839xnufd9	352711.8
bnb1dyltg4dr4t35ptsdh70jeqee8842upkz4hrc20	345825.2
bnb1rpw69vck9txkql2hw8t80uxdapve0rlw6ywkhf	341864.6
bnb19km30jq0qe5xyvdtayhdj2qg9uwtd9g7x9mv36	341814.2
bnb1lgyux9fp3qnff6zkjdjknxdkaw3cwclyx43khp	336382.2
bnb1n9uyass9d86dedwxr4daal3vaeegnm0888nkjl	330045.8
bnb1z5u77wf2x7ej8un5ls8304f75wm2erqgqk64pe	329001.4000000001
bnb1zf7lpum3al3xewlt492cdgmrv3shd42dy54ael	248238.20000000004
bnb1xyhmppadjr8v2npk6g6srzw2p3mwnd3ht9p3gd	319867.8
bnb1y23lz9an6540gw0xfcryjznrstg32ksl024d7r	312622.8
bnb107lpz8zcxrqsl2pfdzm6ajnkmf0dshltuzxpmr	310898
bnb14fhxm0scggqllvquc9e07d0emdgm86v684ltw9	306168.8
bnb1fg4zezx3w7k27l3rg03te46m9russws8djz2uq	260715
bnb1skp2q4a05ed8ven2gn6f4fj30cl4ew9wy0ay3r	305083.8
bnb1g8tvafknlpmht2p375jkm2al0xshq47f2uqs2f	303062.2
bnb1ms6s0juntctw9rl95mv87rkhae5uu0mna9004h	301856.8
bnb1cr9mqk287hl9ettzwh6ggewch97hxtzl3r9ntx	299125.4
bnb1wq6fpuksnhnl6r9e7v8r2zuszyf9wn6v3awlw4	300491.8
bnb1regtphttn700wd2a8gk9u327d5are573jx6hg8	297885
bnb1kckre5jptlxwdrwjwruc93nh3tqh3y2m864hp8	294137.2
bnb16dnnyewcyqmpn4ur6jtzsdlsf85v5x0pg7t5a4	283246.6
bnb1kzrt44aqten9qd0mqlygcgtlpz3augcf5723rc	271.6
bnb1ayphwzju9h8yfsdd48srag04nxsyy4uzxrtk76	282066.4
bnb1ak7f3lp02zmtv4gm28ycp22jpz29euuwu9r9pf	279070.4
bnb1wy6k9uxe34tx3pxmwcpt80pvt2p4edme8045l2	213039.4
bnb1kq3x7h4tl6qrtgyvngzyynfl2825c5ejcjkzhg	270142.6
bnb1vhl95durh3dt3lx35raylv648ksljeze9460h8	263491.2
bnb10heqljggrkhksuqdejtrq7vm37ek8eaqjhqaj5	262829
bnb15q2654gzgylqrqz2770dw22ce4ve8cekekztqr	248238.20000000004
bnb1ep3nf4mafemfrwlgyl7vksruezngweq3udmxj4	259287
bnb1qx2ugn98cw40ja9hrfh2e47rvnxsc2gl73dfke	253386
bnb1p949mdjvugak9wdw604923pgewnleqxn98nyx5	253331.4
bnb1efeq3ryrnjqdn2vcydf5xghmcwz98583ye0vrl	247122.4
bnb1nckmzqs3tgaernfllxkw60v0cvj553dwuegz8d	239124.2
bnb1m5yy49sksmjh7j02vyfdnl7vjcttmk25kcl0vf	238555.8
bnb1h0mtvjg4zn4adlhm82suzj79egcnentfmngwzn	237178.20000000004
bnb1sr8cv6tdf4w0kt0a8auclpjnfeg23cjd7e56xx	235788
bnb1fdjtpuawchjx04eplt4ger4d9h3nsznjd7p0m4	233821
bnb102l7dnmw7pjr5hzkws6qhe7fatkvlqmykhmsyh	227368.4
bnb1eralzf9ku9ksvcdwkd67qf3ywvcz487p9h0frd	225688.4
bnb17e5n6pcvj3vx3zzugz3zka83a4hwaeawtd77yk	222905.2
bnb1nqckk6repqcx32a9suu3dgy2hcml0ws4j4tpan	216949.6
bnb1c2x0363wtr60quzy483u9xewgesqswpqrvav5e	214579.4
bnb12vea3zezjht64rx56pcs7qk9h0w89e68vsmdgu	212605.4
bnb1368ewg45c523kmlnfrhldkeudtne9xglt23jyw	201840.8
bnb153j579dhk9may5hsp3x035m7s9ysgydvs8xjr8	202270.6
bnb1tu4h2yeumjh3dyf26jfcfl4nv54rfh58yyhs42	199962
bnb1qzcwt8vyhmgpxgncf69eah0n7znp0yvfshfhx6	198989
bnb1faa0qz8vraufemjn2yt9hevrjkk8rvne3nn2zl	197355.2
bnb196jfucq9mdjtw52td8a3f932w06m4q7udzux43	188526.79999999996
bnb1xkqag4ag0ksqhyl998qf6mp2tjs95a494ve8ee	197932
bnb134fk6ywlrhaxwg9jzuyjhsj2sedrvy0k7upsap	196386.4
bnb1ajrn6uqwp90jtq0eepm3gdjastspt8na8c6agu	191977.8
bnb1fvf0qpwl42s2s234umszud03u6md3kd0g8mffn	191510.2
bnb1udjyrjhpwm0yq2hwmdf4acvc4r387a9v83vree	188911.79999999996
bnb1637hwjptdrmln46v7vvj3d9mzktrxdlrsnqhj4	186950.4
bnb1v7p5w0euauelxtqh5w8phlw326wsrdtmt4vcfv	186887.4
bnb1lakfyhm7ls3wgkrgkre2c8qvcghvc053kjvwe2	179922.4
bnb1qv3lehm9t705qt0mg9nzzkcymjkv8j7ymk7klm	179835.6
bnb12wfl47w364tuhc6pe9nvanahvwjukes2jued9w	173609.8
bnb10mtrckhp58pe5uh9qskpmqcq0rtrqhr84saa3h	169863.4
bnb1vgk8c7ef9mczcs5wpkg8vqhkzpf47agxng5sl9	169304.8
bnb160308gggrcp50e5vfsdzq2fgjg23pjqs46zwah	168061.6
bnb1xqzhn6vpgk90qvd8g8z9ul6aufe2ryvgt7pnk9	166754
bnb134ajamqtcm38z7efqyh24ts9ca6meg0r9aalph	166502
bnb12ekm8lq8tr4wgrysfjjrd9raly57c6sxf4g8f8	165996.6
bnb1842ha4gdwxyzsy2836kvt3ah87vjy6qeqyzp3r	165881.79999999996
bnb17uyy50cg9kkqrv4j26ym2759e4ezs6fyk89zcq	165793.6
bnb14lzrsuqjlnqazt728ruufkegs6qh3ty3npak3a	162218
bnb1y4q892gh6c0d6qwcntn7elen6xjtfz8gyc44uq	153106.79999999996
bnb1p0mn2sh4p72zqvzjaw8h0nk57s9re506y4j8lt	160290.2
bnb1a00n709j23e7wumc6puj9m0sh8g4u22nr4tdvg	153700.4
bnb14ckaje8u95cgyq3zlwg7w8yzm0dhkv6gxsqgu7	156017.4
bnb1xptyg49k7dnwfyp3sqx6zvlnj6k3qwzsy0lyc5	124355
bnb1hnexk29le7qtzzmf0unzz0gr2n0mtc66mxexn8	152864.6
bnb1w9yudrlzwekvsgp9spf6p8y442u782z0v4sgtw	144257.4
bnb1al44gwe58lda6v8e3wrkqqp3yv0s33wd52whut	149226
bnb1nzg556qryclu7a7929sv4khs2gw20eu8re25gg	149004.8
bnb1egx5rqs7yaj5au0npwhjgny0s0gpthsk2snc0t	146988.8
bnb1awx3rfhuxwmne8hxl70pgxzsflht9zrnwt7xze	143991.4
bnb1yzlm0ar7a5tu336dak8rwq8wa22gr75hraqgt9	143355.8
bnb1vwq2as8p63jvgl64cxs73al04s7n6wp65nv9dl	140061.6
bnb1ed6rx4nrwffkgssdyppmrfg0dcnfemtzgtu44p	142948.4
bnb17a8cc9wamlj25fgwpvym3e9n3sqsslfe76m5s6	140011.2
bnb1923uqcc0u6ezrwmv7fdlhucq9dl2f076vjc4ja	137659.2
bnb1hp82p7sd60us3cgfqgqmxgdgav9zr0796rlmsr	136416
bnb1umndam9rfzrgd95txyr5c9kpjvkkrg5c7cdck9	139008.8
bnb1vrmdxy83vg6eyv9sxvmf0qy2evfc6au4ehfnce	135798.6
bnb1u5spl7ufmrhr0ett5za2d8qv9y2jftl4cdsjfl	126270.2
bnb1ksknwzf5llx3gcvarru4vp80dd0djsfm2a4yfv	134666
bnb1jrgf2fvkjfwzywrndrnykkc6p36mt3ytfzq95j	132351.8
bnb15tcnmznknk9xdza5faqe03pymfj3a8u3tmc8l3	40839.4
bnb1ppulh3ucal4ers4stg9gfhmjtffltha9rzmmnh	130999.4
bnb1320f0fverl76txqupxguer6kceugq2z9wfukqp	109982.6
bnb1zhj3tq45j5882tjp6pet39tlsjmly8e4pgl5c6	127975.4
bnb1cj72vmdqfkskdfwdglr7duknp7gqrvy24hked7	129171
bnb1fzu4nnvg5vjthee5j2qsmj9kywxg6mvvg4t884	129084.2
bnb1rsxmnwf7lhgrgzr6878kjlatlk08mmysc6wns3	127036
bnb15jfs60nwxquvaj9lwn7n4n2hs7ggnxvtqy4kt5	126956.2
bnb1kcs49v4u7f3fw5yqrq7xuva7k4cggzkz9gf8sr	122173.8
bnb1pqw3ytwyw5fwn9vv7jwus6dwta22t2xg8fkc68	122235.4
bnb1p65c8nhh38wnexrfvyp8rnd47e7huanwwtzh89	123074
bnb1j45qd8xsdkf9uda93k0eh63js2sus4ng5xtnmt	121171.4
bnb1xpmcnn8738fv6zst6skr87smfwu0ah60vr7mcg	118878.2
bnb1r73fjf57s62s9egvw6m7cl5zwxrlmhsr2s5r05	119154
bnb1de43c9q2lj7tf98dmc2xnnal9gx8jq79f0xmsw	117803
bnb14f5vj79vrlwn4jyx4e34ypfyxyze7hhtzw0rfh	115406.2
bnb1l3k02y4nvgsnvdg396lxr7cpqknqqrfhc8yjfq	114079
bnb1z0v4qlkvk86pec968dsesrkapud0gzdkdylnqv	113934.8
bnb1pyzndgy0clkrehqke6h5jgrtdqzgdc78ac4qsr	95579.4
bnb1lq3w6nkjc9suldhw7yzf6kek6uhlemv2h83skk	113241.8
bnb1pdxa35p2q9e6qmgdsxqucnr4065ur2rzqduazs	110462.8
bnb1tl80z8ewv9yg8hryem44at3hwrqjev3ks6l92x	111904.8
bnb1kgfr5468a7vu94mp5jt7qpzfuqcn8ryc82q52w	110873
bnb1s9g7c9v3rg6ee8g9mcf7txg3ayxr0vkp22wfxr	110132.4
bnb1eht48a77ym2hhv6cc2hp5f4x9xeqsxg22c9ewu	106696.8
bnb1g0we8gc3trgjwuhuy3v0sud2urehyjjcaaz2cj	97291.60000000002
bnb1c8whfhqet3w4v6u3vw3xa8mlxstja82lght2v7	106541.4
bnb1t57fmptcaxc4aag2ax86a7x354p543t3zs8m7c	104994.4
bnb1fr24vdtm23ufx25ukld2d7grtjfr5hk5anj95n	108071.60000000002
bnb1npuyw2ezgn29fw47pqa44s4rawzs7d3xdrgr9t	103983.6
bnb1323qet0asr8g08rkx93w28jkxqfcysaz935jc7	105191.8
bnb1z9nj8pz0laggj4seulr3m4jjl7ku4950lk7y04	103203.8
bnb199u6x3k9my0fvnseldyf5tcvz6qvmu0xgwp5fa	102149.6
bnb16nxntteq8x9qmqle8m60ndadp3cw002q04j9dd	100277.8
bnb1sdh8a7xahvr4v2tjagt4udm6fqwmrst0cz0mjz	101614.8
bnb1vp5ak37k0735jpscwrs7p9c5z3e4ueed7jugwg	99184.4
bnb1patrmmvazgp5m09s4j7d3u9syzn6nelf4jc0k3	100868.6
bnb1jfck260nln85qy9lacc5c7dfxppueaa2g976vh	100116.8
bnb1qz0grtc9qsh2ur43cphl8sm2t2nsya2xa9qtc6	100003.39999999998
bnb1crnfrhyknx7r0ee9e78q4xu4hnqtqgkeka7jvr	99792
bnb1afp3u6gu6tsc6w4tw9wqzdhhna2np2tzprtzcc	97634.6
bnb16x93hvxf2l2w8lqvpsjmlqf6hl54ze4ty3djux	99628.2
bnb1da45jhxdx7v2klcahc2mavv9pmnryem5h2fngf	91956.2
bnb19c2ewmwgcda55hel53mgtalzhnvsvncwxnthtz	88901.4
bnb1myst9x9cy57vqf3z9d23du9x0cq4asmkyxez45	96462.8
bnb1tkpcmg69hsgw7tn9297n2u34jp773cwa30e692	84901.60000000002
bnb1skc0uc7m30hlcxgvlg4flkvm38sefv5uwen523	96168.8
bnb1cj6k6j7c46ksdc5neru6vnn80ts40lcjm7ndwu	95512.2
bnb1xjsklr8yst8lpgw53m8dw7qcqrgwgjprpvf7ee	78129.8
bnb1lrfa304a2xh20l2s8hhacr37cjhdstpw0wh0uw	91974.4
bnb1px9383sy08sj7d9nhkg6thcwv82qdgcdajt82u	91459.2
bnb15unemd0e87ks9usnv2f2phlsm7yptv6zql7ux5	90332.2
bnb17dr32lkqs4tsspxvufnmqkacj4svy6ly65d43e	89950
bnb149ezz4kdlsm5sfhn68kzt60k5y9gca6895xl86	88666.2
bnb17cnrdhde975tp50rtyrqtp2gxemaf8rdta4e5z	88914
bnb1savrv84exx5ra8rvhgp7eyhxnq5u3wzjxh7lec	73472
bnb1sp88zx3tfnqeeurrryq6287z20lw4knvanfxmh	85528.8
bnb1uag25q89qmjpsf7x56p4gk9dcj6qk2qkscjczr	84747.6
bnb1jhkjkcwp72r48yenn5zq6pfgche4j577tlh88z	85268.39999999998
bnb1yfyxdqfmwua4wj75wnc30tv0ll0m2jwxyx6xyl	84957.6
bnb1wvrt4rs9zyu8hgdyzpxl6q05n5qlskq959am3g	83423.2
bnb1uhm7phhcw3a4tn8k4jq50e7lh0z695am0gu2yw	82951.4
bnb18mdluksg8zzjwce5jk73w8s3g2ky2748vdhl4w	76265
bnb1t7kptjtwehqyjqke4wv0tfcchf66gtnarv07av	82167.4
bnb1c2sltux8hj5vyc9vdwpvsajjqac43veceeazly	82419.4
bnb1vvv3k6kjpqrre8fr3htjhutxwan9vag6jrj9dk	81576.60000000002
bnb1ve32eqkmtzvu247vk9y6e8v34n8k80fntm4j95	81401.60000000002
bnb177xy982fqxc6qk9zwfnhhqgd4n55vd5wfsgx7m	79541
bnb12ppe5t47pnt593l03zxw3zu6d2gtvl5m02fepn	80011.4
bnb1y2eqpzcpyxkexzzd3e5vnghd7xd5jr4p2ud0ly	79447.2
bnb1w4ktt8uf0gqju50w5v8g3jw5u6gpyvy9z0ke9s	78167.6
bnb19dxth5fqfcxyykkftd4yydvdxxejp63ym8yymz	78999.2
bnb12tdc972mxv7e3szacvpt8p4rqyep0822vm488j	78258.6
bnb1t6q635w940ml8az63g0fu4nr6xaa0gdjpq7fur	57288
bnb163h9re847lu3smw6fwyuej25auysvzxpu8zftj	77729.4
bnb180hp2ms3a862j4u0wm5l5gl4z9t33fddhfwea6	77170.8
bnb17jtep28er5jzykatr2tqnd6kufhlakq582tzz7	76956.60000000002
bnb1f2t5gr99srrv6gr0ldna8xufztdgfhxttgy7kg	75587.4
bnb14mzrmv0h3ynlgtf9wvsf5wrv0usufk28ugst4z	76039.6
bnb1wjzuntqc9xrmwewyqvqjzgxy3y8q46g8v73ag5	75569.2
bnb1nz3x9f477yn5xw9yq2z7hay55jfkzy4gngcyvv	75384.4
bnb1g5v5d26fpw7n3w7v5z2cg947kh82erqwmmzyzh	52287.2
bnb1nsfe7phf7c6wqak0znekzy6q430zw68wgf5zz2	74978.39999999998
bnb12wey57nha3jmn7ycu46066uw8khc0ynna90wyt	73953.6
bnb1vfz8p9vsjl6pjyr3vs83qawl2j90067xn3uywz	70169.4
bnb133sp2s58cjlqlrgh7s6a4fqwg5auua0j4v5rpd	73395
bnb1pj04e3nkkgd3t3xcxwe8z4p25vg5svm7rqjm8j	72823.8
bnb1ka483sgw3tqfldugds9n9f5jqw848vmk8qn9vn	71709.4
bnb19w8ac9srzwa3mcne6eh2vkvevgg3fumj55wdyq	70719.6
bnb177hrykeh5zvg0lh00jlxhgnvngveu56xyhxesk	70527.8
bnb1lp83jqpjkx5wedwtyggd44ta0fx5w2fef0us4l	69944
bnb195lkv0f6x5n3xz0gkrs7s3m6yu7fsgg8j96axc	63201.6
bnb1nt08gyeqpaq23wwt70652q7qxsc7ue6mgphdav	69507.2
bnb104ypnylt98jx0l6elgce7rp5f75cztcyutgh20	68523
bnb1lwca9rwt7ja2cqkc943jvxtz36zsne37765r39	67485.6
bnb190we7qptyc05fvw4jju7rvm9fg5q4ny683ksq8	66785.6
bnb1yj743dhufwxm4f4p3jwugwuus5vae6u9jzvplf	66901.8
bnb1j87zk6xnv2s79rfz0p4tmwwzg9ll2l2s2ptkkd	66344.6
bnb12fwj0nqlrl4d7g8m8daq24vzet9ydgw5m3fvtj	66081.4
bnb1ke2dxg5ngz9a670lvqrgvg3lfga45s038vpxj5	66054.8
bnb1jexqjxdazm3jqavzaemdvgfvc9qnsp46erjnv5	65961
bnb1c6vp53d53089e0snf2czxvqxu2gp8xx82kq6v6	65668.4
bnb1ml7hwleej0ahdhlags9netntgjavfc8asdnzwm	65436
bnb1uxsx5ex2kea37wjfazcv6e0rsegkcpylg4kdd0	64757
bnb1p6djp0pww5wtr3rkuxppek56pw2c2f9ae67cj5	63956.2
bnb1zcza9pn7ut7cm0qu46872qj5he6pxr5kagnetw	54441.8
bnb1dfwkg25fhgyax6cxlj87369ltxgread9g470y5	62216
bnb1vhf53um9ypt36lytwyy84206paz6hgq70sl4cr	62693.4
bnb18u8erwhu8js22hrul76w0zajtlhrd6cvxndqfu	62591.2
bnb1rj2ec5zypprcxxtkf0dg8rlv60d4xqpvk9rx9t	62431.6
bnb1gw5u9m4phtmq4q0nckydk5rd5dd8jhxqcsxd6d	60569.6
bnb1r8n9cqcd44pkzrslllzanzlvreev40hy7nastg	61563.6
bnb1hwyacmjwc3y3f46jpjclc4tkjuzgg70fs5q5qu	61985
bnb1sfj05y8gdu0w2mn7w7d9n2dyvm0x4yvq0lfdp0	61126.8
bnb1se0kwzsmzwepx9pxzrfycpar86xsys93ahp8lu	60020.80000000001
bnb1ux84kgg4ya46zks92psy3nz49mpyek6tjdzgkf	60219.6
bnb1uma3wqqj4vjxe4q8xsnde83fzxye9l6h46nzxa	60117.4
bnb1qhefqvcfgg7y3m3wvg29g4r50958nwnt776eay	59990
bnb1em5s72w6stjr8ps7zg6femcgel7hynruyahalk	59845.80000000001
bnb12glc86hrv6apa6s4wcss8y99ddzzyjqzm6penk	59827.6
bnb1vt0sy6l4r72ua9gjynky03um3gux8u0s3xfvpm	58830.80000000001
bnb1rnhamj2wn7zezx45e9dk9h4wn8kdpt9tvpent6	47047
bnb1wckqz9sjckkrdrccq8qapeyuf282xqjxc7puzg	58543.8
bnb13rv02shcdg98ec0l9crz6zyhewz0864k4nmpvg	49859.6
bnb1evjlm9f4jp7cye2alkh8nlj72e3ltw77380mqc	56324.8
bnb1xv4jh43n50ujjxsmdrv9h6lzhjhjxwgrjqgtap	57089.19999999999
bnb12jcyf5dkefyd4p2pe2cvkwf5u3p9tymdwpykgf	55855.80000000001
bnb13t2uuxcjelhysamdy0pqw7m6g79zv8ddng5wng	56711.2
bnb1nlxa3z3nrgdg8zkv550ua3pllm5sqc66vwc9ca	56282.8
bnb1ny6qw9tqsf9s4rfnlcexmxjgmqcpyzxcx6r29s	55798.4
bnb1l3ftnt3s23de9e8hcemvpyrrq3hufsu5t4p8vn	55932.8
bnb1s9ee9rwhzsz8z47c78e77d6nt90ju9r6x6vdpv	32676
bnb1qelv08zkl623u5uv98cwpqrcdrjweyf9ufz09q	55010.2
bnb1c8gfa6k29vyeqxa7prjrtxe9ujgzyl84s562mq	49648.2
bnb1uewdxntnk9pgdh84vdth05z5fhcs0gzs05ek5w	52129
bnb1nlwp6zwg5gk0r6prtl339at5mzun006l0s7a40	49648.2
bnb1emjhh8en9mcy2alclfhasq8t5fgl3ulapymumx	53739
bnb1jzcdaw4nl6kp3vs2z6wrmpvkttdj96t7p5xznv	50164.8
bnb1txsadmg2gklm9vtzapwp9wa3mazzfrh0d05v64	50985.2
bnb13whhaqah3ha7u2a8tv6duentqj0uxgwkc3euuw	52806.6
bnb1ke0y99g8p07sjfkpxarq8tnxkwnz2aeq3rgsh4	47002.2
bnb1n9avl327k6898alwwfq2hspvshn8j28j8ghye7	51898
bnb1nx073cvdh4jwwp0k7q04mw6c6m4re86m2h2qh8	52530.80000000001
bnb1mu4dge3np02qmxwjcvvjcg72czcm3pa5ax79gr	52504.19999999999
bnb18s0yptz5205ql87jgmc24ud58v8t0z7sdp45sy	52319.4
bnb1ezq8ja7ydlakghwxqcuzyd8u9g82704j8zfn8e	51520
bnb1j987tqf9e5mxelnpav3srv4d7cv4vf2azv7z0k	51410.80000000001
bnb1at96vtr6jcllqp4c23z29ch4drwemkfyzgj3th	46128.6
bnb1gtcvdjs66ayk8ftal7z37qgk863s7wyhzl3u3x	51346.4
bnb1sh8l6ry4updm6lrwxzeng5anqdumdtzqe7j5xl	51209.19999999999
bnb19l4lpdr7z2xuc9gllh4vqwt7qlw3ccccjvr783	49648.2
bnb1hfyj6nqnsge8zjlxneyun6gnl43e3kscgvgk8s	49856.8
bnb1qycgsznfunus8lr7n2lf6hw90s7xfek42vehvh	49763
bnb13gmnynvlkxkzpnpfttuxsww7kt2jskp6wntqv9	49722.4
bnb15flf74fv9nka0u5lejjmngal3wa09kxlcfuqw6	49648.2
bnb1zyvkhqr5c3520rhwerntdxt2az556fwqg3s6q5	49648.2
bnb17pjul7euxs6egrlu3wdk2nlhyk4mrspdmhh9fk	49648.2
bnb136vyll3taevqahu8l63plc43yqa0ku729g7tdp	49648.2
bnb1fcggj86uc70ddcmy6ue7c5fml4en40h6akrfg4	49648.2
bnb1q5e903ewlaaekwr6e2m9ptyqay0l60madhm63t	48162.8
bnb1wfkdaekv47thqa9skdqsdu0jkgepx9kwvsed3f	46009.6
bnb1ln8gpa7txja4fv9wk57rdnvlp5hqcd9mjyu7vr	49099.4
bnb10w94uklqzmf3ed70qw8xt729kvd6jlrw2fkqme	48811
bnb18ywgmqjfqavf6fkth98mjeptnphfxl7yulf7rq	47824
bnb1xnh2uarjk6hlun7a6h8htq86j82x3rpmves08e	47467
bnb166fw6frtj8duaatgsulmy7wkm40484ada7j2pa	47126.8
bnb1mw0dse480untejufrkfgchkn4y55uqnpqt2sq5	46456.2
bnb1mmhmjqsenyy2xsa3eefqff73u8s3kakp6exfj7	46670.4
bnb1shhwvdww2uuzt4s7wqjswmltw2hlmru9t3n69c	46466
bnb13t833dp6pz56c3ut0adt8a7u7u3j7sjxn7e3x0	46258.8
bnb1kdj6tm53lx9st7zzuugcz3amcuh60cveegh28g	45311
bnb1kfmhmpmn5p623nc0pr2a9u4n586h37fkjv42mm	45364.19999999999
bnb1azxegayhzpemvwh23wfl2vczt37vp2r9qltw44	44683.8
bnb1dw2p9e54c4hvdh7y0cl7t29gjnhgvha6ndhl73	44241.4
bnb1a092te329r7uez2g2ednn3szjzyp89fv5nx5k3	42893.2
bnb1myzyxl9c5hxvk62pvsn57s3w596af998y3lxwa	44426.2
bnb1z8y6sursld5eq482kc07kk4j3najm27960gqmu	44384.19999999999
bnb1jx0esfkr0vssqr2m048xlrfwav4vsclj326ahj	44371.6
bnb1jluwr2nl68naxs9nvx0mux6m2amdy32atteepf	43491
bnb18x9tr8garka4zsrfjq640tlegw3r4a22y43etw	44193.8
bnb1k8e6s5x5vjlvmghr0w90xjfc5cek0dq80fj39g	43449
bnb10x2za2thl97wq3cdrlnpw4n9s97qdzjnjjh2vd	43058.4
bnb1mgykcx8ml28mwc9hlt07estqmw33ket5vvx2h7	43206.8
bnb1jp2haw8c635wufu6c57r0guk57nymg87ml4ll2	43169
bnb1xlmuwu99yg3vanqj4xfl397p0ngfepheu2wfcx	42609
bnb1exnnf7lezfy53vf6q6lsaze6lc00ctemaq269k	42200.2
bnb1nq9umrklt842n72f4vundl9w9fey04wz5q86yw	41120.80000000001
bnb1h52t7mmkhs5dt0zqrdw0gstzvj9vwydyfse74z	27956.6
bnb1z8sfl6xh70l4d28m9at35xkx5jlx6tj8qexufd	41769
bnb1xa2lhe0yfef7m7u2vgjs72wpk0vqf599h6k7pu	35988.4
bnb1knem66l99x8yfw5rmyd8gn07vqfc9kcstxgz89	39719.4
bnb13lva64g77apzxmm3wy7slux6k2kddedl0r93zt	41111
bnb1qhx26x87tadk83hapzvhxtgkcjascpu2tumalg	40486.6
bnb1aey6sq47eg535050hht3q83zzjq524quar43cq	40293.4
bnb17gxece0k4l3nx8e0zqpxqyftay8dvsz5hc5pry	39956
bnb14rk989c4ufkc3amf0hm7zae9cf0m90adnds7x0	40251.4
bnb1g70pfy6m5f5pvxd5du5aqtdgvxz2z7flln96lz	39649.4
bnb1rf02c5h6m8e95yx6rs3wnmr395gj724y6r6zy6	38507
bnb15kwejq0hv49w7z7zqvgjjslf0tgerjxuwpj8hf	39536
bnb1dt4482mqws7lx4t63v88a378x2dhmgha602yqw	39793.6
bnb1ka5lalveaqafq32a0g0cva5nvs98mm3v35ufcf	36338.4
bnb1rrqgzmha9q754k6e2hhw65hzkhxldpgjyap993	39208.4
bnb1v2zvptzwx3pqj9s2tt0kzunucd6pdzysqwkzk4	32851
bnb1pqxxh7ral52cvh8r2a0qylxccxleqz2u5sg3n5	38521
bnb194qf7hknvakgfwn0866rrdk62m8m6c0cr3wj9m	38196.2
bnb1aw7gc8fl0us04cnm9k8p7j48eqwmjcxf8zy3vf	36082.2
bnb1283plut7k2f6gx6theptc3kxwfaq30rw5nw9jj	38050.6
bnb1vftev5w20zs50vkh6tu99yj5nkz24epm0f703q	37448.6
bnb160lnja6l0pq6xxcwgar25yesldrx8xsvl52jmy	36738.8
bnb180vu8m9zsw8m9ty4qvjsczh5rlrtmzs6ct8mx3	37118.2
bnb1y47uavx0kzhq067aqankmsakhrq8frdm4huf58	35746.2
bnb1646yxaa8qk6w3u8gyprecg9kzfwc8ged67w5pm	37063.6
bnb10yhnlcev5f98q6udmzmfl2hmgq0vmrun3evslv	31824.8
bnb1l7g7zd58z04ls6f2n7q9y4dddcv3yeedg7umz5	37242.8
bnb1vwsg7n6akl3cfu3advpajcxpgc42kkpdxdyns2	35659.4
bnb1ehdfr4lt60adtwa529gf9va7xscm0vg45up42r	36142.4
bnb1p06d5wsuuqsvl4s35zesumpn0svpynluwmymjr	36229.19999999999
bnb1f8zl50cggsyjtszm75lnskx2g563jvnnhjepmh	34874
bnb1p2xf0w07jffvkdns5ksjevx5x6u7ql0zcjsyae	36092
bnb1gdqcs924qjks2rxyttxls2s9dnkkncu26a0se4	36001
bnb1cfqzdqcuskrx3dm3g6atnrdh3mzf5zeku3l95c	29789.2
bnb1aksgd2hm9mt8vxf2kw9jlw6gqtn2nuw4acfl6m	35746.2
bnb1h7p5l9ft3lu48wexad83hnqc5uk7rgv44yplxl	34904.8
bnb1nf75ufznxcpu0wt5ll99fa9urxfa8rfyujxrdq	34581.4
bnb1m35frlx3yz2tk740d0lqzxg3tlejqzhgcwm2qr	34561.8
bnb1ggayvcanas6wda9wfgqd2c38w6qxn5nvgcc2dk	33433.4
bnb1kqv28qez2l0yngwsz0x57h9zmfckv2xtv8wwlk	34098.4
bnb16es0vrgv6qa4s8ld93xayzsyqet2xufclarmv9	34007.4
bnb1v5g0r3marhuktlym5en2rxgjx3hrr6a6yrmvnl	30205
bnb1vmqc0unyv9ra6sshtuqq0hhqj7k4qwnt46ewhd	33686.8
bnb1rx4a0grmnf9vjljal07cgrjj385yr492fwap0l	33436.2
bnb1ftk3vy86790r2qtta6342zn6myehla0jqqjjqw	33348
bnb1vkwtw0srnfn4uhsykgspgvptea2zxs863mcaqg	33275.2
bnb1tkgp8ggvm84cmqmczmt5cwqpwxupr808jfmlnk	32303.6
bnb1ykja4rnkrav0xlcrr5y4mczujm7f5ast95tv6h	32902.8
bnb1m4kmymfnf4l85k6u9k8egylhrd55rfdzqafd0k	32688.6
bnb17c2w4r83qwgy3vh3v6t9fzlxxnw45nkx7062qz	32013.8
bnb137yck47w7esh2wkh0gwymnk36t3tacehsqzrrt	30781.8
bnb1rzqjc59daekxenngdlpdpwju5mlmqv6ljd678h	30361.8
bnb1lmzd8qayljxv25q7nljar2rcynulvq5dzt8rtv	31774.4
bnb1v3wket664enqfya2fsk2gl6n07s4695p4vvmys	31616.2
bnb1yyl8kh2fk2mwlyl8m04ycyz709368j8q3mdcew	31595.2
bnb190pgdfzsgkr57scvzqaxvsgus3penn2e7pt5lc	31488.8
bnb19dxdxajfz0ry3g3peq3gaj7k5gls64qhv7033g	31022.6
bnb1eqr56au9fzh6d4tjvsvpk7m4rmt0vusk2rpsxq	27927.2
bnb1ly4lny4zk6na3xx7gzfaqjn5n4jrfl2ud4jf4e	30037
bnb1pq975jggw0j9n9v9xzfwenkx0sm0ywmvk0ppsr	29825.6
bnb1dxm39zmw302dxqf3888y729wlkpmhp5wlgv4qc	29660.400000000005
bnb1yk07u9ytj73p4xuem8zpc44k2eeat2j2xkdeq5	27265
bnb18c0qur6s6adayhhfgxgyy07cltrsmw64y38dts	30076.2
bnb1rt63zl9ugf4wgax3dv9jndnvzeqpjqrc6kxn6d	30049.599999999995
bnb1lss0l32lq9cju3ea5jwqqncrd09g5tnlw2uzpx	30048.2
bnb18adfq2ka9nn78xezxtcxxj50m6a6st2srm2agk	29853.6
bnb1pnrjfsmwqd34xlknp0wx8qd6qn5mvmaha2h86c	29815.8
bnb15a7a0h3fj2x6ful4gh02ywj3w5t3uspzy628gr	29789.2
bnb1plgrnrmemjap06lc0fs5gyndwhv3m8dvef76pp	22583.4
bnb1rm7aht9ej2eaefrqqn3gq98wvnqh2zns5ttmkv	27451.2
bnb18yez6ept6x089cukeqcj4lnfpvwl6ca2x67jgu	28709.8
bnb1ylumlnyv3p5220zquynzrl2qxzvyl8j45r7728	28299.599999999995
bnb18sj7alq4xjwpm65swjk4a7acnekqymgedfe3lv	28694.4
bnb1vf8dfvngvkyzqxlnl33drwccppv9y84dy4lrd7	28603.4
bnb1pl65p034vwwz2rd4gft6f95tqdvdhsevd7lxcj	28343
bnb1z426hfsc4fq9ssu426vfnsz2eruggynkwnla6g	20613.6
bnb1gymht9ffkxxj2ecdw5epcx6ua5nslr3mnw2u39	28226.8
bnb1x0fysej2vw3ghmly4huf693g4w8jgmzdsync05	27804
bnb1whjp9gk9zlpjjve33r0y7w5lfcswtyp4m608wr	27981.8
bnb1rzzr6ladwumz77wej6r59wvju55pt404ck7l80	27547.8
bnb1e652uxaqfv0984klgd0644a5ml7lc6th76dzl2	27501.6
bnb1z8cxmte8tfw0wr3a076s2vspurk99ads4dzzca	19884.2
bnb1yxx3grdj8jnxfy9yg98v56grumhmpvw0pml8ly	27305.6
bnb1mn4wl7fn78a08f62ctxnt6kl2jgkrra9mwuzsn	23004.8
bnb1x0nz9hjxy4x4k23v6j7f3ts8eznq8gdzp7d04w	26880
bnb1upuy4dfemc2gechyaplaqsa2qa7gp0g4wa0ae0	26187
bnb1mfge43cjpe68sp9kythc4vqpyrpd9hkyr2cjv4	26609.8
bnb1wenmf2rzkmf987ds9glnjm9r34cgmrtcnnh2rf	26362
bnb1rzw2ankzunv08fd5tsl6xp55z9pn4yl2fgjvst	26373.2
bnb1m9f9maps2kqjdjg3d4jjhj9tr7c80r25mjx9uj	26322.8
bnb1erwqf9s38l9dely83g50f8y2j2jmpm4v3alqga	24655.400000000005
bnb16k8fuj2emd20zh6qch5e70fkgky86l5vyvg2um	26005
bnb1dxf32yq6lgx33zdrexsapy05f3gxqzumhetlny	25984
bnb1gd9ejkln27r6lt340usp6vk2h6hmgp6u924lh6	25933.6
bnb1348jr4jjmjrdxk4vtglmzs7wect9nhy8lrcxpw	25377.8
bnb1xplea76hhgw22yexp0qjdcer8ej5ppvrjcphtq	25137
bnb1yg7xjzqhq2pcs97t0axrcskq732pvcsmwm6ac9	25302.2
bnb16znr4gq8a89eg40qzkvnp8vr30efxu9mntgykq	24728.2
bnb1vv0ms2x6wj55h5vtlm5p20vavg9zr8s20n4cal	24864
bnb160fxd2ngr4xd8qcrundqvccl0vx06kwr48g4m6	24824.8
bnb17umjq3zskuttsewqxl0s6p8aj2syfwhw0qxwcf	24014.2
bnb1cqf0dzrgs54efmzr070tt9j3cpgpe72l8mugzc	24684.8
bnb16k475042gh550qwn5re3j7wfc484c743cdns7s	23254
bnb1un9e99dlc0zmfajnm8f7gwdd9j97suxr9fxe59	24164
bnb1jkjufugqnvz8llfueureuhsv46z6jwj523fpr2	24238.2
bnb1kr84m2uyudg5qv3qy03ts38yrep3qc3xhuc3x8	23125.2
bnb1khtg7refcdkrjnvwrxvknh4234hcsgrfkhj3cq	23440.2
bnb1pjexmh4fx5xdymlpfjtzvl23xnz00e6l2f79aa	23237.2
bnb1ryr84ww8a3x55h8zqajexm0h4rvekf5p7yv6yk	10008.6
bnb1qpwpuap3h6sdty960k9kjugne0nggxpwgmuk53	23028.6
bnb1hz8f8ejs6uy3fdyg99fk38pkmm3grxf2n643y4	22975.400000000005
bnb18rtwuwfsfa4mjlt0v448l5a8p4yp8w8dmy84c7	17774.4
bnb1ynwgr2jv6pjlhpx4gj5p5fwt9jjp7mdhvrg84n	22702.4
bnb1k43qxms27d3jmn9vgdadlj8nzh0k43ckv644kz	22729
bnb1tkfdgcn0ccuyelu3zf98a5p2g3pj70fe8pxrgl	22197
bnb1jhdaa33w0067yqn3n8wuc26kjvaznnm0vmwv48	22334.2
bnb1c4mfa6rxt5q7h6pg7yf6sxktu58vr2yr7xv6lp	22313.2
bnb194pk5f7asjt4hm8ez6hvsvxzgeurf3qzk4cneg	15100.4
bnb1eyt7lpfsmcjd2rsza55zjdjy67a96c30a70590	20941.2
bnb1k0pevdw060dug3ld2cmwk63gm5kn8qsnaja3q4	18536
bnb1n7w32q9ehdcz92h6w7rt68hqyvd5n3fl2n7tmw	21407.4
bnb188prk8av7jkhf5qvj75aec3fmky0uv6vhfm96l	21093.8
bnb1ma807q85ms9aa2upg4hmha4kjaaeahsl0gjnpa	20900.6
bnb1qsea86cyf5crtsrngdfhwk4xm5gvzj5690asjm	21043.4
bnb1uj62c2et9pskuqzv49pvrc85kezlhwh5xwys6w	21001.4
bnb1pp5szct76xg9424x2d53d37kzsszssjsl8f4ve	20767.6
bnb1qpqlczwcucdh2dajve4ftccwzpsc4r4488n8au	20636
bnb1fpdgkw8z85lkuuaqnnmvuqmahxn24r78vtp8dq	20496
bnb13dnnqvtv5srm99rm7jny27s6t37xffxmv5effy	20694.8
bnb1xk2049agff679pnah2u9z3mtzx58c750svw6k5	20322.4
bnb1kqm2ecnxpydr5hpcv7x9rpqzv7zxk2gl6y6454	15332.8
bnb19nh5z6h4cllcdg8rp3jm7pdnlweu60h5l9zsp3	20589.8
bnb1rjjx7382fzjw92chx0n5pcs9gvd0c44tltt7qf	20517
bnb1uacq9mwuyxswfr03vtg57ph77lj39l8dzpgzcq	17977.4
bnb1vudr77y9k2s0yzj8aaftcast968zsncq9k8sw3	19859
bnb195x73dfsdy5hksvwd97mhyjwarsy9jdyysxakc	18653.6
bnb1prdkexdzkr5mhw0zw8nlysgt7wtum0r2eltgr6	20123.6
bnb1kpc7jfyj5vxq8y4tcdcuyh5rrpzhcm6cpfmy5g	19775
bnb124w0yzh5fl82pjkcs6vn8khq90zsexmeng9qn6	19896.8
bnb1dmqq9k5dghc3992q45wsheqq9wvjeumszpldx9	19859
bnb165pnwqpq55h93amx3a6gw33femcp97eaws2j9e	19859
bnb1pkhgklqs8zt5ylcdp6p0wumsqa5ackqj5hsfkx	19289.2
bnb1nhsxkz3dnzyqa8awr365nw6a34z2436wdwf4zp	19447.4
bnb1ju8z2jt30cmpm6vllkck4lepjs3llh8wc35vjp	19149.2
bnb19rcldxq0qccglcyyu23m43tsv57txsp4ugrjpe	19051.2
bnb1zv93hlu96jeg6k2qxdrwkvu37f4ylgy9cpt6dy	18597.6
bnb16tvezd4v32eze76vfpve64s4fka5lfhcuvdy9x	17430
bnb1nlun9rtdcyerg3vqu97mfcx3svdtuset58jrzm	15390.200000000003
bnb1r22z3r30899juyz682d6q5qjcdg49nzywrs60e	18102
bnb1fu05hmv6zkj335qv6mpwjsm7kd7wkhyz2x5um5	18090.8
bnb178ffmj7ce7a7we365fc45hgnqk4c9wte5c8qfv	18048.8
bnb196archjv967cz9uf2kmaf6q3khq4xzxcdwa5wx	17820.6
bnb19pdp30d8a8k0rmk6wn44e8x789nx5sklrzv65t	17427.2
bnb1x4mphla4t5d7cznpg7papdklrtkdvv2yqjx675	17662.4
bnb1x4vn6rn6rujsqd2wnmg6exq900jv20rqdfl7jt	17522.4
bnb1u22vyjjx6v4yhy70n8e4hyl32wym6dy8tw62zj	16605.4
bnb1rugk96uaj3h5t6t7nc7xtqzx8qg8v9he90vqls	16641.8
bnb1dkpkyc9t0kuh2n5cmnalae3v63evyu9dmx4gkl	17533.6
bnb1wlhvcgsrn54jr2w003e9m6jwyv3c07g8lwav0u	15285.200000000003
bnb1rfv6d7u60ppkw6warky3qj40yqd920kyt7aghz	17186.4
bnb12jj3srxqdzhymqqzc2l684k4g7adcem52tgwcm	14207.2
bnb10xxd2z68cfljn8wqx2atnta02qekyptqq28ax7	15887.2
bnb1kldfyslphmpn70frclgptncfjyf0pyp243fh5x	14697.2
bnb1g3e3ml360aj5c3tk68x4x4jgj9676ruqejkfxa	16147.6
bnb1fdnkv6zc6aszqqesvh6fervw9mqzkyxvpec2pg	16384.2
bnb125nk0gzl5h40xjaferzxq4kmww4mzej0ee8yvg	14393.4
bnb1h066plzq6xr5v94jft9laqys0afl7fdeg4h3px	16163
bnb1zwhwaezlv3mzs9h2dcjuna8vjexw6c2s88yx29	16158.8
bnb10fg8z9dumqhmfhm5s4ghyh9che07hplvk38k6t	15909.6
bnb14gdmj5dast2yyu9gtfxjtjvy482v3ykp8p2csu	16136.4
bnb1dk7my4lzjg0zu5hwy40cxf6rq6hajzykyj7vud	14567
bnb14dfljrfgklz47gvw3ncmymnlgck7rqkcrgl7lu	15632.4
bnb1sk70g9c2mm5rcdqqwlrez35ethhxgejjelgrlz	15331.4
bnb1rkrkr7gjpc5n3lwulqmdrvygup9zyhzy799t3t	15398.6
bnb14jdt3rxytmk2ul3mgslrpfzefazlw4esljdc6f	15331.4
bnb1fw0ut0j27gnk2flxvclrw25wh8m3vslgx96ug8	14616
bnb1kjsfs8hpc6fwln9fn8enyzsw97s4n0z7fd4t4q	15069.6
bnb1jhrn7w86ag8pgywuuxjef4xjvqmfepj4xprt6c	14894.6
bnb1hwhwyhjya400zd55c6l95s82s7g4xdtapaa8v5	14754.6
bnb1cmr48486xw3hda63gygx4wkvuvt5yzecastcwe	14936.6
bnb12ecnrm7tjxkvzxvrg6udyreh2550tjw55kuxce	14527.8
bnb1e5gv4exwwkqvfx9s20pyl833prcuegxpx7uz2w	14735
bnb1qyl5m0zh0a9v7zkgm7xlrzx3jhrnx3vn557nv7	14498.4
bnb14hre8yganfdpyq9j5px7mfxc4tudsmkat8jzze	14263.2
bnb12vqfkhz8c80x9fyusmfxgcv3vf93d80xmvz0ad	13472.2
bnb10hhfeyykqdj9h6le4sd2r4r3pcey5sjj9exj8z	13675.200000000003
bnb1k0pcvcevlzckucfqveypm6hrmd58qy62s6hdah	14382.2
bnb19e2l574980xrsj52fj8mvw3xzu95743xg75ml3	13902
bnb15zf3vqn8r5fvd35z89w6qkgrymq6t36kdqjdef	14124.6
bnb1qk5ugzxcavh2z4l9ayru36xclnjp4g9hnx4twv	10127.6
bnb1zuctl7ev5q0r6pmy5rvxfyscgjy52zkgu409t5	13778.8
bnb17h2ws5j6k9y36dq2r2j4ut6alzlqpvslrxer0y	13608
bnb1th49sgwvnh38ch90jhxj4zu0ql7hfq4hpmnk3f	13608
bnb13xayja7mmwxzznledqsddaclfahdy407m434ux	13568.8
bnb1u60924l08dq70tven5dlz8n60m6an59ksyf80e	13311.2
bnb1fg4s0udm0vxlr62czepc560qvkm8u65xgd06zz	13447
bnb174ksd655k7qzuhv84p7h0uzcr34f0yl8fwtyen	12609.799999999997
bnb1p5rfq3cjhrdhpl7e6naksrqzccv0rpanrp9083	13365.8
bnb18wx8c2kg30aga4vhpqjtzm90jagng7nwk89cta	13336.4
bnb12xacynyfuexhu2v95yvw2np4rpunl8d874m94c	2020.2
bnb1dhcl3sm5ju7e2x4sll0375xcejzc5nqjnfrly5	13120.8
bnb139gv0ujs9j6kafnt2vmkrd8e0ntfnmsfe9sn9r	12789
bnb16dclws769493quc30tvufyg06kjrtkl2cux5tp	12632.2
bnb1f040c8he9tswy7qckn6qnttnh239uyw9hg8efe	12759.6
bnb193902zchc050qa752payuxavl3zegpl40nx6qe	10724
bnb1cj6kehr2zn0nukvsmrfmxqp02lsf9j9u830anr	12787.6
bnb1q088cl283vhx24vquj9uwytuevxrz98dq3yav4	12511.8
bnb100cv83e6egqtnav9c08www3y377uwhx3gr8um9	11163.6
bnb1hut9uz7kjkfcgm7p4ww0hc2seack3mf8quwy0z	12552.4
bnb1uhvralzp63g4tcmnk5mwjsms30qh3heu8p0ngz	12552.4
bnb1976xg39yru50dqmwnk68ju8745fl97rejyjvc8	12094.6
bnb1p5lqhax6x74szyzz9ray3hkyepd7txznwsfy8a	12517.4
bnb1l3qz4kwumtthq8s7ze87rmvrn0cc42309wnyj5	12412.4
bnb1n0nqhy536za2j6szald86x4f2dn6g8fx5dlxcr	10207.4
bnb1dgdxwulcepwdjdlmvx2q9cz5td0tdklqyuv0fc	12469.799999999997
bnb1rut578s59pql883p47k8hw0w09yujveaw8c3dl	12380.200000000003
bnb1jgakwh49wxlrk5y2n0hwyun7ueayszn4zp5j54	12257
bnb1nudt74776dequ8lxwwdl49j0j362krqglae662	12145
bnb1sesdueuw2walcpu9tkt7gcwfnnls9tx68s5l0m	11050.200000000003
bnb1n7tx92khlcrjj6ugpehnat72kmp47umk68gff7	12033
bnb1laqhyfucgx7utlvqqvft5ftd7yupvn404md0f3	9930.200000000003
bnb1yyyhpp4q0apn4qeuyqqrx2jueg2c587wf8flf8	11953.2
bnb1rdcw9feq09d4ha09z92fdw0wlezl8mzqpqreld	12021.8
bnb10dkwapwjth6grg65pg6hytrwhhj0z7xhcg4x0s	11981.2
bnb1h26y8uh7dzk74qe6y9al70975fyeql33muj0lh	11979.799999999997
bnb18jj6nak5h7aad2x6zr6x3fug085f93pcg0a5df	11872
bnb1g09z0xer5w03gx0z4fu0rhux3sksxthsh5fn5g	10911.6
bnb1utad4swt4hp5448uk46pzgr5al9sz4w0ypheme	11950.4
bnb1upauy2lhuve94ys3ulzjpg5v60plcrapzpxldr	11832.8
bnb19gj3uepn5ra602dpvmkjuuw78gjprjvea6fjvp	11888.8
bnb1hsakn8w2qu6eud9dfang26nhz2g6h32psh9ldn	4447.8
bnb1we2rzwn0y82hq7uj9el636khjvmrlng85y7glg	11708.2
bnb1f5sn0qx0rumkguvzlt4cmn59k6a8fjl46966d7	11782.4
bnb1tw3rhz2n96c5mdgyf4c0y7zd66gmajjde2aq7x	11734.799999999997
bnb1tv7csvm6y0kdnfurkmgwat3xzcrhsqn0cj4r8f	10794
bnb1zc346s48m9n8en62z0pf42nt2lef30prc45x4p	10929.799999999997
bnb1v02cvc3qcw8s36lchy39xfqu32r8jkmwwv4zd5	11439.4
bnb1qcq3rfy9vwqglcg2022zv3v0x7244eyc7j974d	11516.4
bnb1q5rzfa4gspf56rxsqcakstqjc20ds0s7sj4p0c	11432.4
bnb1dp2ld8ljne45wetssxsz6ufj7kxyw6d88a3z43	11503.8
bnb1zqewsml5wav2f8payv3kngsvqtsw0yj6jtqxzn	10344.6
bnb1snel9skduw8fu4u7x8a0v0y7jejqetlsc57qfu	11186
bnb1tdcdcvskw6077qdw0tlvlhpd3hem9ddx3pafwr	8222.2
bnb1yde4crz8sk27xvxn9qkndealn5s9ydr4dpf44w	9417.8
bnb1n2dc9jp3afu5qeajxv0w6d9cj7vwhtx2k0p6jc	10295.6
bnb1ac8yph5pqj2q0h5wmtwqm49d8gm6a7gw5mvpwu	11096.4
bnb1gwrcufymvgqre2e474y5a5qv4tqqxdjdnpzp7p	11085.200000000003
bnb1mdn44ha6lfamtwfa96sjam65c8fagaw3xhqtg6	10284.4
bnb10xjph45h0fgcls6lnyphtstlwaz6634aq7wa3m	10987.2
bnb1gjq5dqkwpxc06x5jcp58rg64kex590t03ucrss	10901.8
bnb1z363jdf6zvyhemgccxt37y7rmk9txz0x2m4z72	10302.6
bnb1agw54hev0het64h3q2zm8am3huc0myl8vs0psw	9930.200000000003
bnb1tvds29m5pz7salul2q8hjxyl8v9cu728zfxaye	9839.2
bnb14gsx7t8sxms4nzw8n3x9rdwq5mqmm7wwzyw5d6	10544.799999999997
bnb1kvtvftccvmn9mh2qhztvpsg0zxlf5cnd90z2f2	10656.8
bnb10fyvuev2f44hk2tet45vlxrnraf9pm7jankrqf	10588.2
bnb1lje7zp9ftact0e4mnpx5uw0v4uwlas2j8hwx40	10508.4
bnb1hmwz4e37685j2tzlt8guv5cn4dtwz4vj2zmnu6	8727.6
bnb1exa84l59qrey488vpf8ru58f0fpsmav3cmp0t8	10343.2
bnb1x9thgqjhty6rjlcd6vy3prugjpefmfwqzz4era	9787.4
bnb1cqgyl7yvng7xl4plnve7h3r0scycm5yt50x4aj	10376.8
bnb183gxx9ea5fqjgaxsfjjm8qc6pr4p2pj3e92gen	10336.2
bnb1e7c7fm309yq65vx7nak0232zt9lh62eujxfhnt	9930.200000000003
bnb1r6847va3achrjxxtszpsuf8m2kjrzgyqzg8uk3	9965.200000000003
bnb1y8xazlf36kencpsmp5mvwwhj7eepfkf4ztykea	10074.4
bnb10k9s4vlj26ss2a55cfyuh55jm67cx7fxlkdlet	9935.8
bnb1j0k3fwz4ujqjyhmgxey9a3svp0afjc0ck0rf2y	10116.4
bnb1tqxmc3kkmcgyh5l8lp8a4rr5z9k8lcv6jlfmce	9994.6
bnb1qrme50srncmfttz8s6f2kxfvxlreywkr4ymtxx	10043.6
bnb1wp0sm926hqnxewnud6es6s44aed4tkqq8q2rd6	10038
bnb12m8awu57mpxx8jyaf2g20z5ynhsmtr8kjlmr59	8190
bnb1gvnneevr42ree4ylsh5sd2f3cqwrk2kkpy02j0	10000.200000000003
bnb1nvzt9glmcnvvgussp7vlwduv4lv0hs8w34qvq7	9973.6
bnb1jed0duuua28cnd9f845kdx9e9y0h7hkzcmxypj	9930.200000000003
bnb10n3qdcxwm4h4karwqhz5ywknmj5cxc7x7mew04	9930.200000000003
bnb1ljfdv5vqldp3wxl6yp8wfxr9vcm0yu6zyeg2p8	9867.2
bnb1zn6q4yu4kmp7psedf206pl24a36hctcv7dfgc8	9844.799999999997
bnb1xqrsghjjcqcpv0uftth7klwy35h4nta46nexc4	9776.2
bnb1tfu4la3j3t4jfgk94kn4f6kkcm0fuc9r6geruq	9756.6
bnb19y0wrtk5334mqwcrtzqwymkeafl5vdaxywuxea	9289
bnb1v87dy28978et8vsrssrpcfqdn2v59y60nvgkvx	9618
bnb1h0vd5tlhujy93aaegxp88xsdnamsp0yrwqfyv5	9346.4
bnb1q0yjlcn33jjah5dur0rupc9f7yq52edjkzt2tt	9510.200000000003
bnb1hpsrt58fqqey6xrlhzfwphdpj2tw5r0mv3vayy	9129.4
bnb16sydpwht9zvvehyajnctggy3dm7yfhkrqfvr55	8472.8
bnb1tkhxs7u3ws83w0v4whve8sxxvnhchk9cmmxchc	9328.2
bnb1qx2xkgmz27t0s7f8fc4xlyc7485ytr37rpely7	9256.8
bnb152shmgrzwfqlla6gzcmz3nn8rsfv2davjrhwpp	7026.6
bnb1pkww3q9ch4vr6uuy0525n3j3657qhhkpuwfnz2	8346.8
bnb18gaw8eyxmswj0vxdtd2ua6xlkt6twjnnymw6pk	8447.6
bnb1p00ausmd6yt7lvqym7x25ydw5n7hhxwpdq5d5r	9234.4
bnb1qypt5lw7c9sa2nvfw9cmdwwt9s5fjjngww3mvj	9079
bnb16fn3sdt558xa3gjhuyyhwmnyhezhtx9f50w9x2	8936.2
bnb1dqzvulzuwq5w8wej2w5mxw89py36p26qz73p54	9069.2
bnb1yhaletwspqzw05agefcsh6ufr94h9g5l8trc62	8920.8
bnb1xe2jn2w6gefd3vk0zalckm5pz4g95nc3sghva0	8912.4
bnb184euge8a4pveeafhk4ytap95rdmf0lxq40vwvu	9038.4
bnb14jntfdgm4eety8r83nf0g8hsrjydml7ud4gmv2	8933.4
bnb185f2h2vu4xufth96p5r46gw0p0t89mljr00xen	8726.2
bnb1ptr5psyexlwk0wm50vmtc9zkselnxu6l2s70a8	8843.8
bnb1zy3g3dw928af6vewvjpg324gwv082epnc94tvk	8860.6
bnb1g2t0qkjlmsufputfneesljepme3ujp9lzyvm4c	8843.8
bnb1n7vd2frs2lltn07r333dmgtl7574j6cedgsjkx	8736
bnb1lfe4v29gyvvl5wqgn3lhx0vg4zj462a48zzd0y	8589
bnb1k7v8kdtsdrhqd4hdxusgxh6wgja3d86lnjc4gw	8696.8
bnb1077kxvcunwugm0jyh824ugasa2ttl3vkxp2wet	8691.2
bnb16g22ty7974vsez06phd5hy6ulwx7zkctzy8sds	8572.2
bnb1qlgrcew9rqx76f40aqnpm5774xryjs8j05mzs8	8559.6
bnb1tmypdtu4z4mzvlpz60etmnecakdy5yttxfz4gt	4468.8
bnb1uk4u23y34m7hq0grxz0e34jxeqc5krsgmkdjs5	7943.6
bnb1n3klj982pseatz8d5g85g2hg8k24l7d85vrzzv	7639.8
bnb1mes90fgapscq49qy3u8n7kteellnshyl2tz4az	8432.2
bnb1xsmsnp7gu5gyjlzvzp4gzaxwdavhfpgxznsnlr	7147
bnb17rgya8gw4nnelnlt342y5cm6sylz40upjc8ml4	7840
bnb182c45t9wna0jc5jwpwrexxa7sckr4jwaswy88z	8153.6
bnb10ymuac5fgyqppageqq95mux2p2aksyhhw72c4m	8153.6
bnb1ue9u9nzmmpk7aavwg0dns9lcgxv7zxcxtvlu2t	8171.8
bnb1sf58t00clyyugv6fg5myrpnm6zzruxp5qkjzf0	8094.8
bnb138kf8hffzye3fzr93426dnk8hz3f0v2uy3jws5	7943.6
bnb1sxg7389ldm09ep8jq5469583tducxr5chlkvzp	7943.6
bnb1wdgz5cajwz4703athjzyxs4lj4tpfxhvqzqt0t	8058.4
bnb1za0xm0dsut4sz899q39dz4q4y4pezmwv4z0qs9	7894.6
bnb19760lyf8tnlrq86m4h26wr568tz3cd08vemu9m	7992.600000000001
bnb1a79mvkwf05n4nvdlvkk59tfmsx3valxktffpue	7992.600000000001
bnb1ycef6vvkvts08dwfq403jzv6cvfddxcnrzxfzd	7943.6
bnb17cv2vkkx9pp3r0ewgu8w508njd7j6ss9995r5n	7275.8
bnb1hxepem8n9ztcv2rscxqrsxfkmmswnq0fe9hucf	7849.8
bnb1hduawkppfwg08rq6erpvcelmys0lmpfzt5r3eq	7392
bnb1q573szwdrju7jkfjjprwrvy6pdtsca2fca2f4n	7590.8
bnb15antd35tkyurm78kcrkhnf06z9nsheczqtw9sp	7343
bnb1jjexcgjcjtl6nfrg6wd6tkhudu77jngc3fzrq9	7323.4
bnb1w5e6htsx55xf4fpp2yyawlgvl9rt06u40nh9dn	7368.2
bnb1avnu2rawqg2jmagwxvul662pgmjve49y7eh893	7358.4
bnb18eu9xmmexvelzkgck5ps3jgt44c245xz640yc5	6958
bnb1mmydtak38chkasc2fs9qd80g3kp9uccr9jfmvr	6986
bnb1eanr7w0saq2lsxlnc9uj96m7j73raykmdpu5wm	6991.6
bnb1jmwzglxzy77v00k4572rr4qehtj0s35uvrf9nd	7092.399999999999
bnb1afs3glmmxqmpq403p0d8xrwyedrqhn6u6gtjwp	6722.8
bnb1t57mhrm8hkakjr4ug3a7m8lzlmcdj8427cu338	6972
bnb1rnxzvqklz5j0g745gtwswacknmneepdyv7ke3c	7064.4
bnb1kdqv2rv7mneqe4mvstee6lgf0g62zd9899qz30	6151.6
bnb1c3uwpnj94r9tm6ajg6hra8rr2vqnq0ul60x504	6949.6
bnb1048mpkna4p40y6gmkcn63akw25x9xym7wkls0d	5773.6
bnb1u833delsr9qduepw0vtkmw7a6j5f3wr9zt665h	5773.6
bnb1c4z6fyfvmmpjk2z0dqfmue2chtfme5mhgqgg75	5770.8
bnb106vex9cmmy2kc70p8pqx0z60kxzxe9uf7qxm09	6830.6
bnb1cf0lg2k3fc2w0hzytu6hud0fe32unv4x729gwl	6651.4
bnb16ncamujv0zt3un2jd7yp7tl3hd3q0mdssdk99t	6645.8
bnb1t8f47y9jw78d79vlcl8qa6ldzgz562lnu4pvhz	6763.4
bnb1gzzujsh6mpvc4w6zdw65jhhr2etecaxewr6mff	5042.8
bnb1z6s0ax5l0q5r4t0ywmk952z926wdq3hvxapnfm	6701.8
bnb15clp8sfv0jrdlfp7wcnx0xy2ckwk4ftt00sh5c	6078.8
bnb1q7jpkp88ruwy0r6s5klsszldj9jxw3n4jmftd7	6651.4
bnb1dfcejdy6r0j0zqtkxhjl2r2zsyjagjqkk84ny0	6633.2
bnb140ym0f0mvhusw4n294ry52hmtseaklkyffjml8	6627.600000000001
bnb1s90uykywr9e4e8yw49l5l9qdj97yftjyshaf3u	6613.6
bnb16jq8a6h24942j9ffhzcea3ly6s5ys0ur6tkatd	6407.8
bnb1syvmm0t8jner6t9zx6jf2c3lswwm90hutt5e4z	6454
bnb1xvvnlp02zz8lw02q5ay5v5cemsysm3h0lnqtxf	5566.4
bnb1ee26vcmxqpnjj2zkpmaaa4jsdx8dev6m3hzgnr	6480.6
bnb198z6y8qndtxx4qskpr05jmkswv24g8fu84xrsr	6475
bnb1shtx4q0z43feef69sflzcezxar3u3gl380rr50	6503
bnb1vr8rjqq9deyuvd65y5758zkwlcrkd4xpmcw4xn	6407.8
bnb14q5pt2qkfvsx3h90re83mk6ve26ke7tr9u0y94	5909.4
bnb1em9nsygepjt5zx9h75y05wgjluz8ywgehhc2yr	6469.4
bnb1ekzvfzjkn8lmufzqmrkxkhtweyyl084ulj39p8	6241.2
bnb1cj729ys9x9xaghdanzfjkafnvyf3yw89k5qnfz	6328
bnb16ajuf64zqpkkw0kg9g5e9pr508egnech4rrl6n	6279
bnb1lfmzj65r3spv8jwqnrp6rjth50zvw4jkx9pe5a	6316.8
bnb1lcsrekgqrt07yl070d22l8q7ajuatc7jmaa4fj	6305.6
bnb1w0dggkpmfzr6hfnukk3hm4zes02ffzzyjvyvcy	5836.6
bnb1xfkr6thf6e88ute523n75ay5yx229lfh3j7pe8	6115.2
bnb1wrz6yv47j0mcjuanalpk9an0dfme0gxv0vgxgl	5773.6
bnb1fnf9kppfa69w09vegvnxu7nkh8yw80yfhujr2v	6059.2
bnb1sxr28jlzup9gckus2jly3j2gtwkqg3msjy6hsh	6043.8
bnb14xaycnc3009g5n2vl6mt23x7lwuuyw5py8lqju	6084.4
bnb1s0t2zm3ylhfjhzlh60euj6wz4mrm97d5y0r9gm	2314.2
bnb12f0p2wn8whmykymundfrkua6xrzvxhl5mu8dtv	5640.6
bnb1tnrsm5dfwt6yt5ejqyz0hmhpnfsu7w3z22x59a	5954.2
bnb1frz9tjmt2jl2a2ud7elnhyz6nq5xgupe55htd6	5951.4
bnb1xen322z6kfdz4mrqhexr744c5khsw7uggh2pe7	5954.2
bnb15kargly2atr90gswqsv2weqcr90l3jrugxqquj	5863.2
bnb129qq0cgn3fjq384qe2zde56n7klaf8fp7kdp9q	5773.6
bnb1ss608acpxq0wxca89k330s2r3egkpv0q6q076f	5884.2
bnb1uupqv4wh2dermzkxvqftfwj9gf923u2lxf0ya8	4876.2
bnb1d5t9tg4vjj8gfe3lus2vleg4e0luu0f8hcxdgl	5763.8
bnb1snyfc7jva3fysulp90jz46cgdh5twfy36zfcfw	5132.399999999999
bnb15ec8kt6uqpjnf0rx2ertscyfmdq39cm65ms4aw	5660.2
bnb1mmae0cp0f7dtcy34t9jsr37fdwtge66xsrjpux	5471.2
bnb15znh3ahlmfhkf4zcmhdyh2zsa6s0xa4rt4hra9	5437.600000000001
bnb1squ7c0m4gsclz8a3hm2xfl3zx7wqa966fhax4r	4964.4
bnb1mjdse6xxfxxfl4z8tnmdhaxfj0vjlt2q0hdllp	5455.8
bnb1tqetjwr6q40jd7gafu9vxj0k0f2uah4mcjgvfp	5446
bnb1z73qfvnue5uams3w40yaczafy7pwv7f92rese7	4267.2
bnb1ptu34ytjmsjhtpds7qhq7gzgs9tp9dvxh8z49l	5394.2
bnb1j4a048grlyd3mq778wpaeruj63unyazandm0vx	5425
bnb1wa2g4k72jh4vr9erjsmw68leqptet8gyaa3l8l	4964.4
bnb1s5lvqww40ywqyg3f9awawfrdx6z9qfc6k23rts	4860.8
bnb1clgu43mv592tz0ccu222xygxy0r93asvv2whxt	5170.2
bnb18yuzq552dqwfmcur957n460zq2svksaexnwrmz	5268.2
bnb1nyqgeqwaa7payeclg72qyzyucvugl8n6a90g39	5226.2
bnb1h9zxfev58qxjf435crjwc0jp4yhr0x3289j6f3	5212.2
bnb1mmgsjknn7sqxme4vy34mjmlfm0shkyknnhmcyy	5090.4
bnb1j8zng9ev6rmct3wpwk9zvuxxx2neny3fspggfz	5142.2
bnb1lrm54zxzq830l5t7n7w6w2vmus72j6sw8j00ax	4660.6
bnb162hxnnmmczy45pnufsazxyyull04e7yxmcl7jk	5104.4
bnb1dxjvktecj0cxurc27s5lnena0fk30kunhxv33j	4711
bnb1wrx0azvjvmy94f437kun0wt9l84dj7dvle3ktw	5069.4
bnb18vdvqp5h983wd9dzc94p5t9egrvt3acv7jwc5h	5047
bnb1fs3tw2c3whekk84gegxahqhsqaeye2vd2g4sg9	5014.8
bnb1khffuuul9u0q4mxjt3la4qkj0ekn9phdm406e5	4720.8
bnb1w86r3c8s3h2gg53np4pwjxkkz587ywf2al4vql	4965.8
bnb197gcjjvvzvgwureut86vn4nf9vg5vzqsdsjzje	4999.4
bnb17gtcjkggupwhxu8rrpnyrslekd0mzrnk7yfk3g	4979.8
bnb10pqd0gkpmpluspf2zjecdq4v4ft56vdx2adsh6	4981.2
bnb1zpn7fyv9kfrvcf7xuc09qmcqgsgwh3hm2mxfsm	4951.8
bnb1rs3ddenu00p8p7cpw6vnat9cxz2qc2ayxxx4qz	4929.4
bnb1fraj3qx86empepxvcv37m4k5tqs3hpxa509pwt	4901.4
bnb1aya0pyc400shvrxw00gcen0qux63lyr56xp7m3	4779.6
bnb1fggeengt0m83yr2zuwft2pl76wjfljm8dffg65	4881.8
bnb1fl0zv0xjhvpg5sykcau90kz5aj7jk686ak0jpt	4834.2
bnb1e6d00p27qn2arkzx96urdknjp8esfrnc95erzx	4670.4
bnb13237ejj35shsrpsx4n8f6t7wm7f6msu3muuz7y	4809
bnb1rtjc5r9ufr70u9vv76sy4p64jgavpkhqla05fj	4680.2
bnb18g7ulhx2eg9uqc6azt3psax36msdkkpd8p2294	4719.4
bnb1eyr7lxsjg0367zs3kwsw7zw8ur2srku3g4g8ap	4566.8
bnb17dgg2uuvqc75lg437r32wzs636fwp6xkmf3396	4599
bnb1vv7j6lmayly5qpamfwew87spp35z2ejueyt372	4650.8
bnb1qpnvnvggzqv72vt6gdq88v9pcj3hzsxwlxyvtf	4544.4
bnb13j4xwtn0puedu20n9aphmns2ynflmk5g9jtmae	4559.8
bnb1fj20x8zj66kqnj8tpl877dy25ktxdx0zpnl5ev	4530.4
bnb1cje5z8ttc4z43ffdhr5q89ac6u73vy2qyfj66d	4435.2
bnb1g3cnvrsslpmj7jgdnfzdfql72f32rkjrlz7hrq	4527.600000000001
bnb1zfhr5m5c7lja465s3jflsjxvyfy0lznxpz3vcf	4373.6
bnb1t4eq9ghwf8xcmzkuvlfl5n6pp5d9pnxrxk9udx	4418.4
bnb12qyay9w2fmp6qku4lqr6a5l8xkclt79sypfzx3	4349.8
bnb18jlkedpvhne8sqgx6epqa78vrj7lj5sue6w957	2363.2
bnb14pxmayh44ygftyzryfths26s97n9mvsedk2s45	4338.6
bnb1et403ll2s446rcjk5tufe2fw9rkmezgj6h7u64	4396
bnb1553zyg28j9pr7usjc7cx5puvu4u7znyhj4pmm6	3922.8
bnb14gx273k72u9rh9ue4ecfpeu0yg3lglt5cp5z7d	4019.4
bnb1ueka8sht9jghnpkcqcmtl2urc04d3gqmdrz87k	3878
bnb1rf8l9hypry6q88mrwf46yff89a8fcluxw50gwg	2765
bnb1xaygypct5fdk6relc85g9kup8p4sw3k7qu0ld9	4291
bnb1plrh8y036wnh722lsc6ufx7lazdrz7m66tdl7h	4130
bnb1qtl978856v9864s6npal57wu08tyn30f9npr5e	4209.8
bnb1t9vvw0vghgwcv2u3qwfhg2pp6h2ru5hmnamtd0	3960.6
bnb1dn4eydu2ggukvwz5lzegv8sk7r6636607vf7t7	2084.6
bnb1gu339509qec3n3rvjwu39zynm8v0z67cp28awh	4132.8
bnb1xcmayyzgmnxmys60adkyd5uzfentes8u0alx28	4099.2
bnb15hp7klz9elx6eg5wargd2zljj84rmuha5clln5	4058.6
bnb1fy0erh8rkf8r74cgalex69ylp7mfdd30tfufp4	4004
bnb12jzza498kdzd7hxevksddq2m5f3f9ncjgfe6m4	3935.4
bnb1gq20lm4lmdzs4t6ycxw5h8hstqregrvaylnm76	3980.2
bnb1q358qnlr880mx45tz8xvqqpqmup5maraqqnfjc	3936.8
bnb1kfmvygat92s6dt238utqe2kv9xygvsvf0rwqxx	3693.2
bnb1hph5vfw7ec7z6t6mccwk686c6rtm64gzxx8p8j	3768.8000000000006
bnb1aqjys3p6yp4f2fl448p8rdm68mgh0hsj9dkvtk	3917.2
bnb1xzj58zac6w83qcv4ag5u057ya5ny02kfdl7t3x	3830.4
bnb1qxz2sdq0nhctjnq702m555xwx508yvlyrcn0jn	3515.4
bnb1mkg2qwq0dkjdlksekxzv45k55stjquv2nnw68z	3844.4
bnb1dpdv863strffwpldzamp8mllqp432e4p6d82yh	3567.2
bnb1au60fnr53k822h3dt2lurtac8q75eafzr8nl6x	3740.8
bnb1dhnge5xwvrhs58dcwg4hpklfg8xywjajqex2vn	3739.4
bnb1kd5r9gddely33s3a8xug2fqzh5w9nwr5f43284	3728.2
bnb139cr9zurcygf9u39rvx7a2a4gc2mv4ux64sgg6	3707.2
bnb1yv5jphllhsalk6udzf9uxlmgexy23wk8kxvz79	3693.2
bnb18y3us7fgqxavwph0fvqemnzjuvqkmtcc4k7lu2	3658.2
bnb19unjsczlfn6fezrkhad7yg3tg376ep97w23kgl	3070.2
bnb1s4cmttz0vlz884x7mqrc47wzm3d7nf3snxr0nu	3578.4
bnb1v025lwam4t2l7d87afg4v6ml9nmpd50sl5e639	3472
bnb1t4x3tykyugz9jxhtm93ksamqyh76swpp0hrj22	3098.2
bnb1ghn7dkypm3y2enrqjx827apvsrxtv2cz72mv80	3246.6
bnb1c5gl3stacry8q8g49fmcqy7j6dr4sqafxsuuep	3432.8
bnb1s8vrujk0s7dpc8nsc04ka48z8ymsdmf6zt2sqa	3493
bnb13n4a3lkjl4u3ec7s3epxl9y4eelcrek0mz2dgm	3487.4
bnb19wsg2zjt5t2aytjjteur9lnch0ex306dfenlru	3434.2
bnb1k6dqfm05y5jlx2r4afwyqazsmlqzcdxgu9p54c	3481.8
bnb15yt4ymqgawgngvg5r98kr0v3qssqcvhqqpsx5y	3386.6
bnb1recmsxkpzqcsh92jh9elgnhhyxkspqqg974w7u	2857.4
bnb127wmzf82jtv0cqzf3cpgg2y4vkxxvuw8w7f23v	3413.2
bnb1ugz4pnt724mvh369kun9eqdkrg6zytvfvyxjqg	2979.2
bnb166pngqahg6sn2z27ztx9vrpv3nrdgahlfddyft	3367
bnb19q68mfm0rvgfrdsnu4lmld6atmxcxwcdm3687j	3193.4
bnb18er3agrgu0523nup0qytqs52884yf4ff0rx4jy	3235.4
bnb1r28td6ewqnx8szyjlaw9nhpeklm0af9yphnkns	3250.8
bnb1efzu5w8fqr3mdmhmyax3005lerekmwadtygnyg	3241
bnb1q6h5rpeaw0plfg5xtlqq4lkvyxr02f5fpeq8m6	2728.6
bnb1vz723d7nxhrj54xsrtcy9dnwlnhgq5wjejjyu5	3225.6
bnb14hdkv6dvs23gn06mazvyg7x6akmtw6h6tfnpnr	3236.8
bnb1htl57seddkvpu7wfw3a8jufzvjpte22lvkwl9n	3211.6
bnb1ltkqqar9gflzlsufftwn0ncjct4gd62h0qcx99	3014.2
bnb1s5h9kmvevmkr26sud2g272rs64a3ddsgxf365m	2930.2
bnb1f9a3mwatucs39qxwnghwl90nqp6kg5atgxfs5x	3165.4
bnb18w97408dmz4gsgrg6e79svpy9tfyg8lm0qads3	3126.1999999999994
bnb1zg7venh02tuc9zdk0dkl88wlvyaskud93d7ql7	3092.6
bnb1avw0ahyfrfqe53espmtzw63aj0awxnljq83vj8	3124.8
bnb1ureyp3xav7q9mwjkae3555fjvmauk729h06796	3085.6
bnb1ud20jx7f3kmx9608vpyfk3y849mxemp9t2wlck	2868.6
bnb1fq2vkxzltczwm8srgtlpqph9jnurd8e42gjyr4	2979.2
bnb13emzrfrljh50pyd4ua6lcrrkypwjh8x67tk7dj	3007.2
bnb1xqc0tgsu0a54zrpkmtsmt5dth4gvjmv42xvw78	2443
bnb1xmvk5uxlh2csecnf9ppy7wtvcw5jutz6v27xz9	2675.4
bnb14rg9ev58w6d6sqjn08erzxy820h5003ad7emk6	2947
bnb1qk2e6dayp9g236s84s5dwgacnxsxz2a8h4kkql	2788.8000000000006
bnb1vhxgdg8k650awk8v9d3fayvuratx55fjra8hj9	2417.8
bnb160pjusqjedxmrzcfg8yj8hxryezjknlvfdgue2	2888.2
bnb1gnn0mvuw5j8e50g7mzwgsrchs70c923ddnpqvz	2836.4
bnb1zql5ltnlp5tuzen5pk4dd43an4ztceauyxkhpm	2791.6
bnb1vxs0z9pgl94me8tgkvzlg0eqm4ueqpnw33ergt	2751
bnb1ny55md9z39kd0s73qtz40rfun0zwy38m865mqn	2672.6
bnb1dkwqzquwyrck6ka2ffaqjurreaxpkz3n2lchc3	2706.1999999999994
bnb1jgk2maa6p5njc296k9m2jrfj3j5w9zguywvrj2	2296
bnb12953mal7nwzc54wddzfg9x0w2etmw853pgw5za	2706.1999999999994
bnb1t28tus7qgkqnqw9wem8x8s0ajs5geuy33dzv9k	2744
bnb1mqk2grkjethuk6gn7t03zhu8k4s9xcglhdlsld	2714.6
bnb19dql40gzpym3lmwtwjeqkwmcc06del4j8a6pxd	2370.2
bnb1fg4pg2m5p87qwknpaum3ht78yx5exh7tfujzuc	2604
bnb1nyytapwe0py8ar0qzan26ex3kv985f0f9h90my	2590
bnb1ta4uufm80a73e5qw2wl8gxe7npjjwe2aufkgzc	2240
bnb1fhks7ldzcafh33e683hu870me95dpnu3kh5f7y	2490.6
bnb1prczmw9ev6sweg33ggl7ctmrq2qwq87cyk45x3	2347.8
bnb1n2zw0akhraf9hss7ds4j0z6n5t3nfe4yyhf24r	2485
bnb1mwntftfjchtfdty5sh4rvanm7vemryyz9xh68r	2466.8
bnb10ccet2wmyltj0llkugty0qyjdzmxy3ug02vlvt	2483.6
bnb1gm20hstancmq8d5h35cvcxtuq7qz466mh7fj58	2424.8
bnb1ra8awp7hlmrwpmtqmagp89w0j2uv5625m5axmt	2242.8
bnb1t4nac022fxhwpz7gpwt5vvvjncmcwf73gda5ka	2416.4
bnb1ggnjfl5dplmcr8j44z4x6gfwnywykygs2tr2ps	2385.6
bnb1w9rlg3dst6tq58y3zn0eampmdjwl7axnac74ks	2315.6
bnb12svujs0wshaly8emjqmwxuxv4uwa3kvqve6s78	2347.8
bnb1gewz5qpn70tk2shk0s6zemrpgfjv5qf4cuj30d	2184
bnb1xdfnxqp9cuzcslkft39ny6rwzeulkx6lfk27az	2350.6
bnb1wdhgtcyxtjwu2whnrv302jejamf4r5xxgs8njh	2332.4
bnb1t8jxxt69tpqj2025fxrc3aj4swh0mqu5asydgk	2280.6
bnb1e9uxcsx2kerpm7fza34f20nsq08z68rjjx7pp0	2305.8
bnb16zks743gmwftphaw98f4m4mke2dtshdr2wg8he	2088.8
bnb1n054ad38a5p274kz0uxuvwg7cv78w3xmgve30x	2307.2
bnb1j7ujprl0eu3aej3rsw4m8vyz28xgd5hfrgfc5p	1330
bnb1qq63jv6zxw6egj3ddz9kmu58fn3tkfrqdg0ahm	2276.4
bnb1q6w5dd7a6xhn4z92cjh7e3lqh9ynys0cq9s0cu	2184
bnb1rn7lhddkk4ezwff6wszpzmm42rpfv3c26sggsx	2266.6
bnb1d4vkzqwutcfahzc3thuvqsh8kjdzguqhjrndpu	2171.4
bnb1lzvumkuhr5zavlarq2xnuncfm4hhgx49wh7v8f	2081.8
bnb1t3xemvj9ywjhq7vjdlzpafed0amuq9v5mmg5gt	2025.8
bnb1j8g4dyrnnwygwycmmgjl35dmqgrvfmsyewpchs	2186.8
bnb1mvg8fw0nhnazpnswwgs5dln4lvdexgqca3agal	2177
bnb1ml7gslskcyz8yp7tqjm2aqyjjlry50map9s5k4	2115.4
bnb10295q4cjk37qn2glvhr3yenkazan7x8hk74pps	2102.8
bnb1dwxpxgc7t2yt0qznspf30x9ve4676rjg527vkc	2121
bnb1kg5wpqz242mhhxxqx0xmw3xkjl2qn3smaw2j0x	2072
bnb1lre0y6f0apnfxzenan8atr6pkrnrh7w543sppm	1979.6
bnb1esvguccxrrwf5njfm77yumfntp0zv7jz3kxaye	1986.6
bnb1hjlvzem6zhjllhfektggrw2ksy4js4pe5tny30	1986.6
bnb1ztuysyrfhv866rtac752g0yslkxuetgkhrwj7r	1989.4000000000003
bnb1awjz7yxpzw4yvxfy2739wt58nztcsta84edx2k	1981
bnb1z2az70sggtsxy4ft8jqlae59gzn08dk8s82ttq	1850.8
bnb1d2llfy6r8meh2efe7dx8n5acpk0wyq5pz8443l	1883
bnb1r8lkrtutlc4n0ttz0rzlfmlz2jj033lah5syzq	1845.2
bnb1amsjet7uwp6xf2xumv0ahgcyenaxdpnhug8rst	1678.6
bnb1hv4gksf79y2z5znmgyqj8cfxy7qka5cxfls750	1804.6
bnb1fmjccwaeqrwlx7u4fvp3qldh6gx0hqj7vfsmqk	1549.8
bnb1l0uwgmzczyy5cl8vgwed5g6l0nj774lxts3fgp	1821.4
bnb1r26gq7pwap5kvvaddtrsqcez5tzr5pg58fvq6u	1808.8
bnb1f6mtmaceagkeg3pvfdm8p6w2sx5yp8dv9jhwcd	1806
bnb1slxfwsr9ex3tury8qp9lnsvta2cza34hgdtun8	1514.8
bnb1ujt90k43llx2gduceeqz2kmr2l7jfl4mv8dtsl	1755.5999999999997
bnb1zmyu37nv7cy4dv8u2jevxdsn2kw4m83patqp9k	1740.2
bnb18809ereazz4pn6ep7qww59zymuhvzk8ev3t9l3	1755.5999999999997
bnb1vrua95cgfcx8ehdkuq94s6l7atm099jscy3gfc	1754.2
bnb1mnlx0tarwmtkgx4ld36t994w3cn94msvr2yk6v	1737.4
bnb1qwzut3t3w2l54tlfdpcqvvff6f87ds53u6x53c	1702.4
bnb15l5yaa0lnvtqjxzd7w3ft4ht8ettz7gjk7rkhx	1717.8
bnb1vq8myp56cx8xm45tw3tsk6s75jsd89hd503chf	1565.2
bnb14j3qrp0vhkh07xqehzdfnpr0xd5207zjut7vuj	1324.4000000000003
bnb1e6nmnnr7ft8sgzrr42h6adeqjql3rn5u8g0jzt	1708
bnb1jcdqyh5tn6upgc48qlvcvwyfj5g7zp67c999al	1624
bnb15ppvh5czw698yqkffxel608p5kdfu4wdqzarus	1678.6
bnb18mhrwap8jpdjxpg4ck77mmk5f560msh9t80afx	1638
bnb1yv2d5jap8dnrns5aghgdne3xjjpfk73r87a6na	1657.6
bnb1tjryu0d4typp6j0k7qkvyr96hgalc85ea2sqjw	1612.8
bnb1k347q96j05mwy7z687xx2hdl6rnlnp33gy02tn	1437.8
bnb1jgc7ssz8anqmf6dktlmy83kr7ar053qkf8nl6z	1523.2
bnb1wz8jf3lwwpdzc4p9cmst8d7wcey6ll5l0d32q7	1576.4
bnb1n5sax29prz6d5k8adpq6v8kr6pm6rl8rp5sg0j	1577.8
bnb1r04p29xa834hckf4pnvuy22dxezm32tfl43klm	1590.4
bnb1j9vqmqnwa88x7ewfk2g95w709pttk33aqwa55s	1570.8
bnb1tydge2vnr8evq73c55thg76zl320uvsg5efvhj	1559.6
bnb1l4hflash0xtrdeju4wxn8lameg69fw5heed6y2	1549.8
bnb1kj5c0sf9tyfxxsyf7zfxar4k5w8h5ekatgkjzx	1531.6
bnb1uhw3vta46y6ymvrg8xsl2tnuqae5d4v6vv8a9s	1290.8
bnb1mvfg0n0437zgyyvhxlvd787s3vrdjzg3hv00ya	1498
bnb1l38vlm7rwrgy8gx7yzp9wkq55r76vasswtv24u	1467.2
bnb1qppgwudnres9wv9qfapp07x0qsjq9f3lkxmmrz	1505
bnb1me5j3vyj63s49ql4xcwzj3vxezns4p8kpueje8	1489.6
bnb1keylqdmehw4g6pj9sjgzg0g5rl09s9dldjgda8	1467.2
bnb1mmxv67a0zmls0cnwpevcqjj7ryrqplrwtyccfx	1443.4
bnb1h4uejj09xmncz27yghjyl46jgf2f5wuefpnvza	1395.8
bnb1c0arx8596ccduwtxykhnye2z6c2w8fsjjqj30d	1324.4000000000003
bnb1nxfk6u9h887fd8pza9xtwuyxt0mpzmt5pgj7n0	1467.2
bnb1hrtj2496xzplq5p8q6ahjq4gqgyfyh30d5wapn	1444.8
bnb1vr9tqw4lg6cpderfgyuqhpwzhpt4l2wl99t9yy	1373.4
bnb1ten9yujz0fxfjdfqdxl340vc2v402sz7mc9c3y	1446.2
bnb18e5g063mu03ua3l3pgzt50uaq72l4z7wal8342	1429.4000000000003
bnb178yfv4mtshsnect90y9twkt3tnu9wdfz2jj96d	1386
bnb1z43n5yc9pmf5qj09qk26rer4pjspapp9x2vlfp	1360.8
bnb1u0zczxfw074fukdhq0422x635vvk7sutt2maxy	1395.8
bnb1r58tdmg7x2ly23pvm7pxvcwn6qmyxata62s6uk	1359.4000000000003
bnb1gf8sy22prepvvcuev25ycjmkds67zvzg644tr6	1241.8
bnb1ydz8u4zdyd43p6qssxa48eskxarfcyfusdphy5	1344
bnb1xgrfng7metfu72cxkmxga6nzmajevg304h4nsp	1328.6
bnb1v6fwju5xgsgknw56u5hfwpyfyl0zgztqjpadk0	1132.6
bnb18r9ujzrrwcnvjfy7dvt8kxvv6eh0axxsptajs6	1269.8
bnb12lzpedec5p3325stlpny4feahh54zawywatqze	1061.2
bnb1e3ss48f3ehvgafnfyqqsu227fxsqv73lqjfzr2	1251.6
bnb1vp798vrv0ceyycns8kp67l06c5sx8kqxzvs405	1185.8
bnb1lkfrmylsfynet4f93punqxv63dncy4pcqgzt8k	1274
bnb18ppumkpa3qvzsahqwsplrpqhlwaeyuztkll7se	1258.6
bnb1034utk5uhgyu2htmlzsm8z9j3vvc5ctyd9tkyx	1255.8
bnb1ghfz92adlam4e0fm82c5cagpxtsuff6j2srt2j	1255.8
bnb1lv2v2tgcmzhhk55v62gynxryvvvzymzjc95vlr	1031.8
bnb1m809gp5x9fscj9prqyqnqqh0p9ute4fzjrmw3p	1199.8
bnb1588p4lqw3l0z5w3mfwd9asqtugdml645r6347s	1100.4
bnb1uqv5sl9wred4egjlyfvjz72t744zrw5c3t8x5n	1159.2
bnb1p27sdg30e7ls06jddr5xnjhzp9t8cmkld0303l	1143.8
bnb1jmwcsnkg68d3dexac4p3czctru324ar226mlg0	1125.5999999999997
bnb1c0zpzpsxu57vlv2d99fqwv0f5g9h9yvq8nye3l	1111.6
bnb1wjg7wh6p0uwfupj3xnk97mg66rtpdut4cevxuf	1071
bnb1jut78n804espeeguqg89d9mwy5w2xu5plgzsy2	992.6
bnb1gnw6fae0xl6rrp2qzvyttfq7qvwv59almedjya	1038.8
bnb1nqmrdhp6f2vae4u3f30s04wd4gfv3u9mj86qrc	1031.8
bnb1ll2569gdf9j9amjaz8l52dzd2370wlvpuf8xpf	1013.6
bnb1fpnqvscyecnea2jj5xtrngudtja9r50ehctwx6	1005.2
bnb1t2v32am0wat33jex2fdrsqs9tlhpc7r6w7ge3y	1002.4
bnb1tx8t36avy3h9x3npefn40xhzv56lhmhcywxk7l	989.8
bnb1cecenufq8q9rud5pudzhga9wc2xmw09uu6dlpe	992.6
bnb18ygr88sgznxwyfkd5lmah6qfnld2434zsym3nd	992.6
bnb12yl0ntezxysmw99hrkme2gn6hy3q8ctgrzd656	988.4
bnb1te50hcat3pzzkr4hy5thlwzx9hfqv7zc70q3vs	933.8
bnb16r23qz0u3mfjgl82vrql93j4jm0z9anwksejeh	807.7999999999998
bnb1vfjryppcg6xfm5xar5xr3fg8s4hmt9atgdwxwt	956.2
bnb10qeezkrd5n6dmwkhpqc004hll6nac0lm433nhk	819
bnb13036t9m592njcguknj6gngj7y8pmhung3uxvvu	893.2
bnb1ppce4hwpedg0ws4t8r8wqpv4zls0mmgh6dd9r7	936.6
bnb1q7jynusul9zzuktjsqzawfxdkl5460m4q8lahz	873.6
bnb1f9q2k2n39uuv3qa7rkhvavlgnqzq0390ckze54	940.8
bnb14ux9afeyyy4ug7dyyf6qxwfqs4numj85vu2l9y	903
bnb1zrjnml3sxf306p3jaezt23xle5z2cy74wxr369	826
bnb19973ue8hemdhrgv2uz8zgqmqmmunqjqlul8u6p	876.4
bnb1s7h0jj0etxxhdxmx0gfgx5jq5yf67xcgqayxre	862.4
bnb1nceda4h5lmsj6tgg4xq8p64ahuashetqr6d3vt	873.6
bnb1wm9wqx50499nlccsm9llx6a0tmjje04dxcxddf	546
bnb1pj4lhjtapx7ghcrmgay3nf728rq6rq6d8ag4u7	851.2
bnb1fv6ekc2acndgvvtp39gyc7gvd4n3cw5hd9naxv	831.6
bnb18q360q63yxc5etu47fhqcvknxkg2vtmrl4tw5d	777
bnb1vqsshug7fqu8x233se2qzn0sqjckxqnpuyw75t	791
bnb1n8n9r66he6ju6dxhqnd5glwd9vdluj56njee42	779.8
bnb17gewc2uhr6gnkzaawp7efuvs2mzd8lflkn80sq	728
bnb1raquzyk9xhq295em6mg5yx4h304vcxe47wsejs	744.8
bnb1f95r29xcwnhnym7mn2axnk5ycv4rl03d5qhpl0	665
bnb13g0p49yeu8p822k7qjnzd7rwq3vsp8f8y7szj5	735
bnb1dhhxrpy5ayvh548uh2eveasptjv50dk5ujcyma	715.4
bnb1cahpulkpdufuxxlfmxg69nuk8dmjlgagm58rkd	497
bnb1mntpz3h7n7tg092vh8f4230k6j626ymrflwel6	715.4
bnb1sh8mlmhmjc7fms3y34dkz4qhrrekptdewsyrj4	705.6
bnb1l0dfy5fel2z7622myjjs624t8w7k2ta273ge3j	134.4
bnb1q0rgvhwclmc2y6t78zkmkgg4umamtw4ahkz2nj	694.4
bnb1a2zgjdpefqyuwwjx0n4n8sx6l3fmg3yc7w4ppz	683.2
bnb19wh0dusjzvwxze7pg8dcxw4x4yg5fvtssssaez	681.8
bnb17kwk6esla0rk0yzxk80gmpg4xgk3rek796s59p	544.6
bnb1xl0x8faat7atrl2q2nxxjp57tvjctcldgmx809	596.4
bnb16xwd37e32uljducdtf20ue44cgmllfywrw80lc	571.2
bnb1p8rg24v0m62h49qu2c5mzkqce0rkmjnaevtg5g	620.2
bnb1798s60dxzyhj75pzfa7ms0ntzw2e2xa5dmcfkz	597.7999999999998
bnb1rve8xzp032x9l08ej402jxakcjymf572klzrnt	606.2
bnb1azqt6thww0d2prnpl9dexm08kfc8skkx6f6jvd	602
bnb16gnwqqkhjfca7kwtx6fgzdyk7vvnznm86gde5c	565.6
bnb15p4lgzx8r0lrvhpnl9cn2fhp5m0yy34y5azc5q	602
bnb14gdkzdnx2ysg26zvgffxzjumydkx3vp36rdfql	596.4
bnb14fvn93n4dsquymm7mvnp8wq0a8snp8ylaf375y	585.2
bnb1wz0uv538c7lsewll7f85ggyk8rm6j3zqsgjqwh	581
bnb1dq2ms3k6497fgvrafusecugj7x25v4dgvwaqmm	463.4
bnb1hle427y5kwdj0t5swxk3qdgqkq384qmz68ke9g	540.4
bnb1hcpst9s56pgz63tesys7qvcgftgqsz254sxwwd	497
bnb1eh4t3pdectqku4t9c03e4qsr9amgnyxe3tft9d	529.2
bnb1xeujq9nl3jtxxtv9xefx2r76f3dt63hggef92l	529.2
bnb1jjzgrvlmwcas03vkca90t2sf03qp5582kmwyxv	525
bnb1qveevplpu4ndyrs67x0hlder4tw5w6amcrlwus	471.8
bnb1jxv397dhskzhqz2adyxp6guwfy6dh27fmwputv	498.4
bnb1ztpft6wcm5cc8vflku5ftlu4xhlfq69cysu2fg	485.8
bnb1vcls2wewc2c7cnhtqhxuapwu7rjkt7u69yy938	484.4
bnb1vjvz4fzu8x0nvcckd9qh2lmpvh2hytesffmwmq	476
bnb137kruuk3x6ux9wt60wcd2eyv6zw7fnrwze5wn5	466.2
bnb1nk84xeyyyt35qjczdwfnjw7v6vd92crzrcww47	385
bnb13cs99gj80zdk9fge56atx7zsdltz47p035yuuf	429.8
bnb1ktc3j0j4eg7k8j7yenndk8aj8tvsqhyjae5qav	432.6
bnb140vcsnztmy6c90tsawnerctu2tjhy760aqwecz	421.3999999999999
bnb16avgwhqa5mw8zvleehtf3p635zn8tflhtngylx	427
bnb15fvnf4tyzl42jecggzvw0nkkv350xh86cwvjuu	397.6
bnb1rzdp2skq3xnsf8s0ejjngdsdkgf6r9x7qjvkkw	404.6
bnb1k0ahjsk0dl2u4rpjdsamlyysvtu8aqfw9wurkx	392
bnb1syf0ue5sdaqvz8pnynmnnpvhj7n57dufnkgd9t	383.6000000000001
bnb162j04v5tuhhr30ynlfgnyv3z3k59ena6qwndzq	414.4
bnb1nty8e20424gxes2wnvmeevzwclj4mfjqlzxc0u	397.6
bnb1mrdlc3kvqvu7875z5jtcjzcp7tpqvfg7vh4s0v	407.4
bnb1vreuwlmyknwrzle6320cmfu82kp2zzptstlsjz	397.6
bnb1g9v6tdyv3gz7jdp0qx9qrmkw7jcp0ym7q9q7af	364
bnb14xwfgsd85v4ld95qj5v5hcrl28se6xfv8ywyxe	341.6
bnb166jj4anhx7ggd2s4l6spqepgpan23vrh9x6kzw	359.8
bnb1957ec68e8x9jlwe4dmjna4qm3wmsm39nx77f7x	323.4
bnb12yey4zvhzd072q6ds7h8md7nh5c6xdhz0amvqh	302.4
bnb1trrhtlrqhjzmn6hj39crmm36357tldtkmsamnc	350
bnb1r2j5l9qe82npfxh5d5fuky38265k6zt7h6lf7l	338.8
bnb10hcaa6f0jy57zdxz22p6vskuvazk6jyx9ru2dg	42
bnb1v9r6kxwcg32r6mcmkte2p6ps6c9ka8fpdga6am	319.2
bnb167g0lwryhq788eg7u2yrqkmfst7gpkzyktqz5l	298.2
bnb1qqm4wjp5e2ksz5neuxtgpy8crr9xj6wylf5crf	298.2
bnb1z03jwx76gsagq3wks97n89s0gs6fz2p2zm3npw	285.6
bnb1xruphelacaj3gykh3fnm0y6gvxxyy6enh3q0p9	308
bnb17hjv35kklw7wd2tna9hu62eg9jc4gz9egal0el	298.2
bnb1h44jgrjtw76h5ezyjqgsa2kve4mx6s5rfx9jpj	281.3999999999999
bnb1s5l3l6h6xf6waay6qfcds3wxchyr68ctnm5rqt	257.6
bnb1y9d25q7jl6pld3v7h6scerp0fm0wgvgew7lf70	247.8
bnb1g5drx6skah0rm4ejefdfahlsyfkrneuudjtr3z	247.8
bnb1ul3tth6pe4mfmle8edvjfswqpg0wc7uqztsy60	245
bnb1ja6m05v7ccejcwqdys6cz2vfu2q37pj92zrx4x	243.6
bnb1rm77gyygyz7j8dfgv47ffd3ccep3exfga7qp3g	240.8
bnb19rnmr90wxjsmazwgupau88avm6zly5p9370qqw	224
bnb1tycq26ase2h9zwuefd8uxjnkd9sn0ejev38txc	198.8
bnb1xdtz9n75zddm40xr84h7g2zds67qd2wkpfaqwx	231
bnb1tnnhrt9hphzqmn7xc3ts2azekvtmm693tjvglu	224
bnb1spn4d4ktjamqxl9atww8sre7rjehpr4x4ezh4x	204.4
bnb1jvulqla3m60duttrkcq4yv8l7zfm8aly5ddlka	203
bnb1n4yptlvz8przxrmg55vmg3pxfsts8ckuscvtt0	198.8
bnb1ft0mvnap9q537dga53vuvju86vvdcy0gtcwy9e	197.4
bnb1lk46udh425kukqvrchmsyqeyvah4lq0phds9s8	193.19999999999996
bnb1u29z2cc5jyx3je85tjsquyvafyz9l367frtjvu	193.19999999999996
bnb17cjygxq28a9urf5y32tz2d2jsy90dz5yvt0fel	172.2
bnb1y35ywtj4w6jkpllyp2gqqgy3r2uj9qsh8mxyug	180.6
bnb1ww0krud4txhvxxug7s4ele32pjhpdjgu8zc0tt	172.2
bnb199fuk8rpmgf9c0xf82cajlxn9rx7vguxvc937r	169.4
bnb173pgpamlmlhph4mhwcnmk76mzycft889w8kj5j	169.4
bnb1z4xmpsrquttjlzvz5ahkmertxl9lu3nztym9nx	158.19999999999996
bnb1sj6vzk3vrvdnwwhmldxxtn0t8mzg0h5ll4cqgm	151.2
bnb12f0ejhm870tp73zgxqrkzmfgu5csmxz55r7t3l	138.6
bnb15ctq6mha07e0y79mcpv4xwnz3k8zl7e9cmge0f	98
bnb1pmdffgyjxgnmcfn0a8pq7mf8scys842l39sksr	137.2
bnb1w97hhq96p9ujftff9nfq0eeqmg4ce5wxx7pfyw	121.8
bnb1leu50hllnrvw6r4c356uc7gut2d7dqa77hjglp	99.4
bnb1q62catxmf7kgq5a5m27zqqauukn3n2my499hkp	134.4
bnb1ze46el46yjrrye720czs2a3yuyaw3t2c53yhnx	133
bnb1543se0mh39jf884durkhvcnvjyv55fkstr07c6	49
bnb1p3rnd40u084jdxx5lx3t9q7zh3n62jv0tdtmc2	99.4
bnb18u9u6td2nkd7v7q2j7ac5st55kjeevke6yq4e5	99.4
bnb1hjlxxsveqr95mluwxqv2h06m85svdyz86avtul	103.6
bnb1x4ndakrgcv7rgnzwcd34w8ajhkrdd0t57zd2pu	99.4
bnb1r5dh7yvxn8atazt6sjcgu9jvahcgmmm3fffwaz	99.4
bnb1xlrn3vpm6fxxhrznjp3w3dlwray8wn7af5a9vk	99.4
bnb1nxvj7x73zgjhd9ar5a65lgcezd06aynkxfxxp6	72.8
bnb15khvelp3gyla26zfj850a0wt69lmxw8e5zuk2c	60.2
bnb16ue8aypmp7xteeq7wysw8qtewxytz98dwamrwf	50.4
bnb1zql6ceqzvlnswzy2whaez7f9scr7v69hv5gktq	50.4
bnb1ypl77fddyeqrx2h2gpkq63ztnulta6f65utwzw	44.8
bnb1rl9393ca8qyjh9u52arlqdjdkj2pywg8gwdegk	44.8
bnb17n9ztwy3yc9ajfm69q3phf7cus825ys6y7u86p	39.20000000000001
bnb1kpclqufs7cguz4vjmgp8h723gx4fd7k5szsl96	37.8
bnb1z8h5kqacyvd5py7eau9ssydkcejj4n9xs53k0z	29.4
bnb1l0h97n75x58jd2cclf84m3usp4j0xy6e595xxa	25.2
bnb1zpu3e428kscc3yvmuwqakxdwwper58rl4sa7kp	25.2
