bnb1xutm7nm9l46c9p5xvx94xuz08r3qadd28teygq	5621356.1085084
bnb1859r478lkzxl3y33uht7dw75r5xmr53gh543vh	4133284.6954824002
bnb1rlhp5uhsysz9qf5gq78kxgvpkfcg0qv0ldu5r8	3888634.7115612
bnb1ju6eehwue87tayz5u7pvuh33eke8l84dumf0mp	3424000.193712
bnb19uvv83huy7925hpfmyu7974srxvxem2r4gv5pd	2894670.234642
bnb1wsg43lqyllnwx4tq0tascknsr22u9m2sn8yhph	2830745.4108768003
bnb1wcqhkzkmp67f5c9qcspmmr7mddktj5xl5t2e62	2521090.3728131996
bnb1cpwrzcmpsdy5xm0yd3d6wlqlr506uawsykuz99	2373461.92335
bnb1jccz63p5nufzgts9cdd0cxcrftgxaf9g29msal	2168539.1474316
bnb1sea7shprks76xqwqm4xyyzszuupnsc8w7dmd5l	1888016.1810684
bnb1ylyf0auut2sx3y30kgwd5ss2zm9uqeuwr77y6s	1289361.38463
bnb1zhpqqc35amhtmamhcwwynyyyjzg6z0f7a3hm8a	1869322.162644
bnb13h88jdmfgu5mrd4yu9q23gtg6lt4nytwyaqdtk	1731484.0835436
bnb1devefureacvt9lhwlwshs3j5w78m967clghws2	1510385.1707543998
bnb1t8mua25fp0pfu25z9np08nzn0v3mjgy7fvvl9y	1552810.1089932
bnb13vedtsftqjywaj074dneknyr6adpxttrand20e	1547835.8131571999
bnb1y4m7jrvmvnsxhzghayyy5295gwfcn7uc9r0x4e	1488023.6051484002
bnb12tkrm0qhrn3pe3vnrfkt2vj0d3el5h5ncs3gh8	1475314.6776864
bnb1mjpj7lvgymhz9vzkzc7vpt0q80cnx77valvpgq	1425625.218618
bnb18s9wcpe0d0tvxc7vp6yz4d2g7dkg7n382p5url	1295554.7813448
bnb1mkjq25mes24edt35deue93klc0s633yzss95y9	1176656.5897536
bnb1grf3guxfrphukjs5gu8pf7e6jtxgq202ur3u2q	1149847.753248
bnb16zcr7p6tzfcnhlp2glehge3zm3c06wgfkk3ppd	1122713.3678616
bnb1q8l5auwwq7flq5vlq08fxxzurznv0v8m6gx0gj	1117966.7285856002
bnb1y3jw5un2nkyha8wy5tf7yavcsnt0grlfjs95qm	1081510.94535
bnb185k8v8t6utwz20ngcdy3dkwl4hydg224nsjuwr	1066885.1496528
bnb1e2dzpcdaqs9vxmscdk2rc7y8fxxepxv34u47vz	1023200.1323543999
bnb1plhkl3mgkzn70680ttx9vx4q3ej4n94sqdz9c2	988942.3732056001
bnb10hecw5ml5zleyhrz7xt0k05pf4ma7mzykf34v4	988942.3732056001
bnb1e9avaj624p2m2auhxd44jsqhffxvp8jpcvf8rz	873720.8350584
bnb1367fjtjcugtdyvjnlykmxrr7987zct2vqstt76	870269.5616088001
bnb18lu2l78mlrmrukvs06kf4dmtnwrezme7hraclv	853507.209096
bnb1gjh3zw5vaq2lyljzety2gdzj2mpy4u8wsuxv4q	852323.394984
bnb1d7p0hulh58tzv0g4x7x5y9r0k4qvews5cessnm	844558.0297224
bnb16a95z4chxq9w0erj9mhrkrkf7zt3guajxddtve	789499.2906864
bnb1qew564y4av4n2l9wwy6n7nluy5glk05xqhs9gg	737915.7290388
bnb1am5590t7tev9wlp7hlrp2qsjp693p4f8wn699v	692259.2059308
bnb12tevktzcu7adzds0qa9lu0mx64mfauwudmxru4	651374.3643204
bnb145x6fvha7mgx2g5y45rx22qd2vym5cl405s5tn	444106.725834
bnb1azlzyuu27tdxjg874qr494247z6jj97dv3y486	593365.1962668
bnb1zr90fjgxjsjzsj9fjsd0rd7zkm5hqqdd6d5ncq	590598.03078
bnb1ntf8rt2dfn6z6xrhcf82etsa5239vex0ddf3h4	590538.8400744
bnb1087n7v9vdh2j3semze30tesn7h6zuth6tsxdyt	586703.9653212
bnb1gpuypp4f24hheupkxdrac98rzwtawwvtdwu0jc	571415.6890343999
bnb1f4xl0jvnz04sdx9n59jtxs6w98weulnrdae93w	552563.4493008
bnb1z8s4c0g3qznfxkv6zwf5x5r4jn3pmsav4tuc4g	549462.7669536
bnb1fc5dm669l25lznql5jlscnltjxcnk6s8n7sag5	544795.8074736
bnb1pszusstt9fnctws87m3eewxj36jr5cladj750y	526300.9885392
bnb1u8jxqw7jylneh60l8sn3pk7kwejejyd8g7hphq	386218.21575719997
bnb16uxqjzkfzcngux7nkkhzgztnjl8ethh2h4whs8	529691.9330004001
bnb107lpz8zcxrqsl2pfdzm6ajnkmf0dshltuzxpmr	528481.938384
bnb1vkw0rsjv4ygjd0cwczay6t23re52e79zu8wj7j	518861.17215839995
bnb12me6l98g9tc5jmdw5x544f28zn36sktru5akkg	512771.35917839996
bnb1yws0a7fdk9l8x9mkd352q05xyrutvx5arkeura	512754.2849364
bnb1n9uyass9d86dedwxr4daal3vaeegnm0888nkjl	504823.8686688
bnb15w49r6caypgklgm8phjep0sa2l4vdf5qleaysd	495612.8842512
bnb1923uqcc0u6ezrwmv7fdlhucq9dl2f076vjc4ja	494471.18660280004
bnb1jfundmcdsugw490rewkrm0atejrlegnfarw422	453947.18064
bnb1mqm5sn5ydvl7p9qxw9rmrf48lgx92f3cn45zzd	399344.8930068
bnb1yhenddk5w7nl3uuj5msxvl3pa5k3snmkc6044g	434997.0485856
bnb189p5gyzktj9u774tredf5t8cqelfg66segjx4y	415606.40108760004
bnb1m6uvglhskrrpwgt6qzhrgdenqsvyt2yxk7u35v	410430.629196
bnb1l6exfwglm575lh2gspp6pm73qumpfhl4ndq2t0	399369.93522840005
bnb16p0sp5nlphcr9y6v02lan7z3739udvwagrg85x	380842.10609280004
bnb1f3setp3my3yz9mqu3u2zc7vgcjvas9vd0u3dle	395577.17693879997
bnb1zk22tfw3fyl7z0wdmxl668y5qq70yvz84gf6xw	378062.41949520004
bnb1c2x0363wtr60quzy483u9xewgesqswpqrvav5e	376581.51357239997
bnb1r009aaudhlacjmnq965k644tcsr4rj4ewh7uyt	360354.15397559997
bnb1h5lc8ynlum4jt2l33uw9lmmg202arwmda6r24j	363723.4710636
bnb1dqr0qjy7v0srhr9e0g7trcjsdsvu8p09jf5n33	353752.11373559997
bnb1zp9yqmqkz69tnrpd53dpjyca2zuj6usanup79j	330599.44158359995
bnb1twa0h0a0sx8wm27mvpzggx6gazuzxakzm40cdp	331128.74308559997
bnb1xpyjlm88y9xk7sz0szhtnrrrpytz9z7s6waw9q	326235.2653284
bnb1va2akjq4lmy2xcaj9ljk067dhktty839xnufd9	324581.34042
bnb1g8tvafknlpmht2p375jkm2al0xshq47f2uqs2f	320728.253142
bnb1xyhmppadjr8v2npk6g6srzw2p3mwnd3ht9p3gd	318575.76036719995
bnb1da9hxsw93gddhuta30lc3f2936j35y93gdqv6g	315171.15651239996
bnb19km30jq0qe5xyvdtayhdj2qg9uwtd9g7x9mv36	309729.0264456
bnb1zf7lpum3al3xewlt492cdgmrv3shd42dy54ael	247236.1624428
bnb1lgyux9fp3qnff6zkjdjknxdkaw3cwclyx43khp	297248.89382640005
bnb1637hwjptdrmln46v7vvj3d9mzktrxdlrsnqhj4	292725.3579792
bnb1skp2q4a05ed8ven2gn6f4fj30cl4ew9wy0ay3r	286997.5189296
bnb1fg4zezx3w7k27l3rg03te46m9russws8djz2uq	259661.6574876
bnb1z5u77wf2x7ej8un5ls8304f75wm2erqgqk64pe	271771.8481968
bnb14fhxm0scggqllvquc9e07d0emdgm86v684ltw9	270619.9060032
bnb1kckre5jptlxwdrwjwruc93nh3tqh3y2m864hp8	268781.57928119996
bnb1rq5z3k2e42nrsujc7w2sgc3glu46m0e48s2zes	263921.1117252
bnb1regtphttn700wd2a8gk9u327d5are573jx6hg8	261650.2375392
bnb18te0xhxpqwd3ddsmxq6nlwcghhwtvfm047axqj	262070.2638924
bnb1ayphwzju9h8yfsdd48srag04nxsyy4uzxrtk76	257125.56340919997
bnb1wy6k9uxe34tx3pxmwcpt80pvt2p4edme8045l2	212179.32876839998
bnb1y23lz9an6540gw0xfcryjznrstg32ksl024d7r	224518.3143204
bnb1ms6s0juntctw9rl95mv87rkhae5uu0mna9004h	247928.2383852
bnb1dyltg4dr4t35ptsdh70jeqee8842upkz4hrc20	247282.83203760002
bnb15tcnmznknk9xdza5faqe03pymfj3a8u3tmc8l3	247236.1624428
bnb1kq3x7h4tl6qrtgyvngzyynfl2825c5ejcjkzhg	246899.23073400004
bnb1vhl95durh3dt3lx35raylv648ksljeze9460h8	240853.81078320002
bnb1w9yudrlzwekvsgp9spf6p8y442u782z0v4sgtw	239106.5466852
bnb1ep3nf4mafemfrwlgyl7vksruezngweq3udmxj4	236922.181992
bnb1p949mdjvugak9wdw604923pgewnleqxn98nyx5	231509.647278
bnb1m5yy49sksmjh7j02vyfdnl7vjcttmk25kcl0vf	228538.72917
bnb1nckmzqs3tgaernfllxkw60v0cvj553dwuegz8d	212799.69289439998
bnb1qx2ugn98cw40ja9hrfh2e47rvnxsc2gl73dfke	220242.92412359998
bnb1fp7ru0nyka3hcxkj9mh8cyf49u63hgykcl7z9m	209680.7980224
bnb1446dmc8u7jssynxhmjzay9wcx0vd6mh0v4l07u	208572.11057519997
bnb1sr8cv6tdf4w0kt0a8auclpjnfeg23cjd7e56xx	208342.1774496
bnb102l7dnmw7pjr5hzkws6qhe7fatkvlqmykhmsyh	207991.5863472
bnb173sjk9wxz67raqlheusumux4rjem8k96fjqyjp	205234.6654056
bnb1ak7f3lp02zmtv4gm28ycp22jpz29euuwu9r9pf	204078.1700808
bnb160308gggrcp50e5vfsdzq2fgjg23pjqs46zwah	203753.7594828
bnb17e5n6pcvj3vx3zzugz3zka83a4hwaeawtd77yk	197749.3177128
bnb1cj72vmdqfkskdfwdglr7duknp7gqrvy24hked7	196032.7872504
bnb1tu4h2yeumjh3dyf26jfcfl4nv54rfh58yyhs42	194720.347182
bnb1h0mtvjg4zn4adlhm82suzj79egcnentfmngwzn	192120.50926679999
bnb1368ewg45c523kmlnfrhldkeudtne9xglt23jyw	190156.9714368
bnb1ypl77fddyeqrx2h2gpkq63ztnulta6f65utwzw	187943.01139079998
bnb1nqckk6repqcx32a9suu3dgy2hcml0ws4j4tpan	184974.3698484
bnb13mwlnn8w25yfe3vz5zulrzujh772ug7z4da34g	184227.6563316
bnb1ajrn6uqwp90jtq0eepm3gdjastspt8na8c6agu	183923.734824
bnb16dnnyewcyqmpn4ur6jtzsdlsf85v5x0pg7t5a4	182700.080814
bnb1faa0qz8vraufemjn2yt9hevrjkk8rvne3nn2zl	181845.23043119998
bnb1qzcwt8vyhmgpxgncf69eah0n7znp0yvfshfhx6	181823.603058
bnb134fk6ywlrhaxwg9jzuyjhsj2sedrvy0k7upsap	179605.0898808
bnb1fzu4nnvg5vjthee5j2qsmj9kywxg6mvvg4t884	173395.7572068
bnb1udjyrjhpwm0yq2hwmdf4acvc4r387a9v83vree	172616.03348880002
bnb1sp88zx3tfnqeeurrryq6287z20lw4knvanfxmh	167332.1247312
bnb18m42xp89ykqz7gljyjtwers703lj4u33vhytjm	161875.196988
bnb1qv3lehm9t705qt0mg9nzzkcymjkv8j7ymk7klm	164333.887836
bnb1v7p5w0euauelxtqh5w8phlw326wsrdtmt4vcfv	161918.4517344
bnb1c0ehe7tlyurqhvrd3zx8fnafekhxe9m0htzquk	160728.94620839998
bnb1p0mn2sh4p72zqvzjaw8h0nk57s9re506y4j8lt	159643.0244172
bnb10mtrckhp58pe5uh9qskpmqcq0rtrqhr84saa3h	156368.1848016
bnb1vgk8c7ef9mczcs5wpkg8vqhkzpf47agxng5sl9	154798.4928204
bnb12ekm8lq8tr4wgrysfjjrd9raly57c6sxf4g8f8	151697.81047320002
bnb17uyy50cg9kkqrv4j26ym2759e4ezs6fyk89zcq	151500.8875488
bnb1cr9mqk287hl9ettzwh6ggewch97hxtzl3r9ntx	148679.08448760002
bnb14lzrsuqjlnqazt728ruufkegs6qh3ty3npak3a	148029.1250088
bnb134ajamqtcm38z7efqyh24ts9ca6meg0r9aalph	148721.20095119998
bnb1y4q892gh6c0d6qwcntn7elen6xjtfz8gyc44uq	148707.5415576
bnb1vwq2as8p63jvgl64cxs73al04s7n6wp65nv9dl	148396.79035320002
bnb1842ha4gdwxyzsy2836kvt3ah87vjy6qeqyzp3r	144967.14427679998
bnb12wfl47w364tuhc6pe9nvanahvwjukes2jued9w	143222.15674439998
bnb1vclzda3lcy2m05e6vx9h8308e9f948lqqcrj8r	137449.9246656
bnb1hnexk29le7qtzzmf0unzz0gr2n0mtc66mxexn8	139678.682388
bnb12c37jwarlcfl4svxdryqu89dxzjrduejkz6tss	137147.14144079998
bnb1rpw69vck9txkql2hw8t80uxdapve0rlw6ywkhf	137989.4707128
bnb1h9qf5h5j4dnd4zecsd8qvj72rm284lvhc02w8j	136362.8645916
bnb1egx5rqs7yaj5au0npwhjgny0s0gpthsk2snc0t	134309.4024204
bnb17a8cc9wamlj25fgwpvym3e9n3sqsslfe76m5s6	131992.9969224
bnb1awx3rfhuxwmne8hxl70pgxzsflht9zrnwt7xze	131586.6299628
bnb1283plut7k2f6gx6theptc3kxwfaq30rw5nw9jj	131381.7390588
bnb1yzlm0ar7a5tu336dak8rwq8wa22gr75hraqgt9	130990.16977559999
bnb1ed6rx4nrwffkgssdyppmrfg0dcnfemtzgtu44p	130706.73735839999
bnb1umndam9rfzrgd95txyr5c9kpjvkkrg5c7cdck9	127023.25421760001
bnb1nzg556qryclu7a7929sv4khs2gw20eu8re25gg	126128.56393679998
bnb14ckaje8u95cgyq3zlwg7w8yzm0dhkv6gxsqgu7	124009.0813632
bnb1u5spl7ufmrhr0ett5za2d8qv9y2jftl4cdsjfl	123636.8628876
bnb1ksknwzf5llx3gcvarru4vp80dd0djsfm2a4yfv	123073.41290160001
bnb1de43c9q2lj7tf98dmc2xnnal9gx8jq79f0xmsw	122282.3063556
bnb1jrgf2fvkjfwzywrndrnykkc6p36mt3ytfzq95j	120935.71780320001
bnb196jfucq9mdjtw52td8a3f932w06m4q7udzux43	115180.55996639999
bnb1320f0fverl76txqupxguer6kceugq2z9wfukqp	109538.0921268
bnb1ppulh3ucal4ers4stg9gfhmjtffltha9rzmmnh	116733.17770559998
bnb1zhj3tq45j5882tjp6pet39tlsjmly8e4pgl5c6	118766.15078640002
bnb15jfs60nwxquvaj9lwn7n4n2hs7ggnxvtqy4kt5	118660.290486
bnb1a00n709j23e7wumc6puj9m0sh8g4u22nr4tdvg	115552.778442
bnb1rsxmnwf7lhgrgzr6878kjlatlk08mmysc6wns3	116113.9518624
bnb1pqw3ytwyw5fwn9vv7jwus6dwta22t2xg8fkc68	112543.1587188
bnb1j45qd8xsdkf9uda93k0eh63js2sus4ng5xtnmt	112392.9053892
bnb18s0yptz5205ql87jgmc24ud58v8t0z7sdp45sy	110583.0357372
bnb1s9g7c9v3rg6ee8g9mcf7txg3ayxr0vkp22wfxr	105720.29161559998
bnb196v9l9zuyyrz40vydp9lv64mmynqlwquee8jru	105604.18677
bnb1fr24vdtm23ufx25ukld2d7grtjfr5hk5anj95n	104666.2417428
bnb1l3k02y4nvgsnvdg396lxr7cpqknqqrfhc8yjfq	104265.5661972
bnb1hfyj6nqnsge8zjlxneyun6gnl43e3kscgvgk8s	99102.3154164
bnb1lq3w6nkjc9suldhw7yzf6kek6uhlemv2h83skk	101771.58858240001
bnb1u0fztkdccczgl4h8dp3qfjyq62an8d78wg8uqs	103219.484304
bnb1pdxa35p2q9e6qmgdsxqucnr4065ur2rzqduazs	101598.56959679999
bnb1jfck260nln85qy9lacc5c7dfxppueaa2g976vh	102339.5916996
bnb16nxntteq8x9qmqle8m60ndadp3cw002q04j9dd	99872.932872
bnb1kgfr5468a7vu94mp5jt7qpzfuqcn8ryc82q52w	101309.44576559999
bnb1f0tc7n5up2cjvspg7cx4lmlzwlunn2fvdumqhr	100362.394476
bnb1qz0grtc9qsh2ur43cphl8sm2t2nsya2xa9qtc6	100452.3188172
bnb174tkeu48hqd4dcky3vwdkl7h6q3aux9l4zekgt	100206.44973240001
bnb1g0we8gc3trgjwuhuy3v0sud2urehyjjcaaz2cj	96898.59991559999
bnb1hp82p7sd60us3cgfqgqmxgdgav9zr0796rlmsr	96784.77163559999
bnb1c8whfhqet3w4v6u3vw3xa8mlxstja82lght2v7	98981.6574396
bnb1t57fmptcaxc4aag2ax86a7x354p543t3zs8m7c	98915.6370372
bnb1mwchwe6lq4m5f78clp05ermumzv0wwapzv09d4	98894.009664
bnb1pyzndgy0clkrehqke6h5jgrtdqzgdc78ac4qsr	95193.45228119999
bnb142fqapcl0658s4gxlnmu8n47asqc44vu7saw20	90933.9980436
bnb199u6x3k9my0fvnseldyf5tcvz6qvmu0xgwp5fa	93338.05131719999
bnb1vp5ak37k0735jpscwrs7p9c5z3e4ueed7jugwg	91874.2196364
bnb1patrmmvazgp5m09s4j7d3u9syzn6nelf4jc0k3	92179.27942679999
bnb1kcs49v4u7f3fw5yqrq7xuva7k4cggzkz9gf8sr	49447.004832
bnb1sdh8a7xahvr4v2tjagt4udm6fqwmrst0cz0mjz	91986.90963360001
bnb136vyll3taevqahu8l63plc43yqa0ku729g7tdp	91761.5296392
bnb1afp3u6gu6tsc6w4tw9wqzdhhna2np2tzprtzcc	90502.5888624
bnb16x93hvxf2l2w8lqvpsjmlqf6hl54ze4ty3djux	91120.67642280001
bnb1asjaxc4d0udwp6ltmvvlvd0m503t0mjcy2hyae	91095.6342012
bnb1eht48a77ym2hhv6cc2hp5f4x9xeqsxg22c9ewu	90148.58291160001
bnb19c2ewmwgcda55hel53mgtalzhnvsvncwxnthtz	88542.46588080001
bnb17pjul7euxs6egrlu3wdk2nlhyk4mrspdmhh9fk	89008.023546
bnb1vlkzn7d03n9xtz0f4tuq0nfpplvxeenqdepmv8	87264.1742964
bnb1tkpcmg69hsgw7tn9297n2u34jp773cwa30e692	84558.4760808
bnb1p65c8nhh38wnexrfvyp8rnd47e7huanwwtzh89	84055.35508320002
bnb1fdjtpuawchjx04eplt4ger4d9h3nsznjd7p0m4	84699.623148
bnb1323qet0asr8g08rkx93w28jkxqfcysaz935jc7	83548.81923719999
bnb1vvv3k6kjpqrre8fr3htjhutxwan9vag6jrj9dk	79116.346014
bnb1hc3m6lpcj6ldm9devuuumrt8ydjcnh2dwwn0d2	80432.2009308
bnb1xjsklr8yst8lpgw53m8dw7qcqrgwgjprpvf7ee	77814.1504908
bnb1uhm7phhcw3a4tn8k4jq50e7lh0z695am0gu2yw	80206.82093639999
bnb1savrv84exx5ra8rvhgp7eyhxnq5u3wzjxh7lec	73175.6480808
bnb1a36gc2zpzws48sp8s2znm9gukmdnyz0wsnknea	77699.183928
bnb1uag25q89qmjpsf7x56p4gk9dcj6qk2qkscjczr	78003.1054356
bnb1eralzf9ku9ksvcdwkd67qf3ywvcz487p9h0frd	77078.819802
bnb1nlxa3z3nrgdg8zkv550ua3pllm5sqc66vwc9ca	76657.655166
bnb18mdluksg8zzjwce5jk73w8s3g2ky2748vdhl4w	75956.4729612
bnb1w4ktt8uf0gqju50w5v8g3jw5u6gpyvy9z0ke9s	75909.8033664
bnb1c2sltux8hj5vyc9vdwpvsajjqac43veceeazly	75308.790048
bnb149ezz4kdlsm5sfhn68kzt60k5y9gca6895xl86	74718.0212748
bnb1f2t5gr99srrv6gr0ldna8xufztdgfhxttgy7kg	74186.44320719999
bnb1skc0uc7m30hlcxgvlg4flkvm38sefv5uwen523	73125.56363759999
bnb1myst9x9cy57vqf3z9d23du9x0cq4asmkyxez45	72837.5780892
bnb1y2eqpzcpyxkexzzd3e5vnghd7xd5jr4p2ud0ly	72612.1980948
bnb1t6q635w940ml8az63g0fu4nr6xaa0gdjpq7fur	57056.42535
bnb19dxth5fqfcxyykkftd4yydvdxxejp63ym8yymz	70546.2148128
bnb1nz3x9f477yn5xw9yq2z7hay55jfkzy4gngcyvv	68883.183642
bnb1qelv08zkl623u5uv98cwpqrcdrjweyf9ufz09q	68365.264968
bnb1xpmcnn8738fv6zst6skr87smfwu0ah60vr7mcg	66496.20461039999
bnb133sp2s58cjlqlrgh7s6a4fqwg5auua0j4v5rpd	67064.2077276
bnb1yfyxdqfmwua4wj75wnc30tv0ll0m2jwxyx6xyl	66719.3080392
bnb1pj04e3nkkgd3t3xcxwe8z4p25vg5svm7rqjm8j	66541.7359224
bnb1mmhmjqsenyy2xsa3eefqff73u8s3kakp6exfj7	66358.47239160001
bnb1ka483sgw3tqfldugds9n9f5jqw848vmk8qn9vn	65549.1533208
bnb1sfj05y8gdu0w2mn7w7d9n2dyvm0x4yvq0lfdp0	64639.6653636
bnb177hrykeh5zvg0lh00jlxhgnvngveu56xyhxesk	64439.3275908
bnb1lwca9rwt7ja2cqkc943jvxtz36zsne37765r39	62499.69369960001
bnb180hp2ms3a862j4u0wm5l5gl4z9t33fddhfwea6	62560.022688
bnb190we7qptyc05fvw4jju7rvm9fg5q4ny683ksq8	60458.7526392
bnb1r8n9cqcd44pkzrslllzanzlvreev40hy7nastg	61314.741304799994
bnb15flf74fv9nka0u5lejjmngal3wa09kxlcfuqw6	61310.1881736
bnb1da45jhxdx7v2klcahc2mavv9pmnryem5h2fngf	60709.174855200006
bnb1jx0esfkr0vssqr2m048xlrfwav4vsclj326ahj	59945.3870964
bnb1ke2dxg5ngz9a670lvqrgvg3lfga45s038vpxj5	60405.253347599995
bnb1jexqjxdazm3jqavzaemdvgfvc9qnsp46erjnv5	60278.90395679999
bnb1uxsx5ex2kea37wjfazcv6e0rsegkcpylg4kdd0	58821.9019728
bnb1zcza9pn7ut7cm0qu46872qj5he6pxr5kagnetw	54222.101178
bnb1gw5u9m4phtmq4q0nckydk5rd5dd8jhxqcsxd6d	58836.699649199996
bnb1j87zk6xnv2s79rfz0p4tmwwzg9ll2l2s2ptkkd	58504.3210716
bnb1vhf53um9ypt36lytwyy84206paz6hgq70sl4cr	48633.13263
bnb18u8erwhu8js22hrul76w0zajtlhrd6cvxndqfu	57124.722318
bnb1se0kwzsmzwepx9pxzrfycpar86xsys93ahp8lu	57055.287067200006
bnb1hwyacmjwc3y3f46jpjclc4tkjuzgg70fs5q5qu	56638.6755624
bnb1lp83jqpjkx5wedwtyggd44ta0fx5w2fef0us4l	56561.272332
bnb1knem66l99x8yfw5rmyd8gn07vqfc9kcstxgz89	56371.1791044
bnb1aey6sq47eg535050hht3q83zzjq524quar43cq	55800.89942160001
bnb1ux84kgg4ya46zks92psy3nz49mpyek6tjdzgkf	55024.590552
bnb1uma3wqqj4vjxe4q8xsnde83fzxye9l6h46nzxa	54944.910756
bnb1qhefqvcfgg7y3m3wvg29g4r50958nwnt776eay	54814.008234
bnb195lkv0f6x5n3xz0gkrs7s3m6yu7fsgg8j96axc	54011.51886
bnb13rv02shcdg98ec0l9crz6zyhewz0864k4nmpvg	49658.7254328
bnb1xunf2r7ssh42qshhhsxtqvhralezgdnjnvk003	52157.256178799995
bnb1l3ftnt3s23de9e8hcemvpyrrq3hufsu5t4p8vn	52685.419398
bnb1z9nj8pz0laggj4seulr3m4jjl7ku4950lk7y04	52513.5386952
bnb1evjlm9f4jp7cye2alkh8nlj72e3ltw77380mqc	52225.553146800004
bnb1yxx3grdj8jnxfy9yg98v56grumhmpvw0pml8ly	51919.355073599996
bnb1csmda0pyukakyfkxptz7g3zvwyvmxexh50hd50	46844.8903512
bnb1ezq8ja7ydlakghwxqcuzyd8u9g82704j8zfn8e	51311.512058399996
bnb1yj743dhufwxm4f4p3jwugwuus5vae6u9jzvplf	51742.9212396
bnb1nsfe7phf7c6wqak0znekzy6q430zw68wgf5zz2	51633.6460908
bnb1npuyw2ezgn29fw47pqa44s4rawzs7d3xdrgr9t	50720.7432852
bnb1ny6qw9tqsf9s4rfnlcexmxjgmqcpyzxcx6r29s	49699.703613599995
bnb12jcyf5dkefyd4p2pe2cvkwf5u3p9tymdwpykgf	51450.38256
bnb1ucu2zgzn9kpv39c4ynrlsjm57dp9rcv9mr8r76	50103.7940076
bnb1c8gfa6k29vyeqxa7prjrtxe9ujgzyl84s562mq	49447.004832
bnb1zyvkhqr5c3520rhwerntdxt2az556fwqg3s6q5	49447.004832
bnb1uewdxntnk9pgdh84vdth05z5fhcs0gzs05ek5w	49447.004832
bnb1nlwp6zwg5gk0r6prtl339at5mzun006l0s7a40	49447.004832
bnb1dh3js22qlk30lfc56lx2qx5darutdp0jqnjwex	49447.004832
bnb13t2uuxcjelhysamdy0pqw7m6g79zv8ddng5wng	48905.182219199996
bnb1txsadmg2gklm9vtzapwp9wa3mazzfrh0d05v64	48325.796274
bnb1ke0y99g8p07sjfkpxarq8tnxkwnz2aeq3rgsh4	46813.018432799996
bnb180vu8m9zsw8m9ty4qvjsczh5rlrtmzs6ct8mx3	48457.837078799996
bnb1mu4dge3np02qmxwjcvvjcg72czcm3pa5ax79gr	47764.6228536
bnb1rnhamj2wn7zezx45e9dk9h4wn8kdpt9tvpent6	46857.411462
bnb1hwhwyhjya400zd55c6l95s82s7g4xdtapaa8v5	15627.484561199999
bnb1xr5e7ep9pfflp4gy4e6md0mk986uw34awg3ktu	45219.422512799996
bnb1px9383sy08sj7d9nhkg6thcwv82qdgcdajt82u	46813.018432799996
bnb1at96vtr6jcllqp4c23z29ch4drwemkfyzgj3th	45942.232090800004
bnb1gtcvdjs66ayk8ftal7z37qgk863s7wyhzl3u3x	46920.017016
bnb19w8ac9srzwa3mcne6eh2vkvevgg3fumj55wdyq	46823.262978
bnb1uw25d6uext0wqg73873mu0spfvakh2g58c0h7f	45488.057253599996
bnb1ylumlnyv3p5220zquynzrl2qxzvyl8j45r7728	45762.3834084
bnb1mw0dse480untejufrkfgchkn4y55uqnpqt2sq5	45539.279979599996
bnb1wfkdaekv47thqa9skdqsdu0jkgepx9kwvsed3f	45046.403527200004
bnb1ln8gpa7txja4fv9wk57rdnvlp5hqcd9mjyu7vr	44864.2782792
bnb10w94uklqzmf3ed70qw8xt729kvd6jlrw2fkqme	44619.5474772
bnb1envrhm4253rlvme6ymdcp5t9txnp8xa2mqdd3x	43661.1133596
bnb1exnnf7lezfy53vf6q6lsaze6lc00ctemaq269k	43661.1133596
bnb12g5qm6vt7glnw6hlyzd08zjl3qppksaurd7h6s	44408.965159199994
bnb12ggy287ecj5y9lvphwqc98ng4cm2g954jw2z4d	44340.668191200006
bnb1h73h9tyqat8039gwx30uv3xj4wyxegg79485v4	44245.052436
bnb1drhuq0uju64au7dwv9qnjg3ejr6aesqt7287k4	43578.0187152
bnb1cqf0dzrgs54efmzr070tt9j3cpgpe72l8mugzc	43032.781254
bnb1p6djp0pww5wtr3rkuxppek56pw2c2f9ae67cj5	43399.3083156
bnb166fw6frtj8duaatgsulmy7wkm40484ada7j2pa	42747.072271200006
bnb1shhwvdww2uuzt4s7wqjswmltw2hlmru9t3n69c	42457.94844
bnb13t833dp6pz56c3ut0adt8a7u7u3j7sjxn7e3x0	42320.216221200004
bnb1e5ewkvyh8e8mrmrr5w65kvtd03zhvfuw8qsfuc	42101.6659236
bnb1vt0sy6l4r72ua9gjynky03um3gux8u0s3xfvpm	41606.5129056
bnb1vkhuxdn49ukgxmshsxdcnzcg0mdmw93shrhss2	40790.364138
bnb1kfmhmpmn5p623nc0pr2a9u4n586h37fkjv42mm	41459.6744244
bnb1kdj6tm53lx9st7zzuugcz3amcuh60cveegh28g	41446.0150308
bnb1dw2p9e54c4hvdh7y0cl7t29gjnhgvha6ndhl73	40435.2199044
bnb1myzyxl9c5hxvk62pvsn57s3w596af998y3lxwa	40607.1006072
bnb1z8y6sursld5eq482kc07kk4j3najm27960gqmu	40579.78182
bnb18x9tr8garka4zsrfjq640tlegw3r4a22y43etw	40401.0714204
bnb13gmnynvlkxkzpnpfttuxsww7kt2jskp6wntqv9	39555.3273
bnb1pjexmh4fx5xdymlpfjtzvl23xnz00e6l2f79aa	40250.8180908
bnb1dt4482mqws7lx4t63v88a378x2dhmgha602yqw	39557.6038656
bnb14t4e82ta8hgmdlua2q8c8dpwrpt6g67fgj88au	39557.6038656
bnb1ehdfr4lt60adtwa529gf9va7xscm0vg45up42r	39632.730530400004
bnb1mgykcx8ml28mwc9hlt07estqmw33ket5vvx2h7	39482.4772008
bnb17dr32lkqs4tsspxvufnmqkacj4svy6ly65d43e	39049.929736800004
bnb1vudr77y9k2s0yzj8aaftcast968zsncq9k8sw3	38610.552576
bnb1nyme79kd0y3zxgsxldn3pxp7vg0atnvhqkfjjd	38471.6820744
bnb1k8e6s5x5vjlvmghr0w90xjfc5cek0dq80fj39g	37858.1476452
bnb17gxece0k4l3nx8e0zqpxqyftay8dvsz5hc5pry	36452.368387200004
bnb14rk989c4ufkc3amf0hm7zae9cf0m90adnds7x0	36799.5446412
bnb1g70pfy6m5f5pvxd5du5aqtdgvxz2z7flln96lz	36464.889498
bnb10x2za2thl97wq3cdrlnpw4n9s97qdzjnjjh2vd	35763.707293199994
bnb15kwejq0hv49w7z7zqvgjjslf0tgerjxuwpj8hf	35482.55144160001
bnb1ka5lalveaqafq32a0g0cva5nvs98mm3v35ufcf	36191.701626
bnb1pm9qgxhm6rpzecx9ppczyd0hmye37f8u7gqlc5	36068.767083599996
bnb1v2zvptzwx3pqj9s2tt0kzunucd6pdzysqwkzk4	32717.6625204
bnb1xa2lhe0yfef7m7u2vgjs72wpk0vqf599h6k7pu	28180.467279599998
bnb1y47uavx0kzhq067aqankmsakhrq8frdm4huf58	33327.7821012
bnb1wckqz9sjckkrdrccq8qapeyuf282xqjxc7puzg	34294.1841984
bnb10yhnlcev5f98q6udmzmfl2hmgq0vmrun3evslv	31695.484566
bnb1646yxaa8qk6w3u8gyprecg9kzfwc8ged67w5pm	34110.9206676
bnb1l7g7zd58z04ls6f2n7q9y4dddcv3yeedg7umz5	34046.038548000004
bnb1ggayvcanas6wda9wfgqd2c38w6qxn5nvgcc2dk	33298.186748399996
bnb1vwsg7n6akl3cfu3advpajcxpgc42kkpdxdyns2	33572.512903200004
bnb18rtwuwfsfa4mjlt0v448l5a8p4yp8w8dmy84c7	32634.567876
bnb1p06d5wsuuqsvl4s35zesumpn0svpynluwmymjr	33347.1329088
bnb1cfqzdqcuskrx3dm3g6atnrdh3mzf5zeku3l95c	29668.202899199998
bnb1dhtyg5jgvw0j9jw37tstznyz0f6kt9epzyq2sp	19778.8019328
bnb18jlkedpvhne8sqgx6epqa78vrj7lj5sue6w957	32363.6565696
bnb1h7p5l9ft3lu48wexad83hnqc5uk7rgv44yplxl	30008.549456399996
bnb14xaycnc3009g5n2vl6mt23x7lwuuyw5py8lqju	32509.356768000005
bnb1qgkwn7t85cavj9dtyjl54qhztd5sdgzcgwpxh3	32349.997176
bnb1lmzd8qayljxv25q7nljar2rcynulvq5dzt8rtv	29668.202899199998
bnb12ppe5t47pnt593l03zxw3zu6d2gtvl5m02fepn	31770.611230800005
bnb17jtep28er5jzykatr2tqnd6kufhlakq582tzz7	31764.9198168
bnb124w0yzh5fl82pjkcs6vn8khq90zsexmeng9qn6	31188.94872
bnb1v5g0r3marhuktlym5en2rxgjx3hrr6a6yrmvnl	30083.676121200002
bnb16es0vrgv6qa4s8ld93xayzsyqet2xufclarmv9	30864.538121999994
bnb1ve32eqkmtzvu247vk9y6e8v34n8k80fntm4j95	31104.715792799998
bnb1vmqc0unyv9ra6sshtuqq0hhqj7k4qwnt46ewhd	30780.305194800003
bnb1rx4a0grmnf9vjljal07cgrjj385yr492fwap0l	30704.040247200002
bnb1ykja4rnkrav0xlcrr5y4mczujm7f5ast95tv6h	30286.290459599997
bnb1wnz7h4vze9z7d6fve4fmvnelu5wvygg8rtq052	30188.3981388
bnb1kwuj9puxjjxp4tr5wllekcdcn0ce0l69hfv7p8	29902.689156
bnb1375tzqwyjptccjlnylzkz3q6zslkr98y0cj48h	29843.498450400002
bnb1pnrjfsmwqd34xlknp0wx8qd6qn5mvmaha2h86c	29695.5216864
bnb1x0fysej2vw3ghmly4huf693g4w8jgmzdsync05	29669.341181999996
bnb16ajuf64zqpkkw0kg9g5e9pr508egnech4rrl6n	29390.461896
bnb1v3wket664enqfya2fsk2gl6n07s4695p4vvmys	28894.1705952
bnb1yyl8kh2fk2mwlyl8m04ycyz709368j8q3mdcew	28869.1283736
bnb10rv47gyhz7j97kakaypvgk26ymscad2jp2vchr	28803.1079712
bnb190pgdfzsgkr57scvzqaxvsgus3penn2e7pt5lc	28772.3743356
bnb1jp2haw8c635wufu6c57r0guk57nymg87ml4ll2	28727.981306399997
bnb18adfq2ka9nn78xezxtcxxj50m6a6st2srm2agk	28361.4542448
bnb1xlmuwu99yg3vanqj4xfl397p0ngfepheu2wfcx	28097.3726352
bnb1z0v4qlkvk86pec968dsesrkapud0gzdkdylnqv	28339.8268716
bnb1eqr56au9fzh6d4tjvsvpk7m4rmt0vusk2rpsxq	27813.940218
bnb1yk07u9ytj73p4xuem8zpc44k2eeat2j2xkdeq5	27154.8744768
bnb1fndp0jmwft2tf4hlx244yvunlch665mapga8vr	26984.1320568
bnb1lss0l32lq9cju3ea5jwqqncrd09g5tnlw2uzpx	27457.657701599997
bnb1plgrnrmemjap06lc0fs5gyndwhv3m8dvef76pp	22492.468128
bnb12glc86hrv6apa6s4wcss8y99ddzzyjqzm6penk	27011.450844
bnb1xnh2uarjk6hlun7a6h8htq86j82x3rpmves08e	26938.6007448
bnb1rm7aht9ej2eaefrqqn3gq98wvnqh2zns5ttmkv	26878.271756399998
bnb1h52t7mmkhs5dt0zqrdw0gstzvj9vwydyfse74z	26271.567024
bnb1mfge43cjpe68sp9kythc4vqpyrpd9hkyr2cjv4	26501.500149599997
bnb18yez6ept6x089cukeqcj4lnfpvwl6ca2x67jgu	26429.788333200002
bnb1vetaau2v8upd47gty2eaq65nuk5l3jjn7xe6ck	26187.334096799997
bnb1z426hfsc4fq9ssu426vfnsz2eruggynkwnla6g	20530.0685808
bnb18sj7alq4xjwpm65swjk4a7acnekqymgedfe3lv	26086.0269276
bnb1gvnneevr42ree4ylsh5sd2f3cqwrk2kkpy02j0	26193.025510800002
bnb18c0qur6s6adayhhfgxgyy07cltrsmw64y38dts	26173.674703200002
bnb1vf8dfvngvkyzqxlnl33drwccppv9y84dy4lrd7	26138.3879364
bnb1gymht9ffkxxj2ecdw5epcx6ua5nslr3mnw2u39	23565.868808400002
bnb1whjp9gk9zlpjjve33r0y7w5lfcswtyp4m608wr	20220.455659199997
bnb1qs8cq2t048rc5lw66vw79pn8zw6pvyagrm56ln	25750.2335016
bnb1pl65p034vwwz2rd4gft6f95tqdvdhsevd7lxcj	25898.210265600002
bnb1nq9umrklt842n72f4vundl9w9fey04wz5q86yw	25594.288758
bnb1348jr4jjmjrdxk4vtglmzs7wect9nhy8lrcxpw	25275.569574
bnb1xk2049agff679pnah2u9z3mtzx58c750svw6k5	21530.619162
bnb1dxm39zmw302dxqf3888y729wlkpmhp5wlgv4qc	22024.6338972
bnb1rzqjc59daekxenngdlpdpwju5mlmqv6ljd678h	23521.4757792
bnb1jhkjkcwp72r48yenn5zq6pfgche4j577tlh88z	24723.502416
bnb1mn4wl7fn78a08f62ctxnt6kl2jgkrra9mwuzsn	22911.3561984
bnb1x0nz9hjxy4x4k23v6j7f3ts8eznq8gdzp7d04w	24561.8662584
bnb1ujvc6tyma948zgnwxhw8c8rw34nhlv625al0ec	23932.39587
bnb1wenmf2rzkmf987ds9glnjm9r34cgmrtcnnh2rf	24267.0510132
bnb17umjq3zskuttsewqxl0s6p8aj2syfwhw0qxwcf	23917.598193600003
bnb1erwqf9s38l9dely83g50f8y2j2jmpm4v3alqga	23941.5021324
bnb1dxf32yq6lgx33zdrexsapy05f3gxqzumhetlny	23751.4089048
bnb1j0k3fwz4ujqjyhmgxey9a3svp0afjc0ck0rf2y	23527.1671932
bnb1yg7xjzqhq2pcs97t0axrcskq732pvcsmwm6ac9	23129.906496
bnb165pnwqpq55h93amx3a6gw33femcp97eaws2j9e	19778.8019328
bnb16znr4gq8a89eg40qzkvnp8vr30efxu9mntgykq	22746.305192400003
bnb1vv0ms2x6wj55h5vtlm5p20vavg9zr8s20n4cal	22722.4012536
bnb1gdqcs924qjks2rxyttxls2s9dnkkncu26a0se4	22668.901962
bnb16k475042gh550qwn5re3j7wfc484c743cdns7s	22585.8073176
bnb1un9e99dlc0zmfajnm8f7gwdd9j97suxr9fxe59	22238.6310636
bnb1tkfdgcn0ccuyelu3zf98a5p2g3pj70fe8pxrgl	22106.5902588
bnb1jkjufugqnvz8llfueureuhsv46z6jwj523fpr2	21658.106835600003
bnb1dmqq9k5dghc3992q45wsheqq9wvjeumszpldx9	21921.050162400003
bnb1q5e903ewlaaekwr6e2m9ptyqay0l60madhm63t	21054.816951599998
bnb1ynwgr2jv6pjlhpx4gj5p5fwt9jjp7mdhvrg84n	19700.2604196
bnb1hz8f8ejs6uy3fdyg99fk38pkmm3grxf2n643y4	20993.349680400002
bnb1m35frlx3yz2tk740d0lqzxg3tlejqzhgcwm2qr	20988.796549199997
bnb194pk5f7asjt4hm8ez6hvsvxzgeurf3qzk4cneg	15181.2777036
bnb1emjhh8en9mcy2alclfhasq8t5fgl3ulapymumx	20654.141406
bnb1qpwpuap3h6sdty960k9kjugne0nggxpwgmuk53	20596.0889832
bnb1kqm2ecnxpydr5hpcv7x9rpqzv7zxk2gl6y6454	15271.202044799998
bnb16tvezd4v32eze76vfpve64s4fka5lfhcuvdy9x	20129.393035200002
bnb1nlun9rtdcyerg3vqu97mfcx3svdtuset58jrzm	15328.1161848
bnb1upuy4dfemc2gechyaplaqsa2qa7gp0g4wa0ae0	19778.8019328
bnb19nh5z6h4cllcdg8rp3jm7pdnlweu60h5l9zsp3	19778.8019328
bnb1ma807q85ms9aa2upg4hmha4kjaaeahsl0gjnpa	18403.7563104
bnb1n7w32q9ehdcz92h6w7rt68hqyvd5n3fl2n7tmw	19562.528200800003
bnb1qsea86cyf5crtsrngdfhwk4xm5gvzj5690asjm	19227.873057599998
bnb1rt63zl9ugf4wgax3dv9jndnvzeqpjqrc6kxn6d	18920.5367016
bnb1uacq9mwuyxswfr03vtg57ph77lj39l8dzpgzcq	17905.188444
bnb1rjjx7382fzjw92chx0n5pcs9gvd0c44tltt7qf	18749.7942816
bnb16eh2flx9l6vfmjx9egh2gdkhtp0g65fxyaf582	18682.6355964
bnb1tkgp8ggvm84cmqmczmt5cwqpwxupr808jfmlnk	17683.223298
bnb1z8cxmte8tfw0wr3a076s2vspurk99ads4dzzca	18585.8815584
bnb195x73dfsdy5hksvwd97mhyjwarsy9jdyysxakc	18577.9135788
bnb1gd9ejkln27r6lt340usp6vk2h6hmgp6u924lh6	18551.7330744
bnb1prdkexdzkr5mhw0zw8nlysgt7wtum0r2eltgr6	18245.5350012
bnb1cdgkckwraeuexurw4kszuwk0ra7l8cued5cttt	18342.289039199997
bnb16k8fuj2emd20zh6qch5e70fkgky86l5vyvg2um	18264.885808799998
bnb1pkhgklqs8zt5ylcdp6p0wumsqa5ackqj5hsfkx	17079.933414000003
bnb160fxd2ngr4xd8qcrundqvccl0vx06kwr48g4m6	17781.1156188
bnb1ju8z2jt30cmpm6vllkck4lepjs3llh8wc35vjp	17764.0413768
bnb19rcldxq0qccglcyyu23m43tsv57txsp4ugrjpe	17419.141688400003
bnb1kcu3ehagg4kdexfsmemv5d6xddxsg3jykd4hgc	15678.7072872
bnb12ecnrm7tjxkvzxvrg6udyreh2550tjw55kuxce	14468.7126708
bnb1nt08gyeqpaq23wwt70652q7qxsc7ue6mgphdav	17040.093515999997
bnb1zv93hlu96jeg6k2qxdrwkvu37f4ylgy9cpt6dy	16993.4239212
bnb1kqv28qez2l0yngwsz0x57h9zmfckv2xtv8wwlk	16902.3612972
bnb1u22vyjjx6v4yhy70n8e4hyl32wym6dy8tw62zj	16538.1108012
bnb1xplea76hhgw22yexp0qjdcer8ej5ppvrjcphtq	16681.534434
bnb17hacevwe0flmkvzr46uut28j0dmgmv7mmlh82m	16670.151606
bnb1r22z3r30899juyz682d6q5qjcdg49nzywrs60e	16540.3873668
bnb178ffmj7ce7a7we365fc45hgnqk4c9wte5c8qfv	16491.4412064
bnb1nhsxkz3dnzyqa8awr365nw6a34z2436wdwf4zp	16228.497879599998
bnb1nudt74776dequ8lxwwdl49j0j362krqglae662	16324.1136348
bnb19pdp30d8a8k0rmk6wn44e8x789nx5sklrzv65t	16170.445456800002
bnb1x4vn6rn6rujsqd2wnmg6exq900jv20rqdfl7jt	15396.4131528
bnb1rzzr6ladwumz77wej6r59wvju55pt404ck7l80	16101.010205999997
bnb1wlhvcgsrn54jr2w003e9m6jwyv3c07g8lwav0u	15222.2558844
bnb1077kxvcunwugm0jyh824ugasa2ttl3vkxp2wet	15899.5341504
bnb1g5drx6skah0rm4ejefdfahlsyfkrneuudjtr3z	15801.6418296
bnb1ryr84ww8a3x55h8zqajexm0h4rvekf5p7yv6yk	9969.080762399999
bnb1pq975jggw0j9n9v9xzfwenkx0sm0ywmvk0ppsr	15264.372348
bnb17c2w4r83qwgy3vh3v6t9fzlxxnw45nkx7062qz	14702.0606448
bnb1kldfyslphmpn70frclgptncfjyf0pyp243fh5x	14638.316808
bnb1g3e3ml360aj5c3tk68x4x4jgj9676ruqejkfxa	15082.2471
bnb125nk0gzl5h40xjaferzxq4kmww4mzej0ee8yvg	14334.395300400001
bnb1rugk96uaj3h5t6t7nc7xtqzx8qg8v9he90vqls	14687.2629684
bnb1h066plzq6xr5v94jft9laqys0afl7fdeg4h3px	14769.21933
bnb1zwhwaezlv3mzs9h2dcjuna8vjexw6c2s88yx29	14764.666198800001
bnb1cmr48486xw3hda63gygx4wkvuvt5yzecastcwe	14747.5919568
bnb10fg8z9dumqhmfhm5s4ghyh9che07hplvk38k6t	14401.5539856
bnb1dk7my4lzjg0zu5hwy40cxf6rq6hajzykyj7vud	14507.414286
bnb10hhfeyykqdj9h6le4sd2r4r3pcey5sjj9exj8z	13619.553702
bnb1rfv6d7u60ppkw6warky3qj40yqd920kyt7aghz	13893.879856800002
bnb19e2l574980xrsj52fj8mvw3xzu95743xg75ml3	13844.9336964
bnb1j7yldl63fxjhsk064dnvywaa9f0g3ka940xd73	13658.255317199999
bnb1qyl5m0zh0a9v7zkgm7xlrzx3jhrnx3vn557nv7	13443.119868
bnb1rkrkr7gjpc5n3lwulqmdrvygup9zyhzy799t3t	13414.662798
bnb1jed0duuua28cnd9f845kdx9e9y0h7hkzcmxypj	13196.112500400002
bnb14hre8yganfdpyq9j5px7mfxc4tudsmkat8jzze	13338.397850400002
bnb14jdt3rxytmk2ul3mgslrpfzefazlw4esljdc6f	12202.391616
bnb1sk70g9c2mm5rcdqqwlrez35ethhxgejjelgrlz	13028.7849288
bnb12vqfkhz8c80x9fyusmfxgcv3vf93d80xmvz0ad	13113.017856
bnb1qk5ugzxcavh2z4l9ayru36xclnjp4g9hnx4twv	10087.4621736
bnb1zt7fzqflchl35mhyths8y6dug3jclhtxj47yt3	12881.946447600001
bnb15zf3vqn8r5fvd35z89w6qkgrymq6t36kdqjdef	12844.3831152
bnb15antd35tkyurm78kcrkhnf06z9nsheczqtw9sp	12856.904226
bnb16dclws769493quc30tvufyg06kjrtkl2cux5tp	12581.439788399999
bnb16fn3sdt558xa3gjhuyyhwmnyhezhtx9f50w9x2	12343.538683199999
bnb1th49sgwvnh38ch90jhxj4zu0ql7hfq4hpmnk3f	12327.602724
bnb17h2ws5j6k9y36dq2r2j4ut6alzlqpvslrxer0y	12531.355345200001
bnb13xayja7mmwxzznledqsddaclfahdy407m434ux	11521.6985016
bnb1u60924l08dq70tven5dlz8n60m6an59ksyf80e	12373.134036
bnb14dfljrfgklz47gvw3ncmymnlgck7rqkcrgl7lu	12350.36838
bnb1fg4s0udm0vxlr62czepc560qvkm8u65xgd06zz	11418.114766800001
bnb1kjsfs8hpc6fwln9fn8enyzsw97s4n0z7fd4t4q	6976.5352812
bnb1hut9uz7kjkfcgm7p4ww0hc2seack3mf8quwy0z	12222.8807064
bnb174ksd655k7qzuhv84p7h0uzcr34f0yl8fwtyen	12245.646362399999
bnb1y8xazlf36kencpsmp5mvwwhj7eepfkf4ztykea	12011.1601056
bnb1q8jrnank36qyhpup5gj6vznvy06heh8frvfj75	12119.2969716
bnb1ftk3vy86790r2qtta6342zn6myehla0jqqjjqw	11984.9796012
bnb1f040c8he9tswy7qckn6qnttnh239uyw9hg8efe	11833.5879888
bnb193902zchc050qa752payuxavl3zegpl40nx6qe	10680.5075124
bnb1cj6kehr2zn0nukvsmrfmxqp02lsf9j9u830anr	11686.7495076
bnb1q088cl283vhx24vquj9uwytuevxrz98dq3yav4	11669.6752656
bnb100cv83e6egqtnav9c08www3y377uwhx3gr8um9	11118.746390400001
bnb1976xg39yru50dqmwnk68ju8745fl97rejyjvc8	11289.488810400002
bnb1uhvralzp63g4tcmnk5mwjsms30qh3heu8p0ngz	11468.19921
bnb1pp5szct76xg9424x2d53d37kzsszssjsl8f4ve	11446.571836800002
bnb1hsakn8w2qu6eud9dfang26nhz2g6h32psh9ldn	4430.1966576
bnb1dgdxwulcepwdjdlmvx2q9cz5td0tdklqyuv0fc	11394.210828
bnb1wcjgsu5u0dfmu3v8gf0eypzvpnt0dxgggx5wd7	11272.4145684
bnb1rut578s59pql883p47k8hw0w09yujveaw8c3dl	11311.116183600001
bnb1jgakwh49wxlrk5y2n0hwyun7ueayszn4zp5j54	11296.3185072
bnb1sesdueuw2walcpu9tkt7gcwfnnls9tx68s5l0m	11006.056393199999
bnb1n7tx92khlcrjj6ugpehnat72kmp47umk68gff7	10847.835084
bnb1rk9tl9wyu55sk6x4nd34hg5f7q687q4q5c2ml5	11128.9909356
bnb1vftev5w20zs50vkh6tu99yj5nkz24epm0f703q	11000.364979200001
bnb1f8zl50cggsyjtszm75lnskx2g563jvnnhjepmh	10113.642678
bnb1g09z0xer5w03gx0z4fu0rhux3sksxthsh5fn5g	10867.1858916
bnb1z2mnh90dl6y7ts55d5t2sn4tz27cx9k3wd9tdm	10859.217912
bnb1f5sn0qx0rumkguvzlt4cmn59k6a8fjl46966d7	10780.676398799998
bnb1tv7csvm6y0kdnfurkmgwat3xzcrhsqn0cj4r8f	10749.942763199999
bnb1tw3rhz2n96c5mdgyf4c0y7zd66gmajjde2aq7x	10730.5919556
bnb19gj3uepn5ra602dpvmkjuuw78gjprjvea6fjvp	10448.297821200002
bnb1nx073cvdh4jwwp0k7q04mw6c6m4re86m2h2qh8	10476.7548912
bnb1dp2ld8ljne45wetssxsz6ufj7kxyw6d88a3z43	10339.0226724
bnb1r5dh7yvxn8atazt6sjcgu9jvahcgmmm3fffwaz	989.1677531999999
bnb1tdcdcvskw6077qdw0tlvlhpd3hem9ddx3pafwr	8188.8064632
bnb1730yvn53eqdnzpe0npg0xrjumeu7xhfs2xw7sv	10228.609240799999
bnb1yde4crz8sk27xvxn9qkndealn5s9ydr4dpf44w	9380.588554799999
bnb1n2dc9jp3afu5qeajxv0w6d9cj7vwhtx2k0p6jc	9991.8464184
bnb1we2rzwn0y82hq7uj9el636khjvmrlng85y7glg	10073.80278
bnb1mdn44ha6lfamtwfa96sjam65c8fagaw3xhqtg6	9889.4009664
bnb1ac8yph5pqj2q0h5wmtwqm49d8gm6a7gw5mvpwu	10140.9614652
bnb1q27dfjj7u5c8v3l4z0n4c8hatdex2ra6rujn26	9889.4009664
bnb1gjq5dqkwpxc06x5jcp58rg64kex590t03ucrss	9975.9104592
bnb138kf8hffzye3fzr93426dnk8hz3f0v2uy3jws5	9957.6979344
bnb1m287ynvj03q6avdpgwtvaf9dj5nmevw85qy439	9942.900258
bnb1agw54hev0het64h3q2zm8am3huc0myl8vs0psw	9889.4009664
bnb1tvds29m5pz7salul2q8hjxyl8v9cu728zfxaye	9799.4766252
bnb1r6847va3achrjxxtszpsuf8m2kjrzgyqzg8uk3	9504.66138
bnb1kvtvftccvmn9mh2qhztvpsg0zxlf5cnd90z2f2	9742.5624852
bnb1hmwz4e37685j2tzlt8guv5cn4dtwz4vj2zmnu6	8691.9274608
bnb1ft0mvnap9q537dga53vuvju86vvdcy0gtcwy9e	9364.6525956
bnb1x9thgqjhty6rjlcd6vy3prugjpefmfwqzz4era	9345.301788
bnb1cqgyl7yvng7xl4plnve7h3r0scycm5yt50x4aj	9480.757441200001
bnb183gxx9ea5fqjgaxsfjjm8qc6pr4p2pj3e92gen	9445.4706744
bnb1fw0ut0j27gnk2flxvclrw25wh8m3vslgx96ug8	9150.6554292
bnb1yhaletwspqzw05agefcsh6ufr94h9g5l8trc62	8884.297254
bnb1uj62c2et9pskuqzv49pvrc85kezlhwh5xwys6w	9036.8271492
bnb1zn6q4yu4kmp7psedf206pl24a36hctcv7dfgc8	9003.816948
bnb1xqrsghjjcqcpv0uftth7klwy35h4nta46nexc4	8950.3176564
bnb1laqhyfucgx7utlvqqvft5ftd7yupvn404md0f3	7911.06546
bnb1v87dy28978et8vsrssrpcfqdn2v59y60nvgkvx	8716.9696824
bnb178yfv4mtshsnect90y9twkt3tnu9wdfz2jj96d	8627.0453412
bnb1hpsrt58fqqey6xrlhzfwphdpj2tw5r0mv3vayy	8529.153020400001
bnb16sydpwht9zvvehyajnctggy3dm7yfhkrqfvr55	8438.090396399999
bnb1uk4u23y34m7hq0grxz0e34jxeqc5krsgmkdjs5	7911.06546
bnb1pkww3q9ch4vr6uuy0525n3j3657qhhkpuwfnz2	8312.879288400001
bnb1tkhxs7u3ws83w0v4whve8sxxvnhchk9cmmxchc	8523.4616064
bnb1qx2xkgmz27t0s7f8fc4xlyc7485ytr37rpely7	8521.185040800001
bnb18gaw8eyxmswj0vxdtd2ua6xlkt6twjnnymw6pk	8414.1864576
bnb1qypt5lw7c9sa2nvfw9cmdwwt9s5fjjngww3mvj	8358.4106004
bnb1xe2jn2w6gefd3vk0zalckm5pz4g95nc3sghva0	7684.5471828
bnb12m8awu57mpxx8jyaf2g20z5ynhsmtr8kjlmr59	8156.9345447999995
bnb185f2h2vu4xufth96p5r46gw0p0t89mljr00xen	8011.2343464
bnb1ptr5psyexlwk0wm50vmtc9zkselnxu6l2s70a8	8144.413434
bnb19y0wrtk5334mqwcrtzqwymkeafl5vdaxywuxea	8094.328990800001
bnb1h26y8uh7dzk74qe6y9al70975fyeql33muj0lh	7989.6069732
bnb1n7vd2frs2lltn07r333dmgtl7574j6cedgsjkx	7985.053842000001
bnb1sxg7389ldm09ep8jq5469583tducxr5chlkvzp	7911.06546
bnb16g22ty7974vsez06phd5hy6ulwx7zkctzy8sds	7835.938795200001
bnb1upauy2lhuve94ys3ulzjpg5v60plcrapzpxldr	7672.026072000001
bnb1n3klj982pseatz8d5g85g2hg8k24l7d85vrzzv	7609.420517999999
bnb10pcax8fq9sjqxu2n0q6p3yrngsrttzhxmkplat	7740.32304
bnb1k43qxms27d3jmn9vgdadlj8nzh0k43ckv644kz	7707.3128388
bnb17rgya8gw4nnelnlt342y5cm6sylz40upjc8ml4	7675.4409204
bnb1xsmsnp7gu5gyjlzvzp4gzaxwdavhfpgxznsnlr	7118.8206312
bnb1lje7zp9ftact0e4mnpx5uw0v4uwlas2j8hwx40	7585.5165792
bnb1mes90fgapscq49qy3u8n7kteellnshyl2tz4az	7417.050724799999
bnb10ymuac5fgyqppageqq95mux2p2aksyhhw72c4m	7413.6358764
bnb1sf58t00clyyugv6fg5myrpnm6zzruxp5qkjzf0	7397.6999172
bnb1h0vd5tlhujy93aaegxp88xsdnamsp0yrwqfyv5	7324.849817999999
bnb1a79mvkwf05n4nvdlvkk59tfmsx3valxktffpue	7303.222444799999
bnb1yyyhpp4q0apn4qeuyqqrx2jueg2c587wf8flf8	7157.522246400001
bnb1qk2e6dayp9g236s84s5dwgacnxsxz2a8h4kkql	7127.9268936
bnb1xwhs35kc5dd4tg0c7s03gl39qjp92wpe4xr92l	7061.906491199999
bnb17cv2vkkx9pp3r0ewgu8w508njd7j6ss9995r5n	7247.4465876
bnb1hxepem8n9ztcv2rscxqrsxfkmmswnq0fe9hucf	7228.09578
bnb1w49eg0lguy9vaq4ke3qxsazd6qe6ex3m6zpag8	7225.8192143999995
bnb1qs7cx62gdt89c055ftjnj92m06rsl6chgjx3xe	7218.9895176
bnb163h9re847lu3smw6fwyuej25auysvzxpu8zftj	3215.64891
bnb1tqxmc3kkmcgyh5l8lp8a4rr5z9k8lcv6jlfmce	6891.1640712
bnb10heqljggrkhksuqdejtrq7vm37ek8eaqjhqaj5	6516.66903
bnb1n0nqhy536za2j6szald86x4f2dn6g8fx5dlxcr	6052.249647600001
bnb1qcq3rfy9vwqglcg2022zv3v0x7244eyc7j974d	6762.5381148
bnb1w5e6htsx55xf4fpp2yyawlgvl9rt06u40nh9dn	6742.049024399999
bnb1qpqlczwcucdh2dajve4ftccwzpsc4r4488n8au	6108.025504799999
bnb1p5lqhax6x74szyzz9ray3hkyepd7txznwsfy8a	5947.52763
bnb1eanr7w0saq2lsxlnc9uj96m7j73raykmdpu5wm	6378.9368112
bnb1kdqv2rv7mneqe4mvstee6lgf0g62zd9899qz30	6126.2380296
bnb1t57mhrm8hkakjr4ug3a7m8lzlmcdj8427cu338	6415.361860800001
bnb1rnxzvqklz5j0g745gtwswacknmneepdyv7ke3c	6456.3400415999995
bnb1em9nsygepjt5zx9h75y05wgjluz8ywgehhc2yr	6442.680648
bnb16jq8a6h24942j9ffhzcea3ly6s5ys0ur6tkatd	6381.2133768
bnb1syvmm0t8jner6t9zx6jf2c3lswwm90hutt5e4z	6427.882971599999
bnb1048mpkna4p40y6gmkcn63akw25x9xym7wkls0d	5749.4664228
bnb1u833delsr9qduepw0vtkmw7a6j5f3wr9zt665h	5749.4664228
bnb1c4z6fyfvmmpjk2z0dqfmue2chtfme5mhgqgg75	5747.1898572
bnb1t8f47y9jw78d79vlcl8qa6ldzgz562lnu4pvhz	6237.789744
bnb1ly4lny4zk6na3xx7gzfaqjn5n4jrfl2ud4jf4e	6282.1827732
bnb184euge8a4pveeafhk4ytap95rdmf0lxq40vwvu	6270.7999452
bnb16ncamujv0zt3un2jd7yp7tl3hd3q0mdssdk99t	5749.4664228
bnb106vex9cmmy2kc70p8pqx0z60kxzxe9uf7qxm09	6189.9818664
bnb1mmydtak38chkasc2fs9qd80g3kp9uccr9jfmvr	6042.0051023999995
bnb1s90uykywr9e4e8yw49l5l9qdj97yftjyshaf3u	6143.3122716
bnb1z6s0ax5l0q5r4t0ywmk952z926wdq3hvxapnfm	6123.961464
bnb15clp8sfv0jrdlfp7wcnx0xy2ckwk4ftt00sh5c	6054.5262132
bnb1dfcejdy6r0j0zqtkxhjl2r2zsyjagjqkk84ny0	5825.7313704
bnb1xvvnlp02zz8lw02q5ay5v5cemsysm3h0lnqtxf	5544.5755188
bnb1ee26vcmxqpnjj2zkpmaaa4jsdx8dev6m3hzgnr	5035.7631071999995
bnb1cp3utatyj4rtzed8m06vrw4zucl38ctcskjqru	5986.229245200001
bnb12a8u8khfq78rnqytt9lhc9f7h9cyhf55qy6rlr	5970.293286
bnb14q5pt2qkfvsx3h90re83mk6ve26ke7tr9u0y94	5886.0603588
bnb1ljfdv5vqldp3wxl6yp8wfxr9vcm0yu6zyeg2p8	5873.539248
bnb1afs3glmmxqmpq403p0d8xrwyedrqhn6u6gtjwp	5236.10088
bnb1fnf9kppfa69w09vegvnxu7nkh8yw80yfhujr2v	5395.460472
bnb1sxr28jlzup9gckus2jly3j2gtwkqg3msjy6hsh	5196.260982
bnb1gzzujsh6mpvc4w6zdw65jhhr2etecaxewr6mff	5023.241996400001
bnb140ym0f0mvhusw4n294ry52hmtseaklkyffjml8	5542.2989532
bnb1frz9tjmt2jl2a2ud7elnhyz6nq5xgupe55htd6	5386.3542096
bnb1tnrsm5dfwt6yt5ejqyz0hmhpnfsu7w3z22x59a	5479.6933991999995
bnb15kargly2atr90gswqsv2weqcr90l3jrugxqquj	4805.829981599999
bnb13qf7ew7t9qk8jcpqw6n4e79ax9vwp2rmtn3nt6	5443.2683496
bnb1xen322z6kfdz4mrqhexr744c5khsw7uggh2pe7	5439.8535012
bnb1uupqv4wh2dermzkxvqftfwj9gf923u2lxf0ya8	4857.052707600001
bnb1fcggj86uc70ddcmy6ue7c5fml4en40h6akrfg4	5186.0164368000005
bnb1mmae0cp0f7dtcy34t9jsr37fdwtge66xsrjpux	5229.2711831999995
bnb1snyfc7jva3fysulp90jz46cgdh5twfy36zfcfw	5112.028054799999
bnb15ec8kt6uqpjnf0rx2ertscyfmdq39cm65ms4aw	5173.495326
bnb15znh3ahlmfhkf4zcmhdyh2zsa6s0xa4rt4hra9	5076.741288
bnb1squ7c0m4gsclz8a3hm2xfl3zx7wqa966fhax4r	4944.7004832
bnb14jntfdgm4eety8r83nf0g8hsrjydml7ud4gmv2	5008.44432
bnb1mjdse6xxfxxfl4z8tnmdhaxfj0vjlt2q0hdllp	4987.9552296
bnb1tqetjwr6q40jd7gafu9vxj0k0f2uah4mcjgvfp	4977.7106844
bnb1zpn7fyv9kfrvcf7xuc09qmcqgsgwh3hm2mxfsm	4932.1793724
bnb1ptu34ytjmsjhtpds7qhq7gzgs9tp9dvxh8z49l	4926.487958400001
bnb1w86r3c8s3h2gg53np4pwjxkkz587ywf2al4vql	4945.838766
bnb1wa2g4k72jh4vr9erjsmw68leqptet8gyaa3l8l	4944.7004832
bnb1s5lvqww40ywqyg3f9awawfrdx6z9qfc6k23rts	4842.255031199999
bnb1clgu43mv592tz0ccu222xygxy0r93asvv2whxt	4685.172004799999
bnb1qrme50srncmfttz8s6f2kxfvxlreywkr4ymtxx	4821.7659408
bnb1h9zxfev58qxjf435crjwc0jp4yhr0x3289j6f3	4765.9900836
bnb1j8zng9ev6rmct3wpwk9zvuxxx2neny3fspggfz	4735.256448
bnb1lrm54zxzq830l5t7n7w6w2vmus72j6sw8j00ax	4640.7789756
bnb1q7jpkp88ruwy0r6s5klsszldj9jxw3n4jmftd7	4647.6086724
bnb1qpnvnvggzqv72vt6gdq88v9pcj3hzsxwlxyvtf	4526.9506956000005
bnb1wrx0azvjvmy94f437kun0wt9l84dj7dvle3ktw	4633.9492788
bnb18vdvqp5h983wd9dzc94p5t9egrvt3acv7jwc5h	4613.4601884
bnb1mmgsjknn7sqxme4vy34mjmlfm0shkyknnhmcyy	4347.102013199999
bnb1khffuuul9u0q4mxjt3la4qkj0ekn9phdm406e5	4386.9419112
bnb10pqd0gkpmpluspf2zjecdq4v4ft56vdx2adsh6	4553.1312
bnb1rs3ddenu00p8p7cpw6vnat9cxz2qc2ayxxx4qz	4409.7075672
bnb1cf0lg2k3fc2w0hzytu6hud0fe32unv4x729gwl	4250.3479752
bnb1rtjc5r9ufr70u9vv76sy4p64jgavpkhqla05fj	4273.1136312
bnb17dgg2uuvqc75lg437r32wzs636fwp6xkmf3396	3757.4715227999995
bnb1vv7j6lmayly5qpamfwew87spp35z2ejueyt372	4252.6245407999995
bnb1z73qfvnue5uams3w40yaczafy7pwv7f92rese7	4249.2096924
bnb1jmwzglxzy77v00k4572rr4qehtj0s35uvrf9nd	4216.1994912
bnb177pjjc2v9f75h32968gg0e2xk7v7r2nkhz8ej5	4155.8705027999995
bnb1cje5z8ttc4z43ffdhr5q89ac6u73vy2qyfj66d	4113.7540392
bnb17j2y75n20s38u9afedtxhlfyzjh20zc4kk2nfw	4149.040806000001
bnb1fj20x8zj66kqnj8tpl877dy25ktxdx0zpnl5ev	4142.2111092000005
bnb14pxmayh44ygftyzryfths26s97n9mvsedk2s45	4023.829698
bnb1553zyg28j9pr7usjc7cx5puvu4u7znyhj4pmm6	3906.5865696
bnb1ueka8sht9jghnpkcqcmtl2urc04d3gqmdrz87k	3863.3318231999997
bnb14gx273k72u9rh9ue4ecfpeu0yg3lglt5cp5z7d	4003.3406076000006
bnb1rjk4yfq94y5dc6rs8jkxxqh0hpvldcmwhvk2rz	3998.7874764000003
bnb12f0p2wn8whmykymundfrkua6xrzvxhl5mu8dtv	3955.53273
bnb1plrh8y036wnh722lsc6ufx7lazdrz7m66tdl7h	3916.8311148
bnb1m4mykwuvgjv8fea4vregpwwj6t8eyc7ldw0wud	3870.16152
bnb18yuzq552dqwfmcur957n460zq2svksaexnwrmz	3584.4525372
bnb1qtl978856v9864s6npal57wu08tyn30f9npr5e	3841.70445
bnb1xhckvydqs89ws7cpyy7g52e72aucyt5prwq5ms	3723.3230388
bnb12jzza498kdzd7hxevksddq2m5f3f9ncjgfe6m4	3677.7917268
bnb16xdmmw0g7qu300k37ka920gcjm7e22qfe42ttj	3478.5922367999997
bnb1xzj58zac6w83qcv4ag5u057ya5ny02kfdl7t3x	3619.739304
bnb1s0t2zm3ylhfjhzlh60euj6wz4mrm97d5y0r9gm	2303.8843871999998
bnb1kfmvygat92s6dt238utqe2kv9xygvsvf0rwqxx	3585.59082
bnb1rnmh3t8k9vefenx3m54pf53xstkesnjsxs40cq	3604.9416276
bnb1dqzvulzuwq5w8wej2w5mxw89py36p26qz73p54	3569.6548608
bnb1lzvumkuhr5zavlarq2xnuncfm4hhgx49wh7v8f	3590.1439511999997
bnb1nr7vytg3w883unxnu0qnvdwwctn5qx6lqjs6av	3559.4103156
bnb13j4xwtn0puedu20n9aphmns2ynflmk5g9jtmae	3470.6242571999996
bnb1qxz2sdq0nhctjnq702m555xwx508yvlyrcn0jn	3501.3578928
bnb13237ejj35shsrpsx4n8f6t7wm7f6msu3muuz7y	3428.5077936
bnb1dqa5xw3ep59q0wd2lwzgvl4fe3auu67vfje7yj	3180.3621432000004
bnb1au60fnr53k822h3dt2lurtac8q75eafzr8nl6x	3418.2632484
bnb139cr9zurcygf9u39rvx7a2a4gc2mv4ux64sgg6	3388.6678956
bnb15ysauuy7sng0h7t5cf88tk4jjg088zhj89xev5	3229.3083036
bnb1yv5jphllhsalk6udzf9uxlmgexy23wk8kxvz79	3347.6897148000003
bnb19unjsczlfn6fezrkhad7yg3tg376ep97w23kgl	3057.4276007999997
bnb1zqewsml5wav2f8payv3kngsvqtsw0yj6jtqxzn	3312.402948
bnb1s4cmttz0vlz884x7mqrc47wzm3d7nf3snxr0nu	3294.1904232
bnb1t4x3tykyugz9jxhtm93ksamqyh76swpp0hrj22	3085.8846707999996
bnb1ghn7dkypm3y2enrqjx827apvsrxtv2cz72mv80	3232.723152
bnb1k6dqfm05y5jlx2r4afwyqazsmlqzcdxgu9p54c	3191.7449712
bnb13n4a3lkjl4u3ec7s3epxl9y4eelcrek0mz2dgm	3186.0535572
bnb19wsg2zjt5t2aytjjteur9lnch0ex306dfenlru	3158.73477
bnb1lrsyxqdq88tk9h29fu6g33837an4cdx39xv7p0	3170.117598
bnb15yt4ymqgawgngvg5r98kr0v3qssqcvhqqpsx5y	3168.9793151999997
bnb1tfu4la3j3t4jfgk94kn4f6kkcm0fuc9r6geruq	3146.2136592
bnb198z6y8qndtxx4qskpr05jmkswv24g8fu84xrsr	3114.3417407999996
bnb1ugz4pnt724mvh369kun9eqdkrg6zytvfvyxjqg	2966.3649767999996
bnb1gnw6fae0xl6rrp2qzvyttfq7qvwv59almedjya	3028.9705308
bnb166pngqahg6sn2z27ztx9vrpv3nrdgahlfddyft	3080.1932567999997
bnb1q6h5rpeaw0plfg5xtlqq4lkvyxr02f5fpeq8m6	2717.0810435999997
bnb1rdl8f6s2ryhqydmrckvzkal26v3dq47rzv5j8j	2972.0563908
bnb1s5h9kmvevmkr26sud2g272rs64a3ddsgxf365m	2918.5570992000003
bnb1rf8l9hypry6q88mrwf46yff89a8fcluxw50gwg	2753.5060932
bnb18w97408dmz4gsgrg6e79svpy9tfyg8lm0qads3	2860.5046764
bnb1zg7venh02tuc9zdk0dkl88wlvyaskud93d7ql7	2868.472656
bnb1zql5ltnlp5tuzen5pk4dd43an4ztceauyxkhpm	2780.8248804
bnb1dxjvktecj0cxurc27s5lnena0fk30kunhxv33j	2830.9093236
bnb12qyay9w2fmp6qku4lqr6a5l8xkclt79sypfzx3	1814.4227832000001
bnb1xqc0tgsu0a54zrpkmtsmt5dth4gvjmv42xvw78	2432.5103436
bnb14rg9ev58w6d6sqjn08erzxy820h5003ad7emk6	2715.9427607999996
bnb1xmvk5uxlh2csecnf9ppy7wtvcw5jutz6v27xz9	2664.7200348
bnb1xcmayyzgmnxmys60adkyd5uzfentes8u0alx28	2682.9325596
bnb1jzcdaw4nl6kp3vs2z6wrmpvkttdj96t7p5xznv	2670.4114488
bnb1eyr7lxsjg0367zs3kwsw7zw8ur2srku3g4g8ap	2443.8931715999997
bnb1aqjys3p6yp4f2fl448p8rdm68mgh0hsj9dkvtk	2541.7854924
bnb1ny55md9z39kd0s73qtz40rfun0zwy38m865mqn	2511.0518567999998
bnb1vxs0z9pgl94me8tgkvzlg0eqm4ueqpnw33ergt	2513.3284223999995
bnb1jgk2maa6p5njc296k9m2jrfj3j5w9zguywvrj2	2287.948428
bnb1dkwqzquwyrck6ka2ffaqjurreaxpkz3n2lchc3	2497.3924632000003
bnb1mr9rq7x3tjqqp8mgxe2sxak6jkwwc5xla32u3e	2246.9702472
bnb12953mal7nwzc54wddzfg9x0w2etmw853pgw5za	2490.5627664
bnb1w0dggkpmfzr6hfnukk3hm4zes02ffzzyjvyvcy	2497.3924632000003
bnb1w4z85q70z4rcg48hpmc428aj90e8czzu79jphc	2315.2672152
bnb1d2llfy6r8meh2efe7dx8n5acpk0wyq5pz8443l	2476.9033728000004
bnb19dql40gzpym3lmwtwjeqkwmcc06del4j8a6pxd	2360.7985271999996
bnb1z3wpqx7phyqp0krkg4ulzw30x2zjt2hhvdtefc	2435.925192
bnb1dpdv863strffwpldzamp8mllqp432e4p6d82yh	2274.2890344
bnb1ta4uufm80a73e5qw2wl8gxe7npjjwe2aufkgzc	2231.034288
bnb1rwqsjyp3wkk40ylyt0030nw5whu3nekvzknj07	2322.096912
bnb1wdhgtcyxtjwu2whnrv302jejamf4r5xxgs8njh	2323.2351948
bnb185vezek9zaw7jvswu7nfrn7mf6fwjp8wky92p2	2301.6078216
bnb1v02cvc3qcw8s36lchy39xfqu32r8jkmwwv4zd5	2289.0867107999998
bnb1prczmw9ev6sweg33ggl7ctmrq2qwq87cyk45x3	2260.6296408
bnb1mwntftfjchtfdty5sh4rvanm7vemryyz9xh68r	2275.4273172
bnb1lcsrekgqrt07yl070d22l8q7ajuatc7jmaa4fj	2254.9382268
bnb1t8jxxt69tpqj2025fxrc3aj4swh0mqu5asydgk	2011.3457076000002
bnb1ra8awp7hlmrwpmtqmagp89w0j2uv5625m5axmt	2175.2584307999996
bnb1t4nac022fxhwpz7gpwt5vvvjncmcwf73gda5ka	2208.268632
bnb1fhks7ldzcafh33e683hu870me95dpnu3kh5f7y	2188.9178244
bnb1w9rlg3dst6tq58y3zn0eampmdjwl7axnac74ks	2145.663078
bnb1xdfnxqp9cuzcslkft39ny6rwzeulkx6lfk27az	2146.8013608
bnb1e9uxcsx2kerpm7fza34f20nsq08z68rjjx7pp0	2017.0371215999999
bnb16zks743gmwftphaw98f4m4mke2dtshdr2wg8he	2080.7809584
bnb1vr8rjqq9deyuvd65y5758zkwlcrkd4xpmcw4xn	2104.6848972
bnb1aeexvc3ugrkrcssaa9zj3v4tg8z5cu4ynfqwzz	2064.8449992
bnb1efzu5w8fqr3mdmhmyax3005lerekmwadtygnyg	1978.3355063999998
bnb1d4vkzqwutcfahzc3thuvqsh8kjdzguqhjrndpu	1994.2714655999998
bnb1vhxgdg8k650awk8v9d3fayvuratx55fjra8hj9	1881.5814684000002
bnb1t3xemvj9ywjhq7vjdlzpafed0amuq9v5mmg5gt	2017.0371215999999
bnb1ml7gslskcyz8yp7tqjm2aqyjjlry50map9s5k4	1978.3355063999998
bnb10ccet2wmyltj0llkugty0qyjdzmxy3ug02vlvt	1958.9846988000002
bnb1kd5r9gddely33s3a8xug2fqzh5w9nwr5f43284	1928.2510632
bnb1mvg8fw0nhnazpnswwgs5dln4lvdexgqca3agal	1890.6877308
bnb1hph5vfw7ec7z6t6mccwk686c6rtm64gzxx8p8j	1719.9453108
bnb1amsjet7uwp6xf2xumv0ahgcyenaxdpnhug8rst	1670.9991504
bnb1fmjccwaeqrwlx7u4fvp3qldh6gx0hqj7vfsmqk	1543.5114767999999
bnb1hv4gksf79y2z5znmgyqj8cfxy7qka5cxfls750	1686.9351096
bnb1l0uwgmzczyy5cl8vgwed5g6l0nj774lxts3fgp	1639.127232
bnb1r26gq7pwap5kvvaddtrsqcez5tzr5pg58fvq6u	1641.4037976
bnb1slxfwsr9ex3tury8qp9lnsvta2cza34hgdtun8	1509.3629928
bnb18y3us7fgqxavwph0fvqemnzjuvqkmtcc4k7lu2	1561.7240016
bnb1e6nmnnr7ft8sgzrr42h6adeqjql3rn5u8g0jzt	1561.7240016
bnb1879h7dgn03l78u3836d66ljm0n5prrrsw9984x	1556.0325876
bnb1wz8jf3lwwpdzc4p9cmst8d7wcey6ll5l0d32q7	1521.8841036
bnb1tjryu0d4typp6j0k7qkvyr96hgalc85ea2sqjw	1505.9481444
bnb1k347q96j05mwy7z687xx2hdl6rnlnp33gy02tn	1431.9597624
bnb1k48jj84ey4x97mavahceda2e8l6xnu8z6ydts5	1496.841882
bnb1j9vqmqnwa88x7ewfk2g95w709pttk33aqwa55s	1441.0660248
bnb14j3qrp0vhkh07xqehzdfnpr0xd5207zjut7vuj	1319.2697652
bnb1cj729ys9x9xaghdanzfjkafnvyf3yw89k5qnfz	1323.8228964
bnb1uhw3vta46y6ymvrg8xsl2tnuqae5d4v6vv8a9s	1285.1212811999999
bnb1mvfg0n0437zgyyvhxlvd787s3vrdjzg3hv00ya	1398.9495611999998
bnb1z2az70sggtsxy4ft8jqlae59gzn08dk8s82ttq	1369.3542083999998
bnb1qppgwudnres9wv9qfapp07x0qsjq9f3lkxmmrz	1375.0456224000002
bnb1mmxv67a0zmls0cnwpevcqjj7ryrqplrwtyccfx	1279.4298672
bnb1jut78n804espeeguqg89d9mwy5w2xu5plgzsy2	989.1677531999999
bnb1r58tdmg7x2ly23pvm7pxvcwn6qmyxata62s6uk	1241.8665348
bnb17ya2asjpsehsz7qj4gke73mvdz9g99dx6j5cwe	1230.4837068
bnb1gf8sy22prepvvcuev25ycjmkds67zvzg644tr6	1236.1751208
bnb1v6fwju5xgsgknw56u5hfwpyfyl0zgztqjpadk0	1126.899972
bnb12lzpedec5p3325stlpny4feahh54zawywatqze	1057.4647212
bnb163vsrwqdgccerlxslxh5tc49h26wpqceyzafnt	1205.4414852
bnb1vp798vrv0ceyycns8kp67l06c5sx8kqxzvs405	1180.3992635999998
bnb1lv2v2tgcmzhhk55v62gynxryvvvzymzjc95vlr	1027.8693684
bnb1034utk5uhgyu2htmlzsm8z9j3vvc5ctyd9tkyx	1141.6976484
bnb1r8lkrtutlc4n0ttz0rzlfmlz2jj033lah5syzq	1058.603004
bnb1l38vlm7rwrgy8gx7yzp9wkq55r76vasswtv24u	989.1677531999999
bnb1vq8myp56cx8xm45tw3tsk6s75jsd89hd503chf	1100.7194676
bnb1mke80jkjzudku2qamcsz2399zczg3rqn9fftzq	1038.1139136
bnb1xgrfng7metfu72cxkmxga6nzmajevg304h4nsp	1067.7092664000002
bnb1p27sdg30e7ls06jddr5xnjhzp9t8cmkld0303l	958.4341176
bnb1jmwcsnkg68d3dexac4p3czctru324ar226mlg0	1036.9756307999999
bnb1n2zw0akhraf9hss7ds4j0z6n5t3nfe4yyhf24r	1029.0076511999998
bnb1avnu2rawqg2jmagwxvul662pgmjve49y7eh893	1017.6248231999999
bnb1dayvu3md66ncgh2vlpzyrl3us05auumn0lrj7k	989.1677531999999
bnb1wjg7wh6p0uwfupj3xnk97mg66rtpdut4cevxuf	1007.380278
bnb1h4uejj09xmncz27yghjyl46jgf2f5wuefpnvza	989.1677531999999
bnb1kejyh29l2r6ltl3nempfr23lg4ljt95ptkcgaa	991.4443188
bnb1vr9tqw4lg6cpderfgyuqhpwzhpt4l2wl99t9yy	881.0308872
bnb10qeezkrd5n6dmwkhpqc004hll6nac0lm433nhk	816.1487676
bnb1c0arx8596ccduwtxykhnye2z6c2w8fsjjqj30d	764.9260416000001
bnb1nxfk6u9h887fd8pza9xtwuyxt0mpzmt5pgj7n0	883.3074528
bnb1q7jynusul9zzuktjsqzawfxdkl5460m4q8lahz	870.786342
bnb15hp7klz9elx6eg5wargd2zljj84rmuha5clln5	794.5213944000001
bnb1zrjnml3sxf306p3jaezt23xle5z2cy74wxr369	822.9784644000001
bnb176pmen305akf4tw9wydk8wrzug4h80zalec27d	819.563616
bnb1s03yn5u47mq2r8gg67uz0ldzdcxh9uzxte85jv	797.9362428
bnb1f95r29xcwnhnym7mn2axnk5ycv4rl03d5qhpl0	662.4805896
bnb18q360q63yxc5etu47fhqcvknxkg2vtmrl4tw5d	675.0017004
bnb1s7h0jj0etxxhdxmx0gfgx5jq5yf67xcgqayxre	712.5650327999999
bnb1588p4lqw3l0z5w3mfwd9asqtugdml645r6347s	714.8415984
bnb1t28tus7qgkqnqw9wem8x8s0ajs5geuy33dzv9k	715.9798812
bnb19wh0dusjzvwxze7pg8dcxw4x4yg5fvtssssaez	624.9172572
bnb17kwk6esla0rk0yzxk80gmpg4xgk3rek796s59p	542.9608956
bnb1798s60dxzyhj75pzfa7ms0ntzw2e2xa5dmcfkz	595.3219044000001
bnb1xl0x8faat7atrl2q2nxxjp57tvjctcldgmx809	593.0453388
bnb16xwd37e32uljducdtf20ue44cgmllfywrw80lc	569.1414
bnb1p8rg24v0m62h49qu2c5mzkqce0rkmjnaevtg5g	570.2796827999999
bnb1rve8xzp032x9l08ej402jxakcjymf572klzrnt	447.34514040000005
bnb1dq2ms3k6497fgvrafusecugj7x25v4dgvwaqmm	461.004534
bnb1hcpst9s56pgz63tesys7qvcgftgqsz254sxwwd	494.01473519999996
bnb1recmsxkpzqcsh92jh9elgnhhyxkspqqg974w7u	489.461604
bnb1eh4t3pdectqku4t9c03e4qsr9amgnyxe3tft9d	474.66392759999997
bnb1qveevplpu4ndyrs67x0hlder4tw5w6amcrlwus	470.11079639999997
bnb1vcls2wewc2c7cnhtqhxuapwu7rjkt7u69yy938	442.7920092
bnb1f9q2k2n39uuv3qa7rkhvavlgnqzq0390ckze54	293.67696240000004
bnb160pjusqjedxmrzcfg8yj8hxryezjknlvfdgue2	433.6857468
bnb1nk84xeyyyt35qjczdwfnjw7v6vd92crzrcww47	383.60130360000005
bnb13cs99gj80zdk9fge56atx7zsdltz47p035yuuf	399.53726279999995
bnb1syf0ue5sdaqvz8pnynmnnpvhj7n57dufnkgd9t	382.46302080000004
bnb16gnwqqkhjfca7kwtx6fgzdyk7vvnznm86gde5c	334.6551432
bnb1rzdp2skq3xnsf8s0ejjngdsdkgf6r9x7qjvkkw	332.37857759999997
bnb1n6uhwyz949x4zntc5drhsnjgtkyj3rwkxlzwxt	336.9317088
bnb14xwfgsd85v4ld95qj5v5hcrl28se6xfv8ywyxe	331.2402948
bnb1957ec68e8x9jlwe4dmjna4qm3wmsm39nx77f7x	322.1340324
bnb12yey4zvhzd072q6ds7h8md7nh5c6xdhz0amvqh	301.644942
bnb1z03jwx76gsagq3wks97n89s0gs6fz2p2zm3npw	284.5707
bnb167g0lwryhq788eg7u2yrqkmfst7gpkzyktqz5l	297.0918108
bnb1yag45vt3khzj8ur8fc5qzxsppczk6hnkyegdal	270.9113064
bnb1ja6m05v7ccejcwqdys6cz2vfu2q37pj92zrx4x	243.59251920000003
bnb15p4lgzx8r0lrvhpnl9cn2fhp5m0yy34y5azc5q	229.93312559999998
bnb19rnmr90wxjsmazwgupau88avm6zly5p9370qqw	207.1674696
bnb1tycq26ase2h9zwuefd8uxjnkd9sn0ejev38txc	198.06120719999998
bnb1z363jdf6zvyhemgccxt37y7rmk9txz0x2m4z72	198.06120719999998
bnb1qqm4wjp5e2ksz5neuxtgpy8crr9xj6wylf5crf	155.94474360000004
bnb1jvulqla3m60duttrkcq4yv8l7zfm8aly5ddlka	185.54009639999998
bnb1n4yptlvz8przxrmg55vmg3pxfsts8ckuscvtt0	177.5721168
bnb1a2zgjdpefqyuwwjx0n4n8sx6l3fmg3yc7w4ppz	169.6041372
bnb17cjygxq28a9urf5y32tz2d2jsy90dz5yvt0fel	168.4658544
bnb1sj6vzk3vrvdnwwhmldxxtn0t8mzg0h5ll4cqgm	150.2533296
bnb1xdtz9n75zddm40xr84h7g2zds67qd2wkpfaqwx	142.28535
bnb1u29z2cc5jyx3je85tjsquyvafyz9l367frtjvu	117.2431284
bnb1w97hhq96p9ujftff9nfq0eeqmg4ce5wxx7pfyw	117.2431284
