[
    {
        "week": 0,
        "tokenID": 0,
        "members": 72,
        "memberArray": [
            "xardin.argent.xyz",
            "0x443Da397aa57b7D264B97B9cFCd51dADF5Df4e19",
            "0x69F329EE79C98A94765e4105aDFd5a87458d919C",
            "0xbef32030aA223A3031e3b4C5b24fad66d992413C",
            "0x11C8D4C8d0FF92bE67eFD2dBd860654BeB102687",
            "0xF31171daC6C88C227feFAF0CE6C5003edA1A87E0",
            "0xBab49827EA9f5459B43FE239cEE9e2457351D2D7",
            "0x38586444200e0DC6938c8d258fb15FD14EB619b8",
            "0xdDF6470B257C5CC8b2ED142EE88d331d8339D2b4",
            "0xcc17e6ec4540cb49E871B00A00157DD20375C253",
            "0xc5cee9416571752528ACbb4331761C5E2706748c",
            "0x378bde8b897D64F4047189C3F8b689008A560bad",
            "0xF9F02eb35cc9F22A69DAA26bE2B1A57e3Ab4bD53",
            "0x2F6102a60813aF809C8dA5f46Ceb1D022dd718f2",
            "0x5Db16FefCE9e8bA024d064268b041C68ED7F9fbC",
            "0x5FFC32c736Ed221aDD02Af2af6AD6659a6DDBbB5",
            "0x9676762325fc3C1e14D251C021185248E8204Fb7",
            "0xd1f44b1A4cBE6A3C23ab00976c6bd66aDbbED278",
            "0xC3130F83BdcF5E84f777d58580Ce99D811aea108",
            "0xbd52889A4cB198a0E2cE36b52Cdf75c4e65875A8",
            "0xdc211A0666bed568D5caFfbf538Ec221FCD1402f",
            "0xB677F5e503cc02B7A0d358Cf6EaB2196b3932709",
            "0x45ec7AaF83AB1B57556951E9840456111467F800",
            "0x68c6a54596Dd8FE889054E99F3212045F4235680",
            "0x8123083C03Dd253E593A9DCd62619A223cc4dB22",
            "0xB48C08B5ccA1636b859B9a691Ec45C207Eb0708d",
            "0x0BaBd8774f4FB8904184b0965204e5A9Db43aCfe",
            "0x9FCAE73fbf4fC6283B636f707c17529c2ba7b684",
            "0x1dE46E70Ec82c237BC14f7e9058C6Cb09a9b34Ea",
            "0x21748446955F1efC75bC9C843fBd3a8E6546d21f",
            "0x064523542F3114bcAE8b1eFc69D945788eFBe492",
            "0xeE82d15265C15a00197693B361b7735a93b82e55",
            "0xeBE6cC6820a76705B6654FdD1254256DcD54F1dF",
            "0xEA29a51b283eA6C0d3872a5c3dF4ddE3cba94128",
            "0x9008676d9EcC75c506aAd7C70eBD55523fcb725d",
            "0xA57c1Af56140A195F876310414C34fE9FE399D87",
            "0xac35452f3deB273d37bC1Ee84B60723CDbCCAeda",
            "0xaa5ba45127268b7e4b59058a952ab1e926de2075",
            "0xe8Dc3cE0bf4a07C7854331E663ff86cFC7BB7839",
            "0xED376BE0003D1C6626DD8C353b84697e315a821C",
            "0xb00E81207bcDA63c9E290E0b748252418818c869",
            "0xCF96021f1ebEdc4b772347583323b194c7d55dA0",
            "0x6d6d75D544CB628ED5C4e4ebb619aec0274b8855",
            "0x4a5BB1c9347A0d4F7e06a29239162f03647d9232",
            "0x45B115bf21872c798b8f131EEE9AFA30b96A249F",
            "0xE77652a153b6Aa41b6D6ac2cDbd4d9DAcB72306E",
            "0xF3e8a7AE6F60bE09Ee463B6278F293f4289e871F",
            "0x76985F8bD32dE258dFc8ae497ED5F0112322D078",
            "0x818a86f6db284A7E45ed98Cc1Ba88D534d07C74D",
            "0x980C8D51202532d34647aAb766993a6ECC9d0a59",
            "0x6d16749cEfb3892A101631279A8fe7369A281D0E",
            "0x2ec1490f24ea5403226918344d9aade830264cdc",
            "0x0B7dc67a6eCF6Bc0388409DDde919aaFcF0E0ff7",
            "0xDAe442e757374088bEBad7e24E5A541Dc6C94E54",
            "0x4BeE0d0d6C437a9Ac4a24088824a8660bb18431C",
            "0x5fb4a0983daD1A0fae31ED67F1aaffeA3F3E8eC2",
            "0x833652029fBB7bCbd51E0f5921DF143305DbB856",
            "0x5c6d2ac4A20A1f5812Dc7229B9812d10d798F17a",
            "0x1D9c41971a52C6559636C349D8d8f7F14B2bBAE1",
            "0x1E0b16d340eD938A71467998e997e995110eD596",
            "0x4A11a811e05FdDa19A17E34ce1C9C8efD2018cc4",
            "0xbB4Cc4392C6ca2c8D5EB8577Ce4fC77865b81E7F",
            "0x02CA4101eA84f400c62b3BeB87Fb5450a8702941",
            "0x3558f346fECf745365fc2944d8F9ae970aE21759",
            "0xB677F5e503cc02B7A0d358Cf6EaB2196b3932709",
            "0xbd52889A4cB198a0E2cE36b52Cdf75c4e65875A8",
            "0xCF07D97889f1b2c2BdD8c2C91B0a639F867B00A2",
            "0xFCC8ed5bCDdc5002804b0a0f48ECDA71eD094aF6",
            "0xDeDd3D2a2219458eaD3afF1C006a759489b94106",
            "0x69996feBef47bEb378514BAc1A2Dacc88D947698",
            "0x5FFC32c736Ed221aDD02Af2af6AD6659a6DDBbB5",
            "0x76a95d549Ca36d955Df2c72F693690d8e51a94d0"
        ]
    },
    {
        "week": "garmr",
        "tokenID": 12,
        "members": 30,
        "memberArray": [
            "0x972311dc283c1CC03d71D6f061D177E00Bd32737",
            "0xcbC3c47ea95b6dfc9a5D3CF0943045937f569530",
            "0x291EE16D5EA00975C4E104D7Ba72A83B085e684C",
            "0x64FA0191Ee9C145B38c43BeBf87A717533caB9b5",
            "0x0EAcbBCC7A4D6cc262DCB6a6F78cA349F26ac2E5",
            "0x1e0a9A420a691aA1a90B3ecFcd9707619c8fe0a7",
            "0x833039F011AD23614199a053a0CB7072C47e5270",
            "0xfbbEa914DF274A58F14E661b40EEB30682c341Ae",
            "0x0BaBd8774f4FB8904184b0965204e5A9Db43aCfe",
            "0xD8e5752821af814cD5B0aEcaF47bF8e6030A5903",
            "0x1b2cA7CEe3470C28C08a1CC23e45d90ACf67fd9B",
            "0x6ea9399aEea278901d7F4c980f7B4B9c5b69b8fC",
            "0xb142e0792272db22df0ee081dc80ac9899c6c3a5",
            "0x15c1021FC75619e629Fb8FE76Ea2C23d1dbEB130",
            "0xd2bf3070D320443750B03F64e68C4419D7C779AA",
            "0x28faf1599A9c3a9b8463DfeB23d06B6495aE91bC",
            "0xCBF99581846a6f1c23e95Cb8B0B353b339600C3C",
            "0x86d9189DAa8381e639456e074a523A1afa5DeBA5",
            "0xfF5200Ecf3276ba4eafD3683684231992C47aA5c",
            "0x5e5a937fea1078ebf6a1cd293714fa9ebc4a82ee",
            "0xCad8DAF1E928eF0867374e8Dd21B15df54F122AB",
            "0x5FFC32c736Ed221aDD02Af2af6AD6659a6DDBbB5",
            "0x47C932e74d1bCC4614707640D4ABdCf4aC88572B",
            "0x210154d33Ef8297428ad6fbf7e45846305789175",
            "0x72158d489043D7d8Fa2660F074E2Ef7827ba6D21",
            "0x1dE65DE28006016F018006D64fa7b9101226c686",
            "0x81941E3DeEeA41b6309045ECbAFd919Db5aF6147",
            "0xA03d5F2bf581FEC872593dea26E1c1843fB9C09a",
            "0xd13E9bbAd13457b8788E26DFf8765489e8f5a4ed",
            "0x6A5023C2caD80CCF5b42EC1D383049d78E4E94F1"
        ]
    },
    {
        "week": 1,
        "tokenID": 2,
        "members": 33,
        "memberArray": [
            "0x4DbB9427c55F9a1241b24847E67366046422Ee19",
            "0x69F329EE79C98A94765e4105aDFd5a87458d919C",
            "0x1E0b16d340eD938A71467998e997e995110eD596",
            "0x69996feBef47bEb378514BAc1A2Dacc88D947698",
            "0x393e0f1dABF3Bc25f7747068Ab9Afb9bbAf82970",
            "0xE77652a153b6Aa41b6D6ac2cDbd4d9DAcB72306E",
            "0x378bde8b897D64F4047189C3F8b689008A560bad",
            "0xb00E81207bcDA63c9E290E0b748252418818c869",
            "0x21748446955F1efC75bC9C843fBd3a8E6546d21f",
            "0xE77652a153b6Aa41b6D6ac2cDbd4d9DAcB72306E",
            "0x5bEED0516Cbf1857183c9Fe25179Eb3B3c2FdF43",
            "0x0B7dc67a6eCF6Bc0388409DDde919aaFcF0E0ff7",
            "0xDeDd3D2a2219458eaD3afF1C006a759489b94106",
            "0xA57c1Af56140A195F876310414C34fE9FE399D87",
            "0x2F6102a60813aF809C8dA5f46Ceb1D022dd718f2",
            "0x064523542F3114bcAE8b1eFc69D945788eFBe492",
            "0x3558f346fECf745365fc2944d8F9ae970aE21759",
            "0xF31171daC6C88C227feFAF0CE6C5003edA1A87E0",
            "0x0551b8c8b1C7Fa0B066fdBb854188702d01bC64F",
            "0x5c6d2ac4A20A1f5812Dc7229B9812d10d798F17a",
            "0x3A9eA3A8F7916F2637DbA398124019950fD294c6",
            "0x145309F6779bfD24533082Ab5ca1111A00016815",
            "0xCF96021f1ebEdc4b772347583323b194c7d55dA0",
            "0x1AC49508F7C1ce2A796517269deFEFC535050Fd8",
            "0x02CA4101eA84f400c62b3BeB87Fb5450a8702941",
            "0xF9F02eb35cc9F22A69DAA26bE2B1A57e3Ab4bD53",
            "0x0BaBd8774f4FB8904184b0965204e5A9Db43aCfe",
            "0x9FCAE73fbf4fC6283B636f707c17529c2ba7b684",
            "0xFCC8ed5bCDdc5002804b0a0f48ECDA71eD094aF6",
            "0x9008676d9EcC75c506aAd7C70eBD55523fcb725d",
            "0xeE82d15265C15a00197693B361b7735a93b82e55",
            "0xd470b1ac529a2bc704b6e7467485d52569daf2c1",
            "0x5fb4a0983daD1A0fae31ED67F1aaffeA3F3E8eC2"
        ]
    },
    {
        "week": 2,
        "tokenID": 3,
        "members": 33,
        "memberArray": [
            "0x4DbB9427c55F9a1241b24847E67366046422Ee19",
            "0xbd52889A4cB198a0E2cE36b52Cdf75c4e65875A8",
            "0xCF96021f1ebEdc4b772347583323b194c7d55dA0",
            "0xeE82d15265C15a00197693B361b7735a93b82e55",
            "0xfa6eE7Af7BaA1B174500d1A8275995EEA829453A",
            "0x90D6Cc871224965b6509F216b3A5119A37C4c5Dc",
            "0xac35452f3deB273d37bC1Ee84B60723CDbCCAeda",
            "0x5c6d2ac4A20A1f5812Dc7229B9812d10d798F17a",
            "0x0BaBd8774f4FB8904184b0965204e5A9Db43aCfe",
            "0x28faf1599A9c3a9b8463DfeB23d06B6495aE91bC",
            "0x455b1B4D7aA5599bE120aF210e11c7D7Ec8Aadd2",
            "0xB677F5e503cc02B7A0d358Cf6EaB2196b3932709",
            "0x8C55615279E0CFAb39944fb7Ad6626dA3b98fed3",
            "0x064523542F3114bcAE8b1eFc69D945788eFBe492",
            "0x98B15A3D3D14a575f001f576ea11Ca91341D41b8",
            "0x0551b8c8b1C7Fa0B066fdBb854188702d01bC64F",
            "0x76985F8bD32dE258dFc8ae497ED5F0112322D078",
            "0xC501A1F534b9c219BDB407bE12fCb01ddF9A3694",
            "0xcE5cDF7D5072673aF0062E5A7241E69B6618b649",
            "0x2bEC1Fb28A18c94B0361D2DF3d01d44fa4bDDA44",
            "0xd470b1ac529a2bc704b6e7467485d52569daf2c1",
            "0x45B115bf21872c798b8f131EEE9AFA30b96A249F",
            "0xFCC8ed5bCDdc5002804b0a0f48ECDA71eD094aF6",
            "0xB8c1f1ed17DA6FC4AC2ED6e8EdBb9b7724Ce44e4",
            "0x4A11a811e05FdDa19A17E34ce1C9C8efD2018cc4",
            "0xb00E81207bcDA63c9E290E0b748252418818c869",
            "0x5FFC32c736Ed221aDD02Af2af6AD6659a6DDBbB5",
            "0x69996feBef47bEb378514BAc1A2Dacc88D947698",
            "0xCF07D97889f1b2c2BdD8c2C91B0a639F867B00A2",
            "0x3A9eA3A8F7916F2637DbA398124019950fD294c6",
            "0x5fb4a0983daD1A0fae31ED67F1aaffeA3F3E8eC2",
            "0x4BeE0d0d6C437a9Ac4a24088824a8660bb18431C",
            "0x8953067a30d8a05e706fdd2000fa910a29be109f"
        ]
    },
    {
        "week": 3,
        "tokenID": 4,
        "members": 33,
        "memberArray": [
            "0x612112d107743FDb4c64F7990A76B01046bFB812",
            "0x818a86f6db284A7E45ed98Cc1Ba88D534d07C74D",
            "0xcE5cDF7D5072673aF0062E5A7241E69B6618b649",
            "0x76985F8bD32dE258dFc8ae497ED5F0112322D078",
            "0x5c6d2ac4A20A1f5812Dc7229B9812d10d798F17a",
            "0xbef32030aA223A3031e3b4C5b24fad66d992413C",
            "0x38586444200e0DC6938c8d258fb15FD14EB619b8",
            "0xeE82d15265C15a00197693B361b7735a93b82e55",
            "0x21748446955F1efC75bC9C843fBd3a8E6546d21f",
            "0x4A11a811e05FdDa19A17E34ce1C9C8efD2018cc4",
            "0xb00E81207bcDA63c9E290E0b748252418818c869",
            "0x28faf1599A9c3a9b8463DfeB23d06B6495aE91bC",
            "0xDeDd3D2a2219458eaD3afF1C006a759489b94106",
            "0xd470b1ac529a2bc704b6e7467485d52569daf2c1",
            "0x6253e5478d686E943c3751a392B523072DD97676",
            "0x90D6Cc871224965b6509F216b3A5119A37C4c5Dc",
            "0xCF07D97889f1b2c2BdD8c2C91B0a639F867B00A2",
            "0xC501A1F534b9c219BDB407bE12fCb01ddF9A3694",
            "0x4DbB9427c55F9a1241b24847E67366046422Ee19",
            "0x9FCAE73fbf4fC6283B636f707c17529c2ba7b684",
            "0x0551b8c8b1C7Fa0B066fdBb854188702d01bC64F",
            "0x4a5BB1c9347A0d4F7e06a29239162f03647d9232",
            "0x980C8D51202532d34647aAb766993a6ECC9d0a59",
            "0xE77652a153b6Aa41b6D6ac2cDbd4d9DAcB72306E",
            "0x6d6d75D544CB628ED5C4e4ebb619aec0274b8855",
            "0x0BaBd8774f4FB8904184b0965204e5A9Db43aCfe",
            "0xbB4Cc4392C6ca2c8D5EB8577Ce4fC77865b81E7F",
            "0x393e0f1dABF3Bc25f7747068Ab9Afb9bbAf82970",
            "0xF31171daC6C88C227feFAF0CE6C5003edA1A87E0",
            "0x2F1373cd12926996A0440D09AdF5453174bB4441",
            "0xFCC8ed5bCDdc5002804b0a0f48ECDA71eD094aF6",
            "0x0d6B5E7D99D7Ec1228883B304f319e6C76942AcE",
            "0x5fb4a0983daD1A0fae31ED67F1aaffeA3F3E8eC2"
        ]
    },
    {
        "week": 4,
        "tokenID": 5,
        "members": 33,
        "memberArray": [
            "0x378bde8b897D64F4047189C3F8b689008A560bad",
            "0xDeDd3D2a2219458eaD3afF1C006a759489b94106",
            "0x45ec7AaF83AB1B57556951E9840456111467F800",
            "0x393e0f1dABF3Bc25f7747068Ab9Afb9bbAf82970",
            "0xE77652a153b6Aa41b6D6ac2cDbd4d9DAcB72306E",
            "0x69996feBef47bEb378514BAc1A2Dacc88D947698",
            "0x980C8D51202532d34647aAb766993a6ECC9d0a59",
            "0x4a5BB1c9347A0d4F7e06a29239162f03647d9232",
            "0x3A9eA3A8F7916F2637DbA398124019950fD294c6",
            "0x612112d107743FDb4c64F7990A76B01046bFB812",
            "0x45B115bf21872c798b8f131EEE9AFA30b96A249F",
            "0x5c6d2ac4A20A1f5812Dc7229B9812d10d798F17a",
            "0x7fD46A537615852A32f01222f22AFbFA124e9223",
            "0x0B7dc67a6eCF6Bc0388409DDde919aaFcF0E0ff7",
            "0x818a86f6db284A7E45ed98Cc1Ba88D534d07C74D",
            "0xFCC8ed5bCDdc5002804b0a0f48ECDA71eD094aF6",
            "0xbef32030aA223A3031e3b4C5b24fad66d992413C",
            "0xF31171daC6C88C227feFAF0CE6C5003edA1A87E0",
            "0x21748446955F1efC75bC9C843fBd3a8E6546d21f",
            "0xC501A1F534b9c219BDB407bE12fCb01ddF9A3694",
            "0x11C8D4C8d0FF92bE67eFD2dBd860654BeB102687",
            "0x064523542F3114bcAE8b1eFc69D945788eFBe492",
            "0x28faf1599A9c3a9b8463DfeB23d06B6495aE91bC",
            "0x02CA4101eA84f400c62b3BeB87Fb5450a8702941",
            "0x1699c95e4300BB24C7159EBebE15230Ac096979C",
            "0x145309F6779bfD24533082Ab5ca1111A00016815",
            "0x6253e5478d686E943c3751a392B523072DD97676",
            "0x1dE46E70Ec82c237BC14f7e9058C6Cb09a9b34Ea",
            "0x6d6d75D544CB628ED5C4e4ebb619aec0274b8855",
            "0x8C55615279E0CFAb39944fb7Ad6626dA3b98fed3",
            "0xeE82d15265C15a00197693B361b7735a93b82e55",
            "0xCF96021f1ebEdc4b772347583323b194c7d55dA0",
            "0x5fb4a0983daD1A0fae31ED67F1aaffeA3F3E8eC2"
        ]
    },
    {
        "week": 5,
        "tokenID": 6,
        "members": 33,
        "memberArray": [
            "0x02CA4101eA84f400c62b3BeB87Fb5450a8702941",
            "0x8C55615279E0CFAb39944fb7Ad6626dA3b98fed3",
            "0x69F329EE79C98A94765e4105aDFd5a87458d919C",
            "0x38586444200e0DC6938c8d258fb15FD14EB619b8",
            "0xB48C08B5ccA1636b859B9a691Ec45C207Eb0708d",
            "0x3558f346fECf745365fc2944d8F9ae970aE21759",
            "0x5c6d2ac4A20A1f5812Dc7229B9812d10d798F17a",
            "0x9FCAE73fbf4fC6283B636f707c17529c2ba7b684",
            "0xac35452f3deB273d37bC1Ee84B60723CDbCCAeda",
            "0x393e0f1dABF3Bc25f7747068Ab9Afb9bbAf82970",
            "0x2F6102a60813aF809C8dA5f46Ceb1D022dd718f2",
            "0x4A11a811e05FdDa19A17E34ce1C9C8efD2018cc4",
            "0x064523542F3114bcAE8b1eFc69D945788eFBe492",
            "0xF31171daC6C88C227feFAF0CE6C5003edA1A87E0",
            "0xF9F02eb35cc9F22A69DAA26bE2B1A57e3Ab4bD53",
            "0x818a86f6db284A7E45ed98Cc1Ba88D534d07C74D",
            "0xBab49827EA9f5459B43FE239cEE9e2457351D2D7",
            "0xbd52889A4cB198a0E2cE36b52Cdf75c4e65875A8",
            "0xE77652a153b6Aa41b6D6ac2cDbd4d9DAcB72306E",
            "0x76a95d549Ca36d955Df2c72F693690d8e51a94d0",
            "0x45ec7AaF83AB1B57556951E9840456111467F800",
            "0x2F1373cd12926996A0440D09AdF5453174bB4441",
            "0x3A9eA3A8F7916F2637DbA398124019950fD294c6",
            "0xCF96021f1ebEdc4b772347583323b194c7d55dA0",
            "0x9008676d9EcC75c506aAd7C70eBD55523fcb725d",
            "0xbef32030aA223A3031e3b4C5b24fad66d992413C",
            "0x6d6d75D544CB628ED5C4e4ebb619aec0274b8855",
            "0x0BaBd8774f4FB8904184b0965204e5A9Db43aCfe",
            "0x980C8D51202532d34647aAb766993a6ECC9d0a59",
            "0xC501A1F534b9c219BDB407bE12fCb01ddF9A3694",
            "0x4DbB9427c55F9a1241b24847E67366046422Ee19",
            "0x612112d107743FDb4c64F7990A76B01046bFB812",
            "0x5fb4a0983daD1A0fae31ED67F1aaffeA3F3E8eC2"
        ]
    },
    {
        "week": 6,
        "tokenID": 10,
        "members": 63,
        "memberArray": [
            "0x145309F6779bfD24533082Ab5ca1111A00016815",
            "0x393e0f1dABF3Bc25f7747068Ab9Afb9bbAf82970",
            "0x1E9cb8699106dD3dB13f9307b898017EC79f0C3C",
            "0x0d6B5E7D99D7Ec1228883B304f319e6C76942AcE",
            "0xB677F5e503cc02B7A0d358Cf6EaB2196b3932709",
            "0x4A11a811e05FdDa19A17E34ce1C9C8efD2018cc4",
            "0x2051cF81501aFC3620834E8AcFfe9616334eFCF7",
            "0x6d6d75D544CB628ED5C4e4ebb619aec0274b8855",
            "0xB8c1f1ed17DA6FC4AC2ED6e8EdBb9b7724Ce44e4",
            "0xF31171daC6C88C227feFAF0CE6C5003edA1A87E0",
            "0xE77652a153b6Aa41b6D6ac2cDbd4d9DAcB72306E",
            "0xFCC8ed5bCDdc5002804b0a0f48ECDA71eD094aF6",
            "0xbB4Cc4392C6ca2c8D5EB8577Ce4fC77865b81E7F",
            "0xCF07D97889f1b2c2BdD8c2C91B0a639F867B00A2",
            "0x4A11a811e05FdDa19A17E34ce1C9C8efD2018cc4",
            "0x72540C9142cd326d2b60a464801D99c04D361dCF",
            "0x455b1B4D7aA5599bE120aF210e11c7D7Ec8Aadd2",
            "0xC501A1F534b9c219BDB407bE12fCb01ddF9A3694",
            "0xB48C08B5ccA1636b859B9a691Ec45C207Eb0708d",
            "0x63219DBA946d29DEC79Ff8ebdE58aAd5d9523245",
            "0xA57c1Af56140A195F876310414C34fE9FE399D87",
            "0x4DbB9427c55F9a1241b24847E67366046422Ee19",
            "0x0B7dc67a6eCF6Bc0388409DDde919aaFcF0E0ff7",
            "0xDeDd3D2a2219458eaD3afF1C006a759489b94106",
            "0xFCC8ed5bCDdc5002804b0a0f48ECDA71eD094aF6",
            "0xBab49827EA9f5459B43FE239cEE9e2457351D2D7",
            "0x2F1373cd12926996A0440D09AdF5453174bB4441",
            "0x98B15A3D3D14a575f001f576ea11Ca91341D41b8",
            "0x9008676d9EcC75c506aAd7C70eBD55523fcb725d",
            "0xA7092b4b09ADA332177A20f509089707910fC4b4",
            "0x5c6d2ac4A20A1f5812Dc7229B9812d10d798F17a",
            "0x45B115bf21872c798b8f131EEE9AFA30b96A249F",
            "0xb00E81207bcDA63c9E290E0b748252418818c869",
            "0x064523542F3114bcAE8b1eFc69D945788eFBe492",
            "0xac35452f3deB273d37bC1Ee84B60723CDbCCAeda",
            "0xb00E81207bcDA63c9E290E0b748252418818c869",
            "0xBd095eC1Ce4407de9dEbCf6Ebb90E8829A18F403",
            "0xF9F02eb35cc9F22A69DAA26bE2B1A57e3Ab4bD53",
            "0x0551b8c8b1C7Fa0B066fdBb854188702d01bC64F",
            "0x21748446955F1efC75bC9C843fBd3a8E6546d21f",
            "0x818a86f6db284A7E45ed98Cc1Ba88D534d07C74D",
            "0xbd52889A4cB198a0E2cE36b52Cdf75c4e65875A8",
            "0x0BaBd8774f4FB8904184b0965204e5A9Db43aCfe",
            "0x2bEC1Fb28A18c94B0361D2DF3d01d44fa4bDDA44",
            "0x980C8D51202532d34647aAb766993a6ECC9d0a59",
            "0xdDF6470B257C5CC8b2ED142EE88d331d8339D2b4",
            "0x69996feBef47bEb378514BAc1A2Dacc88D947698",
            "0x1699c95e4300BB24C7159EBebE15230Ac096979C",
            "0x818a86f6db284A7E45ed98Cc1Ba88D534d07C74D",
            "0x11C8D4C8d0FF92bE67eFD2dBd860654BeB102687",
            "0x6253e5478d686E943c3751a392B523072DD97676",
            "0x378bde8b897D64F4047189C3F8b689008A560bad",
            "0x3558f346fECf745365fc2944d8F9ae970aE21759",
            "0xBf2D4ABfdd66CFA279a527E6adf5C5D28aa308Cb",
            "0x3558f346fECf745365fc2944d8F9ae970aE21759",
            "0x1E0b16d340eD938A71467998e997e995110eD596",
            "0x4a5BB1c9347A0d4F7e06a29239162f03647d9232",
            "0x7fD46A537615852A32f01222f22AFbFA124e9223",
            "0x28faf1599A9c3a9b8463DfeB23d06B6495aE91bC",
            "0x45ec7AaF83AB1B57556951E9840456111467F800",
            "0x9FCAE73fbf4fC6283B636f707c17529c2ba7b684",
            "0x5FFC32c736Ed221aDD02Af2af6AD6659a6DDBbB5",
            "0x5fb4a0983daD1A0fae31ED67F1aaffeA3F3E8eC2"
        ]
    },
    {
        "week": 7,
        "tokenID": 13,
        "members": 30,
        "memberArray": [
            "0xC501A1F534b9c219BDB407bE12fCb01ddF9A3694",
            "0x28faf1599A9c3a9b8463DfeB23d06B6495aE91bC",
            "0x378bde8b897D64F4047189C3F8b689008A560bad",
            "0x27cAFf28136DCE030aa4811249297c0962219a33",
            "0x11C8D4C8d0FF92bE67eFD2dBd860654BeB102687",
            "0xA57c1Af56140A195F876310414C34fE9FE399D87",
            "0x2F1373cd12926996A0440D09AdF5453174bB4441",
            "0x90D6Cc871224965b6509F216b3A5119A37C4c5Dc",
            "0x3A9eA3A8F7916F2637DbA398124019950fD294c6",
            "0x9008676d9EcC75c506aAd7C70eBD55523fcb725d",
            "0xF9F02eb35cc9F22A69DAA26bE2B1A57e3Ab4bD53",
            "0x45ec7AaF83AB1B57556951E9840456111467F800",
            "0x9FCAE73fbf4fC6283B636f707c17529c2ba7b684",
            "0xBd095eC1Ce4407de9dEbCf6Ebb90E8829A18F403",
            "0x6d6d75D544CB628ED5C4e4ebb619aec0274b8855",
            "0xCE11942c34Bb02a889d8049D56a16E30313CbF6f",
            "0xE77652a153b6Aa41b6D6ac2cDbd4d9DAcB72306E",
            "0xDeDd3D2a2219458eaD3afF1C006a759489b94106",
            "0xE5484C082938603dFdEB2ECdc28158d7D99241cB",
            "0x5bEED0516Cbf1857183c9Fe25179Eb3B3c2FdF43",
            "0xFCC8ed5bCDdc5002804b0a0f48ECDA71eD094aF6",
            "0x4DbB9427c55F9a1241b24847E67366046422Ee19",
            "0x064523542F3114bcAE8b1eFc69D945788eFBe492",
            "0xFCC8ed5bCDdc5002804b0a0f48ECDA71eD094aF6",
            "0x63219DBA946d29DEC79Ff8ebdE58aAd5d9523245",
            "0x1dE46E70Ec82c237BC14f7e9058C6Cb09a9b34Ea",
            "0x818a86f6db284A7E45ed98Cc1Ba88D534d07C74D",
            "0x0BaBd8774f4FB8904184b0965204e5A9Db43aCfe",
            "0x8C55615279E0CFAb39944fb7Ad6626dA3b98fed3",
            "0x5fb4a0983daD1A0fae31ED67F1aaffeA3F3E8eC2"
        ]
    },
    {
        "week": 8,
        "tokenID": 14,
        "members": 30,
        "memberArray": [
            "0x4A11a811e05FdDa19A17E34ce1C9C8efD2018cc4",
            "0x2bEC1Fb28A18c94B0361D2DF3d01d44fa4bDDA44",
            "0x378bde8b897D64F4047189C3F8b689008A560bad",
            "0x7fD46A537615852A32f01222f22AFbFA124e9223",
            "0x89832F6Afe2B8D9cef6b8Cd8717c703D12fcd0A9",
            "0x064523542F3114bcAE8b1eFc69D945788eFBe492",
            "0x63219DBA946d29DEC79Ff8ebdE58aAd5d9523245",
            "0xA7092b4b09ADA332177A20f509089707910fC4b4",
            "0x27cAFf28136DCE030aa4811249297c0962219a33",
            "0x8C55615279E0CFAb39944fb7Ad6626dA3b98fed3",
            "0xE77652a153b6Aa41b6D6ac2cDbd4d9DAcB72306E",
            "0xDAe442e757374088bEBad7e24E5A541Dc6C94E54",
            "0xE77652a153b6Aa41b6D6ac2cDbd4d9DAcB72306E",
            "0x455b1B4D7aA5599bE120aF210e11c7D7Ec8Aadd2",
            "0xB677F5e503cc02B7A0d358Cf6EaB2196b3932709",
            "0x38586444200e0DC6938c8d258fb15FD14EB619b8",
            "0x1E0b16d340eD938A71467998e997e995110eD596",
            "0x11C8D4C8d0FF92bE67eFD2dBd860654BeB102687",
            "0xE5484C082938603dFdEB2ECdc28158d7D99241cB",
            "0x9FCAE73fbf4fC6283B636f707c17529c2ba7b684",
            "0x0BaBd8774f4FB8904184b0965204e5A9Db43aCfe",
            "0x9008676d9EcC75c506aAd7C70eBD55523fcb725d",
            "0xF31171daC6C88C227feFAF0CE6C5003edA1A87E0",
            "0x76a95d549Ca36d955Df2c72F693690d8e51a94d0",
            "0x69996feBef47bEb378514BAc1A2Dacc88D947698",
            "0x393e0f1dABF3Bc25f7747068Ab9Afb9bbAf82970",
            "0xFCC8ed5bCDdc5002804b0a0f48ECDA71eD094aF6",
            "0xF9F02eb35cc9F22A69DAA26bE2B1A57e3Ab4bD53",
            "0x5fb4a0983daD1A0fae31ED67F1aaffeA3F3E8eC2",
            "0x7a237A323cD979B57fFd26B0bEE913F8DBF9dC31"
        ]
    },
    {
        "week": 9,
        "tokenID": 15,
        "members": 30,
        "memberArray": [
            "0x6E332BF9dEeAbFCbdbeA05023b48DDB2590eCd4A",
            "0x818a86f6db284A7E45ed98Cc1Ba88D534d07C74D",
            "0xD6ac305F7EFe48B3211ad7632B9Cde1225F25ba3",
            "0xBab49827EA9f5459B43FE239cEE9e2457351D2D7",
            "0x0551b8c8b1C7Fa0B066fdBb854188702d01bC64F",
            "0x2F6102a60813aF809C8dA5f46Ceb1D022dd718f2",
            "0xC501A1F534b9c219BDB407bE12fCb01ddF9A3694",
            "0x5FFC32c736Ed221aDD02Af2af6AD6659a6DDBbB5",
            "0xA7092b4b09ADA332177A20f509089707910fC4b4",
            "0xac35452f3deB273d37bC1Ee84B60723CDbCCAeda",
            "0xfa6eE7Af7BaA1B174500d1A8275995EEA829453A",
            "0xCF07D97889f1b2c2BdD8c2C91B0a639F867B00A2",
            "0xCE11942c34Bb02a889d8049D56a16E30313CbF6f",
            "0xB677F5e503cc02B7A0d358Cf6EaB2196b3932709",
            "0x2bEC1Fb28A18c94B0361D2DF3d01d44fa4bDDA44",
            "0x89832F6Afe2B8D9cef6b8Cd8717c703D12fcd0A9",
            "0x3558f346fECf745365fc2944d8F9ae970aE21759",
            "0x72540C9142cd326d2b60a464801D99c04D361dCF",
            "0x4DbB9427c55F9a1241b24847E67366046422Ee19",
            "0xCF96021f1ebEdc4b772347583323b194c7d55dA0",
            "0x0BaBd8774f4FB8904184b0965204e5A9Db43aCfe",
            "0x02CA4101eA84f400c62b3BeB87Fb5450a8702941",
            "0x9FCAE73fbf4fC6283B636f707c17529c2ba7b684",
            "0xeBE6cC6820a76705B6654FdD1254256DcD54F1dF",
            "0x3A9eA3A8F7916F2637DbA398124019950fD294c6",
            "0xcE5cDF7D5072673aF0062E5A7241E69B6618b649",
            "0xEA29a51b283eA6C0d3872a5c3dF4ddE3cba94128",
            "0xE77652a153b6Aa41b6D6ac2cDbd4d9DAcB72306E",
            "0x76985F8bD32dE258dFc8ae497ED5F0112322D078",
            "0x5fb4a0983daD1A0fae31ED67F1aaffeA3F3E8eC2"
        ]
    },
    {
        "week": 10,
        "tokenID": 16,
        "members": 30,
        "memberArray": [
            "0x63219DBA946d29DEC79Ff8ebdE58aAd5d9523245",
            "0xB2B25Ac878cdF8d79b9D4679354a0c88c2da7357",
            "0x1E0b16d340eD938A71467998e997e995110eD596",
            "0x76985F8bD32dE258dFc8ae497ED5F0112322D078",
            "0xCE11942c34Bb02a889d8049D56a16E30313CbF6f",
            "0x612112d107743FDb4c64F7990A76B01046bFB812",
            "0x5bEED0516Cbf1857183c9Fe25179Eb3B3c2FdF43",
            "0x11C8D4C8d0FF92bE67eFD2dBd860654BeB102687",
            "0xC3130F83BdcF5E84f777d58580Ce99D811aea108",
            "0xBd095eC1Ce4407de9dEbCf6Ebb90E8829A18F403",
            "0xeE82d15265C15a00197693B361b7735a93b82e55",
            "0xb00E81207bcDA63c9E290E0b748252418818c869",
            "0xbef32030aA223A3031e3b4C5b24fad66d992413C",
            "0xF31171daC6C88C227feFAF0CE6C5003edA1A87E0",
            "0x980C8D51202532d34647aAb766993a6ECC9d0a59",
            "0x2051cF81501aFC3620834E8AcFfe9616334eFCF7",
            "0x76a95d549Ca36d955Df2c72F693690d8e51a94d0",
            "0x0B7dc67a6eCF6Bc0388409DDde919aaFcF0E0ff7",
            "0xd0f9899ec83BF1cf915bf101D6E7949361151523",
            "0xeBE6cC6820a76705B6654FdD1254256DcD54F1dF",
            "0x8C55615279E0CFAb39944fb7Ad6626dA3b98fed3",
            "0x818a86f6db284A7E45ed98Cc1Ba88D534d07C74D",
            "0x0BaBd8774f4FB8904184b0965204e5A9Db43aCfe",
            "0xBab49827EA9f5459B43FE239cEE9e2457351D2D7",
            "0xDAe442e757374088bEBad7e24E5A541Dc6C94E54",
            "0xbd52889A4cB198a0E2cE36b52Cdf75c4e65875A8",
            "0x27cAFf28136DCE030aa4811249297c0962219a33",
            "0x90D6Cc871224965b6509F216b3A5119A37C4c5Dc",
            "0xcE5cDF7D5072673aF0062E5A7241E69B6618b649",
            "0x5fb4a0983daD1A0fae31ED67F1aaffeA3F3E8eC2"
        ]
    },
    {
        "week": 11,
        "tokenID": 17,
        "members": 30,
        "memberArray": [
            "0x9FCAE73fbf4fC6283B636f707c17529c2ba7b684",
            "0xd12b2B215e2133e1028b24b1389912EfE06e4531",
            "0x455b1B4D7aA5599bE120aF210e11c7D7Ec8Aadd2",
            "0xA7092b4b09ADA332177A20f509089707910fC4b4",
            "0x38586444200e0DC6938c8d258fb15FD14EB619b8",
            "0xEA29a51b283eA6C0d3872a5c3dF4ddE3cba94128",
            "0xDAe442e757374088bEBad7e24E5A541Dc6C94E54",
            "0x612112d107743FDb4c64F7990A76B01046bFB812",
            "0x1dE46E70Ec82c237BC14f7e9058C6Cb09a9b34Ea",
            "0xFCC8ed5bCDdc5002804b0a0f48ECDA71eD094aF6",
            "0xCF07D97889f1b2c2BdD8c2C91B0a639F867B00A2",
            "0x5FFC32c736Ed221aDD02Af2af6AD6659a6DDBbB5",
            "0xF4F5C8A5F3C7dAEa939802380188e1ACEdFCFBf0",
            "0x0BDA046968c97347C6154f59013f059cA88Bb03A",
            "0x6d6d75D544CB628ED5C4e4ebb619aec0274b8855",
            "0x89832F6Afe2B8D9cef6b8Cd8717c703D12fcd0A9",
            "0x68c6a54596Dd8FE889054E99F3212045F4235680",
            "0x11C8D4C8d0FF92bE67eFD2dBd860654BeB102687",
            "0x69996feBef47bEb378514BAc1A2Dacc88D947698",
            "0x0d6B5E7D99D7Ec1228883B304f319e6C76942AcE",
            "0x980C8D51202532d34647aAb766993a6ECC9d0a59",
            "0xED376BE0003D1C6626DD8C353b84697e315a821C",
            "0x21748446955F1efC75bC9C843fBd3a8E6546d21f",
            "0x818a86f6db284A7E45ed98Cc1Ba88D534d07C74D",
            "0xBab49827EA9f5459B43FE239cEE9e2457351D2D7",
            "0xEA29a51b283eA6C0d3872a5c3dF4ddE3cba94128",
            "0x45B115bf21872c798b8f131EEE9AFA30b96A249F",
            "0x02CA4101eA84f400c62b3BeB87Fb5450a8702941",
            "0x5fb4a0983daD1A0fae31ED67F1aaffeA3F3E8eC2",
            "0x4BeE0d0d6C437a9Ac4a24088824a8660bb18431C"
        ]
    },
    {
        "week": 12,
        "tokenID": 20,
        "members": 54,
        "memberArray": [
            "0xe8Dc3cE0bf4a07C7854331E663ff86cFC7BB7839",
            "0xD581e286911Bb17f067A826E25305B798d65b1e2",
            "0xbef32030aA223A3031e3b4C5b24fad66d992413C",
            "0x76985F8bD32dE258dFc8ae497ED5F0112322D078",
            "0xDeDd3D2a2219458eaD3afF1C006a759489b94106",
            "0x507aB768AF4931C923790E219cB9d85781F23506",
            "0x393e0f1dABF3Bc25f7747068Ab9Afb9bbAf82970",
            "0x1E0b16d340eD938A71467998e997e995110eD596",
            "0xA7092b4b09ADA332177A20f509089707910fC4b4",
            "0xCF07D97889f1b2c2BdD8c2C91B0a639F867B00A2",
            "0xfa55508b1c998c5909ac8953a3f0f79a316987d6",
            "0x1dE46E70Ec82c237BC14f7e9058C6Cb09a9b34Ea",
            "0x69F329EE79C98A94765e4105aDFd5a87458d919C",
            "0xEA29a51b283eA6C0d3872a5c3dF4ddE3cba94128",
            "0x2A2c1102cC6F3eF7e3d469e47c70ad8181C1FaED",
            "0xB677F5e503cc02B7A0d358Cf6EaB2196b3932709",
            "0x3558f346fECf745365fc2944d8F9ae970aE21759",
            "0x45ec7AaF83AB1B57556951E9840456111467F800",
            "0x2bEC1Fb28A18c94B0361D2DF3d01d44fa4bDDA44",
            "0x98B15A3D3D14a575f001f576ea11Ca91341D41b8",
            "0xd0f9899ec83BF1cf915bf101D6E7949361151523",
            "0x21748446955F1efC75bC9C843fBd3a8E6546d21f",
            "0x72540C9142cd326d2b60a464801D99c04D361dCF",
            "0x4b3091e88eD72902E9703693C54d1315d852B3cE",
            "0xE77652a153b6Aa41b6D6ac2cDbd4d9DAcB72306E",
            "0x28faf1599A9c3a9b8463DfeB23d06B6495aE91bC",
            "0x4DbB9427c55F9a1241b24847E67366046422Ee19",
            "0xaa5ba45127268b7e4b59058a952ab1e926de2075",
            "0x72540C9142cd326d2b60a464801D99c04D361dCF",
            "0xD6ac305F7EFe48B3211ad7632B9Cde1225F25ba3",
            "0x7Adf5937A1a5c3670AC7C82Fa6A8EC4EA70D6250",
            "0x4A11a811e05FdDa19A17E34ce1C9C8efD2018cc4",
            "0xB2c4D35cB20b0D6A7538da5683D03037068B26dD",
            "0x0d6B5E7D99D7Ec1228883B304f319e6C76942AcE",
            "xardin.argent.xyz",
            "0xcB744534a44083acd8C3B0b0B2D6E06fAA50b9aA",
            "0xac35452f3deB273d37bC1Ee84B60723CDbCCAeda",
            "0x38586444200e0DC6938c8d258fb15FD14EB619b8",
            "0xeBE6cC6820a76705B6654FdD1254256DcD54F1dF",
            "0x8C55615279E0CFAb39944fb7Ad6626dA3b98fed3",
            "0x3A9eA3A8F7916F2637DbA398124019950fD294c6",
            "0xE5484C082938603dFdEB2ECdc28158d7D99241cB",
            "0xED376BE0003D1C6626DD8C353b84697e315a821C",
            "0xdDF6470B257C5CC8b2ED142EE88d331d8339D2b4",
            "0xeE82d15265C15a00197693B361b7735a93b82e55",
            "0xcc17e6ec4540cb49E871B00A00157DD20375C253",
            "0x0D3D920914A0fADFcf70E9d21913777472985526",
            "0xcE5cDF7D5072673aF0062E5A7241E69B6618b649",
            "0x0551b8c8b1C7Fa0B066fdBb854188702d01bC64F",
            "0xbB4Cc4392C6ca2c8D5EB8577Ce4fC77865b81E7F",
            "0xb00E81207bcDA63c9E290E0b748252418818c869",
            "0x552E9b92A0E1aE5039Fd6661DF6610759338c319",
            "0x5fb4a0983daD1A0fae31ED67F1aaffeA3F3E8eC2",
            "0x4BeE0d0d6C437a9Ac4a24088824a8660bb18431C"
        ]
    },
    {
        "week": 13,
        "tokenID": 22,
        "members": 27,
        "memberArray": [
            "0x1699c95e4300BB24C7159EBebE15230Ac096979C",
            "0xd0f9899ec83BF1cf915bf101D6E7949361151523",
            "0x59F026F6E98736252061c2b3CB8a9b30A779D233",
            "0xbae288e7f99216ed19e84632047be6818abda48c",
            "0xEA29a51b283eA6C0d3872a5c3dF4ddE3cba94128",
            "0x2F1373cd12926996A0440D09AdF5453174bB4441",
            "0x4DbB9427c55F9a1241b24847E67366046422Ee19",
            "0x145309F6779bfD24533082Ab5ca1111A00016815",
            "0xBd095eC1Ce4407de9dEbCf6Ebb90E8829A18F403",
            "0xED376BE0003D1C6626DD8C353b84697e315a821C",
            "0xeE82d15265C15a00197693B361b7735a93b82e55",
            "0x90D6Cc871224965b6509F216b3A5119A37C4c5Dc",
            "0x7Adf5937A1a5c3670AC7C82Fa6A8EC4EA70D6250",
            "0xFCC8ed5bCDdc5002804b0a0f48ECDA71eD094aF6",
            "0x63219DBA946d29DEC79Ff8ebdE58aAd5d9523245",
            "0x818a86f6db284A7E45ed98Cc1Ba88D534d07C74D",
            "0xEA29a51b283eA6C0d3872a5c3dF4ddE3cba94128",
            "0x68c6a54596Dd8FE889054E99F3212045F4235680",
            "0xCF07D97889f1b2c2BdD8c2C91B0a639F867B00A2",
            "0xbef32030aA223A3031e3b4C5b24fad66d992413C",
            "0x980C8D51202532d34647aAb766993a6ECC9d0a59",
            "0x202b21aC6C28ce40c9DEd882CAbB7428e4F2eE35",
            "0x38586444200e0DC6938c8d258fb15FD14EB619b8",
            "0x7eC4583A83686d6e4A4e76D0b04c5be765850d00",
            "0x1E0b16d340eD938A71467998e997e995110eD596",
            "0x2A2c1102cC6F3eF7e3d469e47c70ad8181C1FaED",
            "0x5fb4a0983daD1A0fae31ED67F1aaffeA3F3E8eC2"
        ]
    },
    {
        "week": 14,
        "tokenID": 23,
        "members": 27,
        "memberArray": [
            "0x38586444200e0DC6938c8d258fb15FD14EB619b8",
            "0xF4F5C8A5F3C7dAEa939802380188e1ACEdFCFBf0",
            "0x2A2c1102cC6F3eF7e3d469e47c70ad8181C1FaED",
            "0xeE82d15265C15a00197693B361b7735a93b82e55",
            "0xB2c4D35cB20b0D6A7538da5683D03037068B26dD",
            "0x9FCAE73fbf4fC6283B636f707c17529c2ba7b684",
            "0xCF07D97889f1b2c2BdD8c2C91B0a639F867B00A2",
            "0xE77652a153b6Aa41b6D6ac2cDbd4d9DAcB72306E",
            "0x21748446955F1efC75bC9C843fBd3a8E6546d21f",
            "0xC8938bf01EeE0e8c376e81214e1dF31593637d71",
            "0xA57c1Af56140A195F876310414C34fE9FE399D87",
            "0xdDF6470B257C5CC8b2ED142EE88d331d8339D2b4",
            "0x4b3091e88eD72902E9703693C54d1315d852B3cE",
            "0xDAe442e757374088bEBad7e24E5A541Dc6C94E54",
            "0xEA29a51b283eA6C0d3872a5c3dF4ddE3cba94128",
            "0x3558f346fECf745365fc2944d8F9ae970aE21759",
            "0x0BDA046968c97347C6154f59013f059cA88Bb03A",
            "0xBf2D4ABfdd66CFA279a527E6adf5C5D28aa308Cb",
            "0xB2c4D35cB20b0D6A7538da5683D03037068B26dD",
            "0x27cAFf28136DCE030aa4811249297c0962219a33",
            "0xD8aF41080acbC4B0b5C2Cc58A0D414442c8c6Fd9",
            "0xbae288e7f99216ed19e84632047be6818abda48c",
            "0xD581e286911Bb17f067A826E25305B798d65b1e2",
            "0x2F1373cd12926996A0440D09AdF5453174bB4441",
            "0x5fb4a0983daD1A0fae31ED67F1aaffeA3F3E8eC2",
            "0x4BeE0d0d6C437a9Ac4a24088824a8660bb18431C",
            "0x367Bc1a9d1EF225307666E330E127EAF19B2160a"
        ]
    },
    {
        "week": 15,
        "tokenID": 24,
        "members": 27,
        "memberArray": [
            "0x45ec7AaF83AB1B57556951E9840456111467F800",
            "0xdc211A0666bed568D5caFfbf538Ec221FCD1402f",
            "0x46f9697622228ea60E549620cC2DAa79312eDf75",
            "0xE77652a153b6Aa41b6D6ac2cDbd4d9DAcB72306E",
            "xardin.argent.xyz",
            "0x21748446955F1efC75bC9C843fBd3a8E6546d21f",
            "0x3558f346fECf745365fc2944d8F9ae970aE21759",
            "0xAc225A899578383bF26c7c5477Aa014C1f2Ba836",
            "0xfa55508b1c998c5909ac8953a3f0f79a316987d6",
            "0x0BaBd8774f4FB8904184b0965204e5A9Db43aCfe",
            "0x4b3091e88eD72902E9703693C54d1315d852B3cE",
            "0x2A2c1102cC6F3eF7e3d469e47c70ad8181C1FaED",
            "0x455b1B4D7aA5599bE120aF210e11c7D7Ec8Aadd2",
            "0x064523542F3114bcAE8b1eFc69D945788eFBe492",
            "0x6253e5478d686E943c3751a392B523072DD97676",
            "0x458bF1c9407E8816F290C8FBFE800240F46c6361",
            "0x3A9eA3A8F7916F2637DbA398124019950fD294c6",
            "0x8C55615279E0CFAb39944fb7Ad6626dA3b98fed3",
            "0xEe85Ae5daAb560731243403f56C51654dEF8bc6E",
            "0x818a86f6db284A7E45ed98Cc1Ba88D534d07C74D",
            "0x5c6d2ac4A20A1f5812Dc7229B9812d10d798F17a",
            "0x9676762325fc3C1e14D251C021185248E8204Fb7",
            "0xDeDd3D2a2219458eaD3afF1C006a759489b94106",
            "0x0BaBd8774f4FB8904184b0965204e5A9Db43aCfe",
            "0x0D3D920914A0fADFcf70E9d21913777472985526",
            "0x2F1373cd12926996A0440D09AdF5453174bB4441",
            "0x5fb4a0983daD1A0fae31ED67F1aaffeA3F3E8eC2"
        ]
    },
    {
        "week": 16,
        "tokenID": 25,
        "members": 27,
        "memberArray": [
            "0xf1C959d01DE46D08fe2a476c40a2e63A2De8d0D7",
            "0xdc744Aa4d1964E700E9f1A60e37eC18F70851029",
            "0x6e7B9FC055c9a895E3A247CC4816b7A695b7e6F2",
            "0x11C8D4C8d0FF92bE67eFD2dBd860654BeB102687",
            "0x367Bc1a9d1EF225307666E330E127EAF19B2160a",
            "0x76a95d549Ca36d955Df2c72F693690d8e51a94d0",
            "0xbef32030aA223A3031e3b4C5b24fad66d992413C",
            "0x5bEED0516Cbf1857183c9Fe25179Eb3B3c2FdF43",
            "0x1dE46E70Ec82c237BC14f7e9058C6Cb09a9b34Ea",
            "0xac35452f3deB273d37bC1Ee84B60723CDbCCAeda",
            "0x15c1021FC75619e629Fb8FE76Ea2C23d1dbEB130",
            "0x08B37C9aB0CE6b1D5Aa73A20Dfea634b78698065",
            "0xaa5ba45127268b7e4b59058a952ab1e926de2075",
            "0x22BE9582CDef4eF2e6d4b119547AecD7652D9e28",
            "0x56E773B0a620205E9f72265b6013b65B84c2c4aF",
            "0xBB20DD02e4b580A6977fDD161858714954b82244",
            "0x45ec7AaF83AB1B57556951E9840456111467F800",
            "0x0D08D3Fe6FCA58E82982Ac4D0eADa1F457F4e929",
            "0x27cAFf28136DCE030aa4811249297c0962219a33",
            "0x09035b6C00F0aB297778C71e81702DA85d77B6c2",
            "0xA57c1Af56140A195F876310414C34fE9FE399D87",
            "0xCE11942c34Bb02a889d8049D56a16E30313CbF6f",
            "0xDAe442e757374088bEBad7e24E5A541Dc6C94E54",
            "0xF9Ca61b2C3938D3C5Ec8Fa669622240A7a0cb316",
            "0xf5b9F3C09DCb5729fe0f2a2d404B73B6CEd6071E",
            "0x62a27B6DF055Fe39870A968291FE3bD82F7DCAF6",
            "0x5fb4a0983daD1A0fae31ED67F1aaffeA3F3E8eC2"
        ]
    },
    {
        "week": 17,
        "tokenID": 26,
        "members": 27,
        "memberArray": [
            "0xCDb3B3F161c6c683104ea4E1F8B48C08e266a613",
            "0x59F026F6E98736252061c2b3CB8a9b30A779D233",
            "0x0BDA046968c97347C6154f59013f059cA88Bb03A",
            "0x3D15Ad752798866025EEA52Dd60Cc687ee27fE4D",
            "0x466822e78F979f6285aa40F978cC55A499965dC0",
            "0x458bF1c9407E8816F290C8FBFE800240F46c6361",
            "0x1fD1006bD3e14330F023866B598D4166A8a5D13C",
            "0xe9084e17D6fE521E020777faD926bdacee68D74d",
            "0xa9dDc3383Ab709EA54aB5B4f9f89F57E60EB2F4f",
            "0x27cAFf28136DCE030aa4811249297c0962219a33",
            "0xBc481AbDB3F999a6670824B45bA97037F7623faB",
            "0xE77652a153b6Aa41b6D6ac2cDbd4d9DAcB72306E",
            "0x3558f346fECf745365fc2944d8F9ae970aE21759",
            "0x4DbB9427c55F9a1241b24847E67366046422Ee19",
            "0x145309F6779bfD24533082Ab5ca1111A00016815",
            "0xC370634a9f3e32b7275591F3e3F537645599f2bc",
            "0x69996feBef47bEb378514BAc1A2Dacc88D947698",
            "0x17Ba0C93587BE8dbbCe33EA408760B5Ead8FD059",
            "0x4a5BB1c9347A0d4F7e06a29239162f03647d9232",
            "0x80E659027343ba9634F96f8d99BCcEa3A08CE2EA",
            "0xBB5f3306e026950e798eB11260dc7d84fa0C7a9f",
            "0xFCC8ed5bCDdc5002804b0a0f48ECDA71eD094aF6",
            "0xe1690f5153aD0BBc683964aA81645C49b3cF6567",
            "0xcE5cDF7D5072673aF0062E5A7241E69B6618b649",
            "0x02CA4101eA84f400c62b3BeB87Fb5450a8702941",
            "0x9869bB9e74d8C243D4df886CfC3eDD184D59347B",
            "0x5fb4a0983daD1A0fae31ED67F1aaffeA3F3E8eC2"
        ]
    },
    {
        "week": 18,
        "tokenID": 30,
        "members": 45,
        "memberArray": [
            "0x7a237A323cD979B57fFd26B0bEE913F8DBF9dC31",
            "0xac35452f3deB273d37bC1Ee84B60723CDbCCAeda",
            "0xc5cee9416571752528ACbb4331761C5E2706748c",
            "0x8C55615279E0CFAb39944fb7Ad6626dA3b98fed3",
            "0x4a5BB1c9347A0d4F7e06a29239162f03647d9232",
            "0x27cAFf28136DCE030aa4811249297c0962219a33",
            "0x562d1588bA0A59f8A54CbD69728e7593333aC875",
            "0xBf2D4ABfdd66CFA279a527E6adf5C5D28aa308Cb",
            "0x3A9eA3A8F7916F2637DbA398124019950fD294c6",
            "0xB2B25Ac878cdF8d79b9D4679354a0c88c2da7357",
            "0x978B5720120E9C39a293293619874547614a7fBE",
            "0x95Dec167F71bd0842743eBe0962F0FcD219856cF",
            "0x8c2721600158b3bEB1bC6575EFf57F50dDDF00C6",
            "0xC3130F83BdcF5E84f777d58580Ce99D811aea108",
            "0xe1690f5153aD0BBc683964aA81645C49b3cF6567",
            "0xC501A1F534b9c219BDB407bE12fCb01ddF9A3694",
            "0xf1C959d01DE46D08fe2a476c40a2e63A2De8d0D7",
            "0xD9e536655C2eC225d5A143395814332A179B3f3A",
            "0x1E9cb8699106dD3dB13f9307b898017EC79f0C3C",
            "0x870CF1731034ACA407e6620307bb2DE1179A4Fe3",
            "0xFde166416b94C92A98966833c71c3AD3E209f8Bf",
            "0xBB20DD02e4b580A6977fDD161858714954b82244",
            "0x7601f38fbc12a94a5bb0726eca5e093bbd870d50",
            "0x7DA02E5a5dFb3312A2B8487a04Cb6B062923618a",
            "0xDAc43E419a6eAB0250D2800B9Ad531605d4254Fd",
            "0x202b21aC6C28ce40c9DEd882CAbB7428e4F2eE35",
            "0x35E96644E060d60a9DBF901EFae689D2D7B0f861",
            "0xeBE6cC6820a76705B6654FdD1254256DcD54F1dF",
            "0x9676762325fc3C1e14D251C021185248E8204Fb7",
            "0xB8c1f1ed17DA6FC4AC2ED6e8EdBb9b7724Ce44e4",
            "0x45b4E73554938220fa817F45E0E500d82A1bBA58",
            "0xF3e8a7AE6F60bE09Ee463B6278F293f4289e871F",
            "0xbef32030aA223A3031e3b4C5b24fad66d992413C",
            "0x5a62Bc0f7c2Ad6c56456dAabfdDD3c4Bb34df965",
            "0x1dE46E70Ec82c237BC14f7e9058C6Cb09a9b34Ea",
            "0x5c6d2ac4A20A1f5812Dc7229B9812d10d798F17a",
            "0x76985F8bD32dE258dFc8ae497ED5F0112322D078",
            "0x22BE9582CDef4eF2e6d4b119547AecD7652D9e28",
            "0xb00E81207bcDA63c9E290E0b748252418818c869",
            "0x46f9697622228ea60E549620cC2DAa79312eDf75",
            "0x6E332BF9dEeAbFCbdbeA05023b48DDB2590eCd4A",
            "0x75675550EE37B30bbcF84e04322C0974377eee8d",
            "0xD8aF41080acbC4B0b5C2Cc58A0D414442c8c6Fd9",
            "0x5FFC32c736Ed221aDD02Af2af6AD6659a6DDBbB5",
            "0x5fb4a0983daD1A0fae31ED67F1aaffeA3F3E8eC2"
        ]
    },
    {
        "week": 19,
        "tokenID": 32,
        "members": 24,
        "memberArray": [
            "0xFde166416b94C92A98966833c71c3AD3E209f8Bf",
            "0xD8aF41080acbC4B0b5C2Cc58A0D414442c8c6Fd9",
            "0x997fb1A5a5c9983A2ffEB9453E719975A2583Dc8",
            "0x1dE65DE28006016F018006D64fa7b9101226c686",
            "0x5a62Bc0f7c2Ad6c56456dAabfdDD3c4Bb34df965",
            "0x145309F6779bfD24533082Ab5ca1111A00016815",
            "0x75675550EE37B30bbcF84e04322C0974377eee8d",
            "0xB48C08B5ccA1636b859B9a691Ec45C207Eb0708d",
            "0xF670fD01a42a80C5098d4785638F7B0a8Ac69010",
            "0x931fB9C9bfB7B723Ccb54CeEeA5F1C670C899B63",
            "0xa362a9EFE31631f2252B85B99eaC0c2139A1A6BF",
            "0x45B115bf21872c798b8f131EEE9AFA30b96A249F",
            "0x6ea9399aEea278901d7F4c980f7B4B9c5b69b8fC",
            "0x502aAf1A596A0dF4b5C738b08980d8e07562044b",
            "0x01fFCc7285866E5cEE14c8E807cB2E8d5f61079f",
            "0x3e0cf03f718520F30300266dcF4DB50bA12d3331",
            "0x63219DBA946d29DEC79Ff8ebdE58aAd5d9523245",
            "0x905700624E1B7cAa33eEc851ea361b3b72783B71",
            "0x68c6a54596Dd8FE889054E99F3212045F4235680",
            "0x03Dc54Da70469dc3d53D4aF0AE43236B6ff4F2b7",
            "0x4ae901FBdB69eA08d63224964fC5E9696F0Fe6d0",
            "0xC3130F83BdcF5E84f777d58580Ce99D811aea108",
            "0x5fb4a0983daD1A0fae31ED67F1aaffeA3F3E8eC2",
            "0x4BeE0d0d6C437a9Ac4a24088824a8660bb18431C"
        ]
    },
    {
        "week": 20,
        "tokenID": 33,
        "members": 24,
        "memberArray": [
            "0x60C8EeD11cccAb1e6D75a825dd9f36d85d855c53",
            "0x458bF1c9407E8816F290C8FBFE800240F46c6361",
            "0x7fD46A537615852A32f01222f22AFbFA124e9223",
            "0xe7087F15a278EE1fE4B4AAefBCdB1D1FDE261d78",
            "0x35E96644E060d60a9DBF901EFae689D2D7B0f861",
            "0x7F3E7bfe49f81c23Ce102D78a7C01382ec3fCfbF",
            "0x38586444200e0DC6938c8d258fb15FD14EB619b8",
            "0xCF07D97889f1b2c2BdD8c2C91B0a639F867B00A2",
            "0xFDDeAf7829d20C6CFaDd20893493d9412B6F3f0D",
            "0x5E2D8f411d2DBbb537ecd4B72BE68bC5E98573a5",
            "0xaccD0314c88FA1cB91f0974Be020d057077D8835",
            "0x1FA5BA9cFa7861874Cd00da192B510841B6DD5e5",
            "0xFc830CD343857a3BefC4dc53828846cE97CA13A9",
            "0x75675550EE37B30bbcF84e04322C0974377eee8d",
            "0x562d1588bA0A59f8A54CbD69728e7593333aC875",
            "0x7a237A323cD979B57fFd26B0bEE913F8DBF9dC31",
            "0x6253e5478d686E943c3751a392B523072DD97676",
            "0x82A2f965D95F8476d3F833673b02E92436238d18",
            "0xCF96021f1ebEdc4b772347583323b194c7d55dA0",
            "0x2A2c1102cC6F3eF7e3d469e47c70ad8181C1FaED",
            "0xdE708DEcb61D06eE30a95051DD203f43e0D44c70",
            "0x414BcB4dC136F64904f1cF38E7dF088966CA86Dd",
            "0x3558f346fECf745365fc2944d8F9ae970aE21759",
            "0x5fb4a0983daD1A0fae31ED67F1aaffeA3F3E8eC2"
        ]
    },
    {
        "week": 21,
        "tokenID": 34,
        "members": 24,
        "memberArray": [
            "0xBB5f3306e026950e798eB11260dc7d84fa0C7a9f",
            "0x9bfA30d420C340e810BA8438a93969d421bdFf56",
            "0x075AcD1B0E6C91e4b7689d098aad19258C351C79",
            "0x9Ae061A3E78f3EA59130cE0cfA9cA6C7483D07ef",
            "0xEA29a51b283eA6C0d3872a5c3dF4ddE3cba94128",
            "0x33746372bE88f16974b9Ca8Af4bB0e54C369eE3C",
            "0xF3e8a7AE6F60bE09Ee463B6278F293f4289e871F",
            "0xBB20DD02e4b580A6977fDD161858714954b82244",
            "0x7DA02E5a5dFb3312A2B8487a04Cb6B062923618a",
            "0x8b68E6B6fa57F80b960e8a434DCcf8eb1b2739CA",
            "0xcdA16A18d3F942571E7ba81B7D2219A6802C45A1",
            "0x95Dec167F71bd0842743eBe0962F0FcD219856cF",
            "0x4DbB9427c55F9a1241b24847E67366046422Ee19",
            "0x4F1B4a2D5cF60240dF3035688db8CCeB97170301",
            "0x7a237A323cD979B57fFd26B0bEE913F8DBF9dC31",
            "0x3e0cf03f718520F30300266dcF4DB50bA12d3331",
            "0x7Adf5937A1a5c3670AC7C82Fa6A8EC4EA70D6250",
            "0xbd52889A4cB198a0E2cE36b52Cdf75c4e65875A8",
            "0x1B5619ea5C5F0998006Af5592f2D9506F044d107",
            "0x52B9937B339c8E253e4f6ead28cE4d8BF3b52E36",
            "0x42d4c197036bd9984ca652303e07dd29fa6bdb37",
            "0x60C8EeD11cccAb1e6D75a825dd9f36d85d855c53",
            "0x818a86f6db284A7E45ed98Cc1Ba88D534d07C74D",
            "0x5fb4a0983daD1A0fae31ED67F1aaffeA3F3E8eC2"
        ]
    },
    {
        "week": 22,
        "tokenID": 35,
        "members": 24,
        "memberArray": [
            "0x5c6d2ac4A20A1f5812Dc7229B9812d10d798F17a",
            "0xFCC8ed5bCDdc5002804b0a0f48ECDA71eD094aF6",
            "0x46f9697622228ea60E549620cC2DAa79312eDf75",
            "0x63219DBA946d29DEC79Ff8ebdE58aAd5d9523245",
            "0xBc481AbDB3F999a6670824B45bA97037F7623faB",
            "0x75d7d7972a62b00ff7ef071741c929f59d185ee6",
            "0x8C55615279E0CFAb39944fb7Ad6626dA3b98fed3",
            "0x4Db32a12F1552b0079025D4b800E03111211Ee16",
            "0x905700624E1B7cAa33eEc851ea361b3b72783B71",
            "0xA7092b4b09ADA332177A20f509089707910fC4b4",
            "0xaa5ba45127268b7e4b59058a952ab1e926de2075",
            "0xF31171daC6C88C227feFAF0CE6C5003edA1A87E0",
            "0xBB20DD02e4b580A6977fDD161858714954b82244",
            "0x03Dc54Da70469dc3d53D4aF0AE43236B6ff4F2b7",
            "0x7eC4583A83686d6e4A4e76D0b04c5be765850d00",
            "0x6253e5478d686E943c3751a392B523072DD97676",
            "0x7f9C8843926De4b2eA6cBf9381F9f2FA81C58ed6",
            "0xa0936063ef229f5f27C9f2383d98D5483F36524F",
            "0xBcCAf388cfB9eFA233a8C45c7757E02849926916",
            "0x1fD1006bD3e14330F023866B598D4166A8a5D13C",
            "0x59F026F6E98736252061c2b3CB8a9b30A779D233",
            "0x58a133632547b6eadf2998ba2da5796a49657aee",
            "0x9869bB9e74d8C243D4df886CfC3eDD184D59347B",
            "0x5fb4a0983daD1A0fae31ED67F1aaffeA3F3E8eC2"
        ]
    },
    {
        "week": 23,
        "tokenID": 36,
        "members": 24,
        "memberArray": [
            "0x818a86f6db284A7E45ed98Cc1Ba88D534d07C74D",
            "0x21748446955F1efC75bC9C843fBd3a8E6546d21f",
            "0x145309F6779bfD24533082Ab5ca1111A00016815",
            "0x1fD1006bD3e14330F023866B598D4166A8a5D13C",
            "0xEe85Ae5daAb560731243403f56C51654dEF8bc6E",
            "0x03Dc54Da70469dc3d53D4aF0AE43236B6ff4F2b7",
            "0x414BcB4dC136F64904f1cF38E7dF088966CA86Dd",
            "0xEA29a51b283eA6C0d3872a5c3dF4ddE3cba94128",
            "0x978B5720120E9C39a293293619874547614a7fBE",
            "0x4b3091e88eD72902E9703693C54d1315d852B3cE",
            "0xE77652a153b6Aa41b6D6ac2cDbd4d9DAcB72306E",
            "0xA7092b4b09ADA332177A20f509089707910fC4b4",
            "0xDdc94bC4F885D9565A0BA6d3e0eB197049e116c5",
            "0x45ec7AaF83AB1B57556951E9840456111467F800",
            "0xdE708DEcb61D06eE30a95051DD203f43e0D44c70",
            "0x317887f0B88b33aD43fc0edCF587EE78fd88Afb8",
            "0xaccD0314c88FA1cB91f0974Be020d057077D8835",
            "0xa362a9EFE31631f2252B85B99eaC0c2139A1A6BF",
            "0xA12D3c264D56CE0e31a8c1389934F9fb4f99544e",
            "0x321d5a4c9f9f0c9607df5464d993bebb0ad25fb1",
            "0xfa6eE7Af7BaA1B174500d1A8275995EEA829453A",
            "0xc780cA472Cd312DE98B4730520C9A60bC0886Fb5",
            "0x1E237976F0D579AD4b3bDC4557be3491EB925d39",
            "0x5fb4a0983daD1A0fae31ED67F1aaffeA3F3E8eC2"
        ]
    },
    {
        "week": 24,
        "tokenID": 40,
        "members": 36,
        "memberArray": [
            "0x9869bB9e74d8C243D4df886CfC3eDD184D59347B",
            "0xCfa69328A74C0eAc388B889c21eB3ddd9d41a025",
            "0xb00E81207bcDA63c9E290E0b748252418818c869",
            "0x03Dc54Da70469dc3d53D4aF0AE43236B6ff4F2b7",
            "0x8E41AfAf0182375191bFD437501e4514366ecbb5",
            "0x7c95D0cD038e06C4152a37325d48aED406006fE3",
            "0x63fc54477C1a9F61E5cA57d5E1c6116cf14d11D7",
            "0x575757e0a0b19bEe7e07887FbBD616b395E32D4b",
            "0x8b68E6B6fa57F80b960e8a434DCcf8eb1b2739CA",
            "0xF31171daC6C88C227feFAF0CE6C5003edA1A87E0",
            "0x4eCF7071E4631A194f33B95ca50548808A17e986",
            "0x90D6Cc871224965b6509F216b3A5119A37C4c5Dc",
            "0x4A11a811e05FdDa19A17E34ce1C9C8efD2018cc4",
            "0xC8938bf01EeE0e8c376e81214e1dF31593637d71",
            "0xbef32030aA223A3031e3b4C5b24fad66d992413C",
            "0x543cB9C792143b0A389128467f123d704b0e7B30",
            "0x45B115bf21872c798b8f131EEE9AFA30b96A249F",
            "0x60299070384645339181578946cF1aFaf74179dc",
            "0x502aAf1A596A0dF4b5C738b08980d8e07562044b",
            "0xb1ead214506d0cd73785dd09b3efc2307133bf69",
            "0x862059F71CB59869fEeA3713E412C0761095b065",
            "0xc5cee9416571752528ACbb4331761C5E2706748c",
            "0xac35452f3deB273d37bC1Ee84B60723CDbCCAeda",
            "xardin.argent.xyz",
            "0xb215cFebB90D91b1D2F499843800d3105b1366Fc",
            "0x58a133632547b6eaDF2998ba2dA5796A49657aEe",
            "0x455b1B4D7aA5599bE120aF210e11c7D7Ec8Aadd2",
            "0x5637e768e946C2Bbd02Ea6b99FC2120f5A908062",
            "0xC26dCb3301cdB8385aa5b1C0B42496c50fb608f8",
            "0xCB126975031e92B49Cb3FD8A7209519e47FB8929",
            "0x6893593C695d23f002F9278FA75aE1367Ce78d96",
            "0xb7626141EF37F183A7A61Dce76304c8b074c0988",
            "0x46f9697622228ea60E549620cC2DAa79312eDf75",
            "0x9372fE6d14d57988B7EC923815Cc9243B313D532",
            "0x0BEcC5309a325A7089fBAbE0cc0E9743C583F8Fa",
            "0x5fb4a0983daD1A0fae31ED67F1aaffeA3F3E8eC2"
        ]
    },
    {
        "week": 25,
        "tokenID": 42,
        "members": 21,
        "memberArray": [
            "0x82A2f965D95F8476d3F833673b02E92436238d18",
            "0xCE11942c34Bb02a889d8049D56a16E30313CbF6f",
            "0xAA1C73B88867DD5Ae89813f2d1b4F715D7D9A134",
            "0x202b21aC6C28ce40c9DEd882CAbB7428e4F2eE35",
            "0xA4b7be6F43c325B76CBB95ac1D2110e45D1e9f6d",
            "0x01fFCc7285866E5cEE14c8E807cB2E8d5f61079f",
            "0xdc744Aa4d1964E700E9f1A60e37eC18F70851029",
            "0xEA29a51b283eA6C0d3872a5c3dF4ddE3cba94128",
            "0x46f9697622228ea60E549620cC2DAa79312eDf75",
            "0xac35452f3deB273d37bC1Ee84B60723CDbCCAeda",
            "0xE5D12B67755d2d68Dd69821fed9d7cC9c92fEf33",
            "0x378bde8b897D64F4047189C3F8b689008A560bad",
            "0x317887f0B88b33aD43fc0edCF587EE78fd88Afb8",
            "0x64FA0191Ee9C145B38c43BeBf87A717533caB9b5",
            "0x5bEED0516Cbf1857183c9Fe25179Eb3B3c2FdF43",
            "0xbd3E3D4d28E648068316a89D19c1d08C9db78B33",
            "0x12589b475016f2e6f9e9a3c8097c435Fb990d5D8",
            "0x19dCb66ef4c2ED92BeA3b540a9703c6233279aB2",
            "0xB2c4D35cB20b0D6A7538da5683D03037068B26dD",
            "0xFB99f02A99bc250F691e68D05260be56E2727c99",
            "0x5fb4a0983daD1A0fae31ED67F1aaffeA3F3E8eC2"
        ]
    },
    {
        "week": 26,
        "tokenID": 43,
        "members": 21,
        "memberArray": [
            "0xE5484C082938603dFdEB2ECdc28158d7D99241cB",
            "0x45ec7AaF83AB1B57556951E9840456111467F800",
            "0xa1891d7107D7e1F1DfDD0AABfeA9abBFB504041B",
            "0x3746668eee844561985e888f604361294a56209c",
            "0x7D7b53A5F64eA47047A94D0F3Bb87B2F2C43e547",
            "0x0fD84d7cb911728737556684050782B298F70f0f",
            "0xCfa69328A74C0eAc388B889c21eB3ddd9d41a025",
            "0x732Bb47210fDB676Ee1596d18FEE6F48DE2d37cb",
            "0xFCC8ed5bCDdc5002804b0a0f48ECDA71eD094aF6",
            "0x033846926c74dEB8315D11f1303A049Da92488B4",
            "0x4c910b727cbC44799aAa5c8C20Ef049B54CF275F",
            "0x72540C9142cd326d2b60a464801D99c04D361dCF",
            "0xFc830CD343857a3BefC4dc53828846cE97CA13A9",
            "0x064aadecf5dc360266c4cdd09d984810debcc86a",
            "0xb00E81207bcDA63c9E290E0b748252418818c869",
            "0x5637e768e946C2Bbd02Ea6b99FC2120f5A908062",
            "0x12589b475016f2e6f9e9a3c8097c435Fb990d5D8",
            "0xED376BE0003D1C6626DD8C353b84697e315a821C",
            "0x530922B450B77e365C4249A65C784CcFE770dd6A",
            "0x5c6d2ac4A20A1f5812Dc7229B9812d10d798F17a",
            "0x5fb4a0983daD1A0fae31ED67F1aaffeA3F3E8eC2"
        ]
    },
    {
        "week": 27,
        "tokenID": 44,
        "members": 21,
        "memberArray": [
            "0x64FA0191Ee9C145B38c43BeBf87A717533caB9b5",
            "0xce8c42230891064f0dfeef720fe2e60e6bc37a1a",
            "0x60C8EeD11cccAb1e6D75a825dd9f36d85d855c53",
            "0x648c9ef315efffdd89b057f963547ddbcd499166",
            "0x1E0b16d340eD938A71467998e997e995110eD596",
            "0xa7d7ac8fe7e8693b5599c69cc7d4f6226677845b",
            "0x31e0E2f2a3C6E8203B4F61C2CF59d3723dDE9557",
            "0x58a133632547b6eaDF2998ba2dA5796A49657aEe",
            "0xbefa1156Fb87B82c5A1231cB005097CE680cc74D",
            "0x1699c95e4300BB24C7159EBebE15230Ac096979C",
            "0x21748446955F1efC75bC9C843fBd3a8E6546d21f",
            "0x7c1DE0FeD5a0EeEABF3d59C61aB868626A56dF67",
            "0x08B37C9aB0CE6b1D5Aa73A20Dfea634b78698065",
            "0xa0936063ef229f5f27C9f2383d98D5483F36524F",
            "0x45b4E73554938220fa817F45E0E500d82A1bBA58",
            "0xCB04F9F5E1Ac544dfFb0d479b696e7AAdb76dBFB",
            "0x6d6d75D544CB628ED5C4e4ebb619aec0274b8855",
            "0xFA27C9b69dD0B2E0f96118D564ce3b8A275905BD",
            "0x35E96644E060d60a9DBF901EFae689D2D7B0f861",
            "0xfa55508b1c998c5909ac8953a3f0f79a316987d6",
            "0x5fb4a0983daD1A0fae31ED67F1aaffeA3F3E8eC2"
        ]
    },
    {
        "week": 28,
        "tokenID": 45,
        "members": 21,
        "memberArray": [
            "0x3558f346fECf745365fc2944d8F9ae970aE21759",
            "0x8b68E6B6fa57F80b960e8a434DCcf8eb1b2739CA",
            "0x0fD84d7cb911728737556684050782B298F70f0f",
            "0xDAc43E419a6eAB0250D2800B9Ad531605d4254Fd",
            "0x8A6A6Dbb42Af38506996A35D8d49c61f8F528cCa",
            "0x6a5D4157C186F87aa053b65cDbdd6a6BA372f64E",
            "0x8C55615279E0CFAb39944fb7Ad6626dA3b98fed3",
            "0x0BaBd8774f4FB8904184b0965204e5A9Db43aCfe",
            "0x466822e78F979f6285aa40F978cC55A499965dC0",
            "0x11C8D4C8d0FF92bE67eFD2dBd860654BeB102687",
            "0x6ea9399aEea278901d7F4c980f7B4B9c5b69b8fC",
            "0x1AC49508F7C1ce2A796517269deFEFC535050Fd8",
            "0x7675470354a1e34106F4d8c0FBC02E73410e0c32",
            "0x978B5720120E9C39a293293619874547614a7fBE",
            "0xcB744534a44083acd8C3B0b0B2D6E06fAA50b9aA",
            "0x60299070384645339181578946cF1aFaf74179dc",
            "0xbefa1156Fb87B82c5A1231cB005097CE680cc74D",
            "0x27cAFf28136DCE030aa4811249297c0962219a33",
            "0x6accD26626c150a4b485E6c9c541b38FE0AB5915",
            "0xb30217Cb6EAcfd76B302b91d0E5450AA06EC201E",
            "0x5fb4a0983daD1A0fae31ED67F1aaffeA3F3E8eC2"
        ]
    },
    {
        "week": 29,
        "tokenID": 46,
        "members": 21,
        "memberArray": [
            "0x5637e768e946C2Bbd02Ea6b99FC2120f5A908062",
            "0x0D6E22D88c703FAf1EbF6a00CE31268fA6BBd069",
            "0x978B5720120E9C39a293293619874547614a7fBE",
            "0xD8aF41080acbC4B0b5C2Cc58A0D414442c8c6Fd9",
            "0x5Db16FefCE9e8bA024d064268b041C68ED7F9fbC",
            "0x08724E55d71B19DF96f56B656aD466c5bCf6c395",
            "0x0d6B5E7D99D7Ec1228883B304f319e6C76942AcE",
            "0x68c6a54596Dd8FE889054E99F3212045F4235680",
            "0xb58B3e8b334EBFdA6EB27f0c13974E058085F422",
            "0x980C8D51202532d34647aAb766993a6ECC9d0a59",
            "0x38Dddf6Fa949eECADa0FD7fA1d7a7b763799825C",
            "0x07206D87ADFB4588ebE0f5a2f30C17edbde7EdC8",
            "0xCB04F9F5E1Ac544dfFb0d479b696e7AAdb76dBFB",
            "0xc0bbdc46b5661Bad3af778723723dEC410029793",
            "0x7eC4583A83686d6e4A4e76D0b04c5be765850d00",
            "0xd12b2B215e2133e1028b24b1389912EfE06e4531",
            "0xCDb3B3F161c6c683104ea4E1F8B48C08e266a613",
            "0x455b1B4D7aA5599bE120aF210e11c7D7Ec8Aadd2",
            "0x507aB768AF4931C923790E219cB9d85781F23506",
            "0x4A11a811e05FdDa19A17E34ce1C9C8efD2018cc4",
            "0x5fb4a0983daD1A0fae31ED67F1aaffeA3F3E8eC2"
        ]
    },
    {
        "week": 30,
        "tokenID": 47,
        "members": 21,
        "memberArray": [
            "0x7D7b53A5F64eA47047A94D0F3Bb87B2F2C43e547",
            "0x9B2E8F4aB3838E83c9c04cdf45c8B9f5E943Ab9b",
            "0xa0936063ef229f5f27C9f2383d98D5483F36524F",
            "0x9bfA30d420C340e810BA8438a93969d421bdFf56",
            "0x4a5BB1c9347A0d4F7e06a29239162f03647d9232",
            "0x01303CE328eE52Eb6f76708b75f55ad19467D450",
            "0xa7d7ac8fe7e8693b5599c69cc7d4f6226677845b",
            "0xFCC8ed5bCDdc5002804b0a0f48ECDA71eD094aF6",
            "0xF3e8a7AE6F60bE09Ee463B6278F293f4289e871F",
            "0x6D3E5BF37Be394A385bcB589fe3Dd2983c2ff0a6",
            "0xFCf4A697EC4BfCB05f8C989239B95B6CE363881F",
            "0xba944AbD6Ad261B220dcc8ba6b53410Cb024FCB1",
            "0x27cAFf28136DCE030aa4811249297c0962219a33",
            "0x0D6E22D88c703FAf1EbF6a00CE31268fA6BBd069",
            "0xCB04F9F5E1Ac544dfFb0d479b696e7AAdb76dBFB",
            "0xc780cA472Cd312DE98B4730520C9A60bC0886Fb5",
            "0xCfa69328A74C0eAc388B889c21eB3ddd9d41a025",
            "0x411742Cd88b52Ae86Cb65d330f07B480a40BdB99",
            "0x2bEC1Fb28A18c94B0361D2DF3d01d44fa4bDDA44",
            "0xa7d7ac8fe7e8693b5599c69cc7d4f6226677845b",
            "0x5fb4a0983daD1A0fae31ED67F1aaffeA3F3E8eC2"
        ]
    },
    {
        "week": 31,
        "tokenID": 50,
        "members": 27,
        "memberArray": [
            "0xe9084e17D6fE521E020777faD926bdacee68D74d",
            "0x28faf1599A9c3a9b8463DfeB23d06B6495aE91bC",
            "0x32349c94082a8cFd9CaC7031f4ec980f8d94cbFD",
            "0x562d1588bA0A59f8A54CbD69728e7593333aC875",
            "0x0AF7F73579327Eb0A04abe4364143965CF7FC356",
            "0x42FAD4d519223C22C40aCE6DeDE72E56B4d15439",
            "0x35E96644E060d60a9DBF901EFae689D2D7B0f861",
            "0xCF07D97889f1b2c2BdD8c2C91B0a639F867B00A2",
            "0xbef32030aA223A3031e3b4C5b24fad66d992413C",
            "0xAc5CB8EFEbbb8f0B59e336aaB27b008b96017DE8",
            "0x31e0E2f2a3C6E8203B4F61C2CF59d3723dDE9557",
            "0x04aEE20BE071c84050649cfe0b1A754Cc4555D92",
            "0x4A11a811e05FdDa19A17E34ce1C9C8efD2018cc4",
            "0x145309F6779bfD24533082Ab5ca1111A00016815",
            "0x33Da1A806A6fe7D588964f122b2687f53F0FE769",
            "0x58a133632547b6eaDF2998ba2dA5796A49657aEe",
            "0x59F026F6E98736252061c2b3CB8a9b30A779D233",
            "0xD9e536655C2eC225d5A143395814332A179B3f3A",
            "0x818a86f6db284A7E45ed98Cc1Ba88D534d07C74D",
            "0x3A9eA3A8F7916F2637DbA398124019950fD294c6",
            "0x612112d107743FDb4c64F7990A76B01046bFB812",
            "0xd0c0f5A2284cc70b8442108FE8ADD8E8499b4828",
            "0xFB99f02A99bc250F691e68D05260be56E2727c99",
            "0xcC0Af74c6a2a14734DadEe5FeaD9741Bb5A1b1Fe",
            "0x09035b6C00F0aB297778C71e81702DA85d77B6c2",
            "0xce2ee46d71Be0e97E0557EF428a7071FBD117C9C",
            "0x5fb4a0983daD1A0fae31ED67F1aaffeA3F3E8eC2"
        ]
    },
    {
        "week": 32,
        "tokenID": 52,
        "members": 18,
        "memberArray": [
            "0x8A6A6Dbb42Af38506996A35D8d49c61f8F528cCa",
            "0x1fD1006bD3e14330F023866B598D4166A8a5D13C",
            "0x38586444200e0DC6938c8d258fb15FD14EB619b8",
            "0x62a27B6DF055Fe39870A968291FE3bD82F7DCAF6",
            "0x9780bEdcC437782846d60D6C074D18Ed24765bBf",
            "0x90D6Cc871224965b6509F216b3A5119A37C4c5Dc",
            "0x62a27B6DF055Fe39870A968291FE3bD82F7DCAF6",
            "0x0BaBd8774f4FB8904184b0965204e5A9Db43aCfe",
            "0xfA5970ef27B1329Aa11617EeE8446c2cea3315b1",
            "0xbdfA4789f3606A95dF9Cb63167dA4592a63007ef",
            "0x210154d33Ef8297428ad6fbf7e45846305789175",
            "0x9008676d9EcC75c506aAd7C70eBD55523fcb725d",
            "0x3558f346fECf745365fc2944d8F9ae970aE21759",
            "0x1a4021B237f9afE8d402104340Ebdc0accbC4A06",
            "0x6968D0E283225eB6AF7C85c8ea2DBCdDB4B6a246",
            "0xdd84306537D24D4F1Fc7bB149CdC619Ebea8c344",
            "0x7Adf5937A1a5c3670AC7C82Fa6A8EC4EA70D6250",
            "0x5fb4a0983daD1A0fae31ED67F1aaffeA3F3E8eC2"
        ]
    },
    {
        "week": 33,
        "tokenID": 53,
        "members": 18,
        "memberArray": [
            "0xBab49827EA9f5459B43FE239cEE9e2457351D2D7",
            "0x870CF1731034ACA407e6620307bb2DE1179A4Fe3",
            "0xe8Dc3cE0bf4a07C7854331E663ff86cFC7BB7839",
            "0x5dF88ffd3AC292a91C5E2D24abE322B1c7Dbc4D3",
            "0xffAb2Ab5C1065ECD2a9Df176C27a5095E78D0740",
            "0xFDDeAf7829d20C6CFaDd20893493d9412B6F3f0D",
            "0x9bfA30d420C340e810BA8438a93969d421bdFf56",
            "0x92cB619343bb64033445eD073adECeC0d4A4fC47",
            "0xBc481AbDB3F999a6670824B45bA97037F7623faB",
            "0xbefa1156Fb87B82c5A1231cB005097CE680cc74D",
            "0x317887f0B88b33aD43fc0edCF587EE78fd88Afb8",
            "0x90D6Cc871224965b6509F216b3A5119A37C4c5Dc",
            "0xbae288e7f99216ed19e84632047be6818abda48c",
            "0x45B115bf21872c798b8f131EEE9AFA30b96A249F",
            "0x03Dc54Da70469dc3d53D4aF0AE43236B6ff4F2b7",
            "0x72540C9142cd326d2b60a464801D99c04D361dCF",
            "0xB677F5e503cc02B7A0d358Cf6EaB2196b3932709",
            "0x5fb4a0983daD1A0fae31ED67F1aaffeA3F3E8eC2"
        ]
    },
    {
        "week": 34,
        "tokenID": 54,
        "members": 18,
        "memberArray": [
            "0xa0936063ef229f5f27C9f2383d98D5483F36524F",
            "0x7DA02E5a5dFb3312A2B8487a04Cb6B062923618a",
            "0x443Da397aa57b7D264B97B9cFCd51dADF5Df4e19",
            "0xeE82d15265C15a00197693B361b7735a93b82e55",
            "0x0f8dbbeBdd165510Cb4EBA859A92d7329dEAc956",
            "0xb30217Cb6EAcfd76B302b91d0E5450AA06EC201E",
            "0xF3e8a7AE6F60bE09Ee463B6278F293f4289e871F",
            "0x69F329EE79C98A94765e4105aDFd5a87458d919C",
            "0xfA5970ef27B1329Aa11617EeE8446c2cea3315b1",
            "0x8c2721600158b3bEB1bC6575EFf57F50dDDF00C6",
            "0x0BaBd8774f4FB8904184b0965204e5A9Db43aCfe",
            "0x9B2E8F4aB3838E83c9c04cdf45c8B9f5E943Ab9b",
            "0xDAe442e757374088bEBad7e24E5A541Dc6C94E54",
            "0xcE8C42230891064f0Dfeef720fE2e60e6BC37a1A",
            "0xFde166416b94C92A98966833c71c3AD3E209f8Bf",
            "0x82A2f965D95F8476d3F833673b02E92436238d18",
            "0x997fb1A5a5c9983A2ffEB9453E719975A2583Dc8",
            "0x5fb4a0983daD1A0fae31ED67F1aaffeA3F3E8eC2"
        ]
    },
    {
        "week": 35,
        "tokenID": 55,
        "members": 18,
        "memberArray": [
            "0x6f2E21B6E20F3Ce7A1a8Ec132FD69CB6Fc603c3C",
            "0xdE708DEcb61D06eE30a95051DD203f43e0D44c70",
            "0xba944AbD6Ad261B220dcc8ba6b53410Cb024FCB1",
            "0x0fD84d7cb911728737556684050782B298F70f0f",
            "0xb215cFebB90D91b1D2F499843800d3105b1366Fc",
            "0xa1891d7107D7e1F1DfDD0AABfeA9abBFB504041B",
            "0x95Dec167F71bd0842743eBe0962F0FcD219856cF",
            "0xf5b9F3C09DCb5729fe0f2a2d404B73B6CEd6071E",
            "0x08B37C9aB0CE6b1D5Aa73A20Dfea634b78698065",
            "0x22BE9582CDef4eF2e6d4b119547AecD7652D9e28",
            "0x1Db7B73Bfa0361479158110CAece0aB5E621Ff37",
            "0x80E659027343ba9634F96f8d99BCcEa3A08CE2EA",
            "0x6a5D4157C186F87aa053b65cDbdd6a6BA372f64E",
            "0xD2Db39ac9456A12e405783d458cEA4d1D6B462F2",
            "0xe1690f5153aD0BBc683964aA81645C49b3cF6567",
            "0x82A2f965D95F8476d3F833673b02E92436238d18",
            "0x6d6d75D544CB628ED5C4e4ebb619aec0274b8855",
            "0x5fb4a0983daD1A0fae31ED67F1aaffeA3F3E8eC2"
        ]
    },
    {
        "week": 36,
        "tokenID": 56,
        "members": 18,
        "memberArray": [
            "0xd5bF70939Dd307f46c8B49Ff92B7b34886eA1350",
            "0xF3e8a7AE6F60bE09Ee463B6278F293f4289e871F",
            "0x3D15Ad752798866025EEA52Dd60Cc687ee27fE4D",
            "0x5C5aBb7047b27c70ABec5a840f3D0C4c7759Ce8F",
            "0x9869bB9e74d8C243D4df886CfC3eDD184D59347B",
            "0xC8938bf01EeE0e8c376e81214e1dF31593637d71",
            "0x00B5a19D64280cD5ae9308b4B82b4aa7Ca575494",
            "0xbefa1156Fb87B82c5A1231cB005097CE680cc74D",
            "0x6253e5478d686E943c3751a392B523072DD97676",
            "0xEA29a51b283eA6C0d3872a5c3dF4ddE3cba94128",
            "0x1dE65DE28006016F018006D64fa7b9101226c686",
            "0x0D6E22D88c703FAf1EbF6a00CE31268fA6BBd069",
            "0x58a133632547b6eadf2998ba2da5796a49657aee",
            "0x80E659027343ba9634F96f8d99BCcEa3A08CE2EA",
            "0xefC9C8d5AE4Aa2035AEF9A795A366953bdE98081",
            "0x27cAFf28136DCE030aa4811249297c0962219a33",
            "0x5fb4a0983daD1A0fae31ED67F1aaffeA3F3E8eC2",
            "0x4BeE0d0d6C437a9Ac4a24088824a8660bb18431C"
        ]
    },
    {
        "week": 37,
        "tokenID": 57,
        "members": 18,
        "memberArray": [
            "0x9B2E8F4aB3838E83c9c04cdf45c8B9f5E943Ab9b",
            "0x4a6e297B23B9389380987e901481811d83e945C4",
            "0xDAc43E419a6eAB0250D2800B9Ad531605d4254Fd",
            "0x8C55615279E0CFAb39944fb7Ad6626dA3b98fed3",
            "0x879a39B2D6Ad777293D7854d992aB65D2a456F80",
            "0xd648Ae665942C3485676E2a38c2C1CBf7Af2ff08",
            "0x0BEcC5309a325A7089fBAbE0cc0E9743C583F8Fa",
            "0x3A9eA3A8F7916F2637DbA398124019950fD294c6",
            "0xbd52889A4cB198a0E2cE36b52Cdf75c4e65875A8",
            "0x9372fE6d14d57988B7EC923815Cc9243B313D532",
            "0x72540C9142cd326d2b60a464801D99c04D361dCF",
            "0x367Bc1a9d1EF225307666E330E127EAF19B2160a",
            "0xC370634a9f3e32b7275591F3e3F537645599f2bc",
            "0xd5bF70939Dd307f46c8B49Ff92B7b34886eA1350",
            "0xA1326EB56127c4834798ae6652e9aE0729Ee2159",
            "0x2A2c1102cC6F3eF7e3d469e47c70ad8181C1FaED",
            "0xefC9C8d5AE4Aa2035AEF9A795A366953bdE98081",
            "0x5fb4a0983daD1A0fae31ED67F1aaffeA3F3E8eC2"
        ]
    },
    {
        "week": 38,
        "tokenID": 60,
        "members": 18,
        "memberArray": [
            "0x3F9517ac3CCC311C84826fB000bc8df1e45C4b72",
            "0xc52bC8A3F751239aA9366134164fc93Fc4dDFaFD",
            "0x4a5BB1c9347A0d4F7e06a29239162f03647d9232",
            "0x1E237976F0D579AD4b3bDC4557be3491EB925d39",
            "0xbB4Cc4392C6ca2c8D5EB8577Ce4fC77865b81E7F",
            "0xFB99f02A99bc250F691e68D05260be56E2727c99",
            "0xb1ead214506d0cd73785dd09b3efc2307133bf69",
            "0x1eB7409641e914888f2fF6d00601d8e03094b98f",
            "0x4F1B4a2D5cF60240dF3035688db8CCeB97170301",
            "0x7eC4583A83686d6e4A4e76D0b04c5be765850d00",
            "0x978B5720120E9C39a293293619874547614a7fBE",
            "0x3D139AE6E4A2287E9aCb8Db276FB4d6f8123E55F",
            "0x7Adf5937A1a5c3670AC7C82Fa6A8EC4EA70D6250",
            "0xe4eed67ac48c4d45152c7f5092d6adb6cf69a0f4",
            "0xC370634a9f3e32b7275591F3e3F537645599f2bc",
            "0xFc830CD343857a3BefC4dc53828846cE97CA13A9",
            "0x02CA4101eA84f400c62b3BeB87Fb5450a8702941",
            "0x5fb4a0983daD1A0fae31ED67F1aaffeA3F3E8eC2"
        ]
    },
    {
        "week": 39,
        "tokenID": 62,
        "members": 15,
        "memberArray": [
            "0x17Ba0C93587BE8dbbCe33EA408760B5Ead8FD059",
            "0x19dCb66ef4c2ED92BeA3b540a9703c6233279aB2",
            "0x502aAf1A596A0dF4b5C738b08980d8e07562044b",
            "0xAA1C73B88867DD5Ae89813f2d1b4F715D7D9A134",
            "0xfA5970ef27B1329Aa11617EeE8446c2cea3315b1",
            "0x7EB9d67f9DaeA510399A1eE978b36E66626058d3",
            "0xf7EE6C2F811b52c72EFD167A1bb3F4AdAa1E0F89",
            "0xAc5CB8EFEbbb8f0B59e336aaB27b008b96017DE8",
            "0x53c794B572612a12532168e05A473f097B6f99f5",
            "0x575757e0a0b19bEe7e07887FbBD616b395E32D4b",
            "0x71232ead3bec1ac03ecfe2556acd6c7d0bd349c7",
            "0x7fD46A537615852A32f01222f22AFbFA124e9223",
            "0x775373E7521EcaC8dE59Ba7aC2129615200D0418",
            "0x8A4Fd76e9547cc32693f054F34C153FF7506A5a1",
            "0x5fb4a0983daD1A0fae31ED67F1aaffeA3F3E8eC2"
        ]
    },
    {
        "week": 40,
        "tokenID": 63,
        "members": 15,
        "memberArray": [
            "0x7601f38fbc12a94a5bb0726eca5e093bbd870d50",
            "0x30dD09dF67A5BD6B6C070A9CA3e66889d5a59e21",
            "0xe1690f5153aD0BBc683964aA81645C49b3cF6567",
            "0x08724E55d71B19DF96f56B656aD466c5bCf6c395",
            "0x76985F8bD32dE258dFc8ae497ED5F0112322D078",
            "0x9B2E8F4aB3838E83c9c04cdf45c8B9f5E943Ab9b",
            "0x6c99b3d1eFe82A96d2D2f6ad511C2928648A61EE",
            "0x818a86f6db284A7E45ed98Cc1Ba88D534d07C74D",
            "0xdc211A0666bed568D5caFfbf538Ec221FCD1402f",
            "0x29E191D3005201DeE2e88567f41B57F4630ea9f4",
            "0x08B37C9aB0CE6b1D5Aa73A20Dfea634b78698065",
            "0x612112d107743FDb4c64F7990A76B01046bFB812",
            "0x8E41AfAf0182375191bFD437501e4514366ecbb5",
            "0x4eCF7071E4631A194f33B95ca50548808A17e986",
            "0x5fb4a0983daD1A0fae31ED67F1aaffeA3F3E8eC2"
        ]
    },
    {
        "week": 41,
        "tokenID": 64,
        "members": 15,
        "memberArray": [
            "0x075AcD1B0E6C91e4b7689d098aad19258C351C79",
            "0x8C55615279E0CFAb39944fb7Ad6626dA3b98fed3",
            "0x6a44Ab17052099bd776b736f1B117183c1540e92",
            "0x997fb1A5a5c9983A2ffEB9453E719975A2583Dc8",
            "0x997202adee11EBeB3D5b6B3C0b3b2B3f3002bC31",
            "0x12F4B6bdd718326294FA171605B4CAC8554ea38D",
            "0x6ea9399aEea278901d7F4c980f7B4B9c5b69b8fC",
            "0xb215cFebB90D91b1D2F499843800d3105b1366Fc",
            "0xBf2D4ABfdd66CFA279a527E6adf5C5D28aa308Cb",
            "0x7690Dd45d1333697B9A355CC1aaEB23dA14F8a23",
            "0xAA1C73B88867DD5Ae89813f2d1b4F715D7D9A134",
            "0x75d7d7972a62b00ff7ef071741c929f59d185ee6",
            "0x291EE16D5EA00975C4E104D7Ba72A83B085e684C",
            "0x03Dc54Da70469dc3d53D4aF0AE43236B6ff4F2b7",
            "0x5fb4a0983daD1A0fae31ED67F1aaffeA3F3E8eC2"
        ]
    },
    {
        "week": 42,
        "tokenID": 65,
        "members": 15,
        "memberArray": [
            "0x82E7EB952433fDe566993670F32956a27424Eb1e",
            "0xFde166416b94C92A98966833c71c3AD3E209f8Bf",
            "0x4a6e297B23B9389380987e901481811d83e945C4",
            "0x29Dea1C6153D46087Ef93B4F00e632e2344BeA31",
            "0xbdfA4789f3606A95dF9Cb63167dA4592a63007ef",
            "0x59E6F9C9062296195Ca0Ed7a1b2877EDA58B104D",
            "0x1AC49508F7C1ce2A796517269deFEFC535050Fd8",
            "0x31e0E2f2a3C6E8203B4F61C2CF59d3723dDE9557",
            "0x818a86f6db284A7E45ed98Cc1Ba88D534d07C74D",
            "0x6a44Ab17052099bd776b736f1B117183c1540e92",
            "0xc5cee9416571752528ACbb4331761C5E2706748c",
            "0x552E9b92A0E1aE5039Fd6661DF6610759338c319",
            "0x4c910b727cbC44799aAa5c8C20Ef049B54CF275F",
            "0xcE8C42230891064f0Dfeef720fE2e60e6BC37a1A",
            "0x5fb4a0983daD1A0fae31ED67F1aaffeA3F3E8eC2"
        ]
    },
    {
        "week": 43,
        "tokenID": 66,
        "members": 15,
        "memberArray": [
            "0x4f246BA9D70A786534A04E38388eb194Bd0BA438",
            "0x95644A174CC455188D4a1736C4C7252195283722",
            "0xb1ead214506d0cd73785dd09b3efc2307133bf69",
            "0x4530f9c72A873c6faF81Bc0E41b13DC8De417ac2",
            "0x27cAFf28136DCE030aa4811249297c0962219a33",
            "0x9869bB9e74d8C243D4df886CfC3eDD184D59347B",
            "0xaDC1143bAe11fF79C4F6831E2F4c3bEf5139aCFf",
            "0x1FA5BA9cFa7861874Cd00da192B510841B6DD5e5",
            "0x98B15A3D3D14a575f001f576ea11Ca91341D41b8",
            "0x38586444200e0DC6938c8d258fb15FD14EB619b8",
            "0xCCa178a04D83Af193330C7927fb9a42212Fb1C25",
            "0x7E3F89e746Dd9a2eeb2c55654732d8BD67F3c8ae",
            "0x3C07fD7dF33dC84056e54262156d1dFa6C440a9f",
            "0x3F421f9d5A4fcfA743D17ED1240bA8eC436b71Ab",
            "0x5fb4a0983daD1A0fae31ED67F1aaffeA3F3E8eC2"
        ]
    },
    {
        "week": 44,
        "tokenID": 67,
        "members": 15,
        "memberArray": [
            "0x1eB7409641e914888f2fF6d00601d8e03094b98f",
            "0x865973fc3b40Aff4B16FF54BeB5aAefE33dcCf8d",
            "0x6a44Ab17052099bd776b736f1B117183c1540e92",
            "0xac2E80F93d507ab5ef326B38B8C7363e02Bd2CFD",
            "0xa881e7264Cfa774545CA0D805EC83E2725A94b22",
            "0xdE708DEcb61D06eE30a95051DD203f43e0D44c70",
            "0x17Ba0C93587BE8dbbCe33EA408760B5Ead8FD059",
            "0x1B5619ea5C5F0998006Af5592f2D9506F044d107",
            "0x4149f044998bAc5407FF1a194DC568af905bc480",
            "0x4Ee780Dfe8F3E30DFeBf78308Da8D7111Ee8Be57",
            "0x54F2D5Fb13766fcb9224cC4D016FF31D0967F7cf",
            "0xbdfA4789f3606A95dF9Cb63167dA4592a63007ef",
            "0x5bEED0516Cbf1857183c9Fe25179Eb3B3c2FdF43",
            "0x5fb4a0983daD1A0fae31ED67F1aaffeA3F3E8eC2",
            "0x4BeE0d0d6C437a9Ac4a24088824a8660bb18431C"
        ]
    },
    {
        "week": 45,
        "tokenID": 70,
        "members": 12,
        "memberArray": [
            "0x38a4AE2b32302297C244986c310f9aCA8B71af3b",
            "0xE5D12B67755d2d68Dd69821fed9d7cC9c92fEf33",
            "0x9869bB9e74d8C243D4df886CfC3eDD184D59347B",
            "0x01303CE328eE52Eb6f76708b75f55ad19467D450",
            "0xfa6eE7Af7BaA1B174500d1A8275995EEA829453A",
            "0xFA27C9b69dD0B2E0f96118D564ce3b8A275905BD",
            "0x1fD1006bD3e14330F023866B598D4166A8a5D13C",
            "0x3746668eee844561985e888f604361294a56209c",
            "0x62a27B6DF055Fe39870A968291FE3bD82F7DCAF6",
            "0x4A11a811e05FdDa19A17E34ce1C9C8efD2018cc4",
            "0x5fb4a0983daD1A0fae31ED67F1aaffeA3F3E8eC2",
            "0x4BeE0d0d6C437a9Ac4a24088824a8660bb18431C"
        ]
    },
    {
        "week": 46,
        "tokenID": 72,
        "members": 12,
        "memberArray": [
            "0xC53539fd4D109840dBFe8c759Ba7fc2E7200709B",
            "0xba944AbD6Ad261B220dcc8ba6b53410Cb024FCB1",
            "0x378bde8b897D64F4047189C3F8b689008A560bad",
            "0x1052c2054321D5B5F385256B67A47D991263E069",
            "0xA57c1Af56140A195F876310414C34fE9FE399D87",
            "0xFCC8ed5bCDdc5002804b0a0f48ECDA71eD094aF6",
            "0x63c410A066d5d12217b713cCac5F600A06ba45e6",
            "0xa362a9EFE31631f2252B85B99eaC0c2139A1A6BF",
            "0xC8938bf01EeE0e8c376e81214e1dF31593637d71",
            "0x69996feBef47bEb378514BAc1A2Dacc88D947698",
            "0xb30217Cb6EAcfd76B302b91d0E5450AA06EC201E",
            "0x5fb4a0983daD1A0fae31ED67F1aaffeA3F3E8eC2"
        ]
    },
    {
        "week": 47,
        "tokenID": 73,
        "members": 12,
        "memberArray": [
            "0x458bF1c9407E8816F290C8FBFE800240F46c6361",
            "0x5bEED0516Cbf1857183c9Fe25179Eb3B3c2FdF43",
            "0x74FaCF54972fDCda0BDd1f5bEEd183B316b0ffe1",
            "0xC1f0432F11C175e29681ff754B061E59394fbC49",
            "0xE3E39161d35E9A81edEc667a5387bfAE85752854",
            "0xC36E75E9afbac4B96F689CB3c1e2a404896be616",
            "0xE10aD63306Ce7C5537a5239ebE593214D919d4f8",
            "0xB2c4D35cB20b0D6A7538da5683D03037068B26dD",
            "0xB7Bd892B95fc2FaF5659404D9Aca1bfA164f0686",
            "0xD056c9aE9c1B6a74E5848396F31069a6509988A5",
            "0x6D3E5BF37Be394A385bcB589fe3Dd2983c2ff0a6",
            "0x5fb4a0983daD1A0fae31ED67F1aaffeA3F3E8eC2"
        ]
    },
    {
        "week": 48,
        "tokenID": 74,
        "members": 12,
        "memberArray": [
            "0xFA27C9b69dD0B2E0f96118D564ce3b8A275905BD",
            "0xFDDeAf7829d20C6CFaDd20893493d9412B6F3f0D",
            "0x1E237976F0D579AD4b3bDC4557be3491EB925d39",
            "0x04aEE20BE071c84050649cfe0b1A754Cc4555D92",
            "0x312553F0C0C6218899d58e528892e789c8E96d03",
            "0xEc8d93AB08B1ce38a6EC7C95576d2EbC7e75B884",
            "0x59072920C81E979414A8A11c3ff371ccEb3994c4",
            "0x8A4Fd76e9547cc32693f054F34C153FF7506A5a1",
            "0xF3e8a7AE6F60bE09Ee463B6278F293f4289e871F",
            "0x8c2721600158b3bEB1bC6575EFf57F50dDDF00C6",
            "0x952c23f8F067A5e7e165ff0E42491f51D87DBc95",
            "0x5fb4a0983daD1A0fae31ED67F1aaffeA3F3E8eC2"
        ]
    },
    {
        "week": 49,
        "tokenID": 75,
        "members": 12,
        "memberArray": [
            "0xFCf4A697EC4BfCB05f8C989239B95B6CE363881F",
            "0x3F9517ac3CCC311C84826fB000bc8df1e45C4b72",
            "0x27cAFf28136DCE030aa4811249297c0962219a33",
            "0xaC6D0aCBCE4af6A68857238Ab0EC6DdfA225a320",
            "0x52741646b31925F98394299463a2559Fa33c7335",
            "0xC972154fB867187727021C90596C951E864DeBED",
            "0x7DA02E5a5dFb3312A2B8487a04Cb6B062923618a",
            "0xF3e8a7AE6F60bE09Ee463B6278F293f4289e871F",
            "0x575757e0a0b19bEe7e07887FbBD616b395E32D4b",
            "0xfa6eE7Af7BaA1B174500d1A8275995EEA829453A",
            "0xe9084e17D6fE521E020777faD926bdacee68D74d",
            "0x5fb4a0983daD1A0fae31ED67F1aaffeA3F3E8eC2"
        ]
    },
    {
        "week": 50,
        "tokenID": 76,
        "members": 12,
        "memberArray": [
            "0x90D6Cc871224965b6509F216b3A5119A37C4c5Dc",
            "0xDf89c888C802EafAad084e9B1D5298409888ee3F",
            "0x3f436e96F7fBBA9dbD764294C424b38e9Ff3Fff8",
            "0x9780bEdcC437782846d60D6C074D18Ed24765bBf",
            "0xC7797a6d8181AB3CC8a9975F6A79d91815e9CB8d",
            "0x9FCAE73fbf4fC6283B636f707c17529c2ba7b684",
            "0x0BaBd8774f4FB8904184b0965204e5A9Db43aCfe",
            "0x31f02E88bd6110723e767Af9E7186E61fc9e88F8",
            "0x008fd13FE5C789d206c219751a8D999024b210aD",
            "0x0f8dbbeBdd165510Cb4EBA859A92d7329dEAc956",
            "0xF3e8a7AE6F60bE09Ee463B6278F293f4289e871F",
            "0x5fb4a0983daD1A0fae31ED67F1aaffeA3F3E8eC2"
        ]
    },
    {
        "week": 51,
        "tokenID": 77,
        "members": 12,
        "memberArray": [
            "0x007aBdd190137F614701A6216fd703329AFBcdf1",
            "0x6ffC40E41897421F381abf343301FdD01cccEC34",
            "0xde0B52B339079EfC4648c61433fE6D4e2e5C7F28",
            "0xaE66CEB9D54563c4059cf596b5eD6Cc104bCf708",
            "0x5a62Bc0f7c2Ad6c56456dAabfdDD3c4Bb34df965",
            "0x0D3D920914A0fADFcf70E9d21913777472985526",
            "0x3B0f97112962e2256aE5d18647499e1185E746a4",
            "0x97e7f9f6987D3b06E702642459F7C4097914Ea87",
            "0xA57c1Af56140A195F876310414C34fE9FE399D87",
            "0x95D903DFD1D65D75a527D50Ddea8d35695bE2D7e",
            "0xBc481AbDB3F999a6670824B45bA97037F7623faB",
            "0x5fb4a0983daD1A0fae31ED67F1aaffeA3F3E8eC2"
        ]
    },
    {
        "week": 52,
        "tokenID": 78,
        "members": 12,
        "memberArray": [
            "0x1E9cb8699106dD3dB13f9307b898017EC79f0C3C",
            "0xEc8d93AB08B1ce38a6EC7C95576d2EbC7e75B884",
            "0xc0bbdc46b5661Bad3af778723723dEC410029793",
            "0xeBE6cC6820a76705B6654FdD1254256DcD54F1dF",
            "0x09712Dd5B73e63DE51523C37f67cd9842b7bf553",
            "0x4D64152d23260F399af956c6A777740Cfc263d1C",
            "0xa301d259fDEa577ECe7Bb920f6D2454a6ebeb1b6",
            "0x8A4Fd76e9547cc32693f054F34C153FF7506A5a1",
            "0xd3778DC1D8EE4f2D8574F785AB1F8D949b246f00",
            "0x972311dc283c1CC03d71D6f061D177E00Bd32737",
            "0x5dF88ffd3AC292a91C5E2D24abE322B1c7Dbc4D3",
            "0x5fb4a0983daD1A0fae31ED67F1aaffeA3F3E8eC2"
        ]
    },
    {
        "week": 53,
        "tokenID": 80,
        "members": 9,
        "memberArray": [
            "0x540DdE5C840FD7eD3be448410480eC1A04c0efFE",
            "0x5637e768e946C2Bbd02Ea6b99FC2120f5A908062",
            "0x83478a3Ad75817987Df6CDF4aBa8fF23031A4A03",
            "0x886B94C0CC4acd69E074B71E656A5f415682985a",
            "0x5dF88ffd3AC292a91C5E2D24abE322B1c7Dbc4D3",
            "0xbdF5A9E1470a439f8E479E14FF98E471f59CD7E4",
            "0xcFe1c6a3cd41F85C8aA7fFB930440586C5D27e00",
            "0xF3d5c25cc05d97Fa095b55F0E5f73A25440657a2",
            "0x5fb4a0983daD1A0fae31ED67F1aaffeA3F3E8eC2"
        ]
    },
    {
        "week": 54,
        "tokenID": 82,
        "members": 9,
        "memberArray": [
            "0x52741646b31925F98394299463a2559Fa33c7335",
            "0x71065286F93B878bF55c8F9502ae608370fdE152",
            "0x32648075ecd353767dA2faFEF3C56a4283567f12",
            "0xa1885d546B892989df144C85680F1106FBB75Ce8",
            "0x38a4AE2b32302297C244986c310f9aCA8B71af3b",
            "0x317887f0B88b33aD43fc0edCF587EE78fd88Afb8",
            "0xFA27C9b69dD0B2E0f96118D564ce3b8A275905BD",
            "0x5fb4a0983daD1A0fae31ED67F1aaffeA3F3E8eC2",
            "0x4BeE0d0d6C437a9Ac4a24088824a8660bb18431C"
        ]
    },
    {
        "week": 55,
        "tokenID": 83,
        "members": 9,
        "memberArray": [
            "0x0877007B66f1219bcCe52f401D5dDd78CE4Cac63",
            "0xCB04F9F5E1Ac544dfFb0d479b696e7AAdb76dBFB",
            "0xf79d2E607d783d39D2C4583c27D2Fd5B1075440E",
            "0xaC6D0aCBCE4af6A68857238Ab0EC6DdfA225a320",
            "0x505846a0a89dd26fA5cD0677FD5406039c218620",
            "0x3F421f9d5A4fcfA743D17ED1240bA8eC436b71Ab",
            "0xc31Bf9A4969a3AD0F2B9823317B329125bD3e923",
            "0x90D6Cc871224965b6509F216b3A5119A37C4c5Dc",
            "0x5fb4a0983daD1A0fae31ED67F1aaffeA3F3E8eC2"
        ]
    },
    {
        "week": 56,
        "tokenID": 84,
        "members": 9,
        "memberArray": [
            "0x6a44Ab17052099bd776b736f1B117183c1540e92",
            "0x58c6d652E07f7FfDD1E834Ef16163A8d0C710895",
            "0x0EBAb19F412e1afD2B90842e5C632aa186a4f60d",
            "0xa1891d7107D7e1F1DfDD0AABfeA9abBFB504041B",
            "0xbEc7B649FF1b72Ce87acD470da0036A0BEC6453B",
            "0xc8b2468f9fd7e1fe407eff8d2813fb0bf56eb726",
            "0x58a133632547b6eaDF2998ba2dA5796A49657aEe",
            "0x9B417B254BC4e4c7b43e7d5149DEB815EB5154f9",
            "0x5fb4a0983daD1A0fae31ED67F1aaffeA3F3E8eC2"
        ]
    },
    {
        "week": 57,
        "tokenID": 85,
        "members": 9,
        "memberArray": [
            "0xa4f026D2799C6E1dC057f20725B3794dB6d68888",
            "0x8d7A48cEa03Bc59bD47FeC49F3EB4Ad2Fe2a7f68",
            "0xD5806F9B385705902BBcD718Fa1aE43150E2911f",
            "0xCBF99581846a6f1c23e95Cb8B0B353b339600C3C",
            "0x1B6ae480f83Eb85e4bdc2A97f74525f9e26922c6",
            "0x7f9C8843926De4b2eA6cBf9381F9f2FA81C58ed6",
            "0xed7f21F77D366B2d6E9bf8473C6087FC7903d370",
            "0xb61d3430bD827B8c9a04e3F99896cCBa674080Da",
            "0x5fb4a0983daD1A0fae31ED67F1aaffeA3F3E8eC2"
        ]
    },
    {
        "week": 58,
        "tokenID": 86,
        "members": 9,
        "memberArray": [
            "0x07206D87ADFB4588ebE0f5a2f30C17edbde7EdC8",
            "0x417A1203943b5147E55a74FdD0B1358F4E055E88",
            "0xEEf267819f7677BfFdA6A82D3FCAcF041D2Fec35",
            "0xb00E81207bcDA63c9E290E0b748252418818c869",
            "0x3558f346fECf745365fc2944d8F9ae970aE21759",
            "0x931fB9C9bfB7B723Ccb54CeEeA5F1C670C899B63",
            "0x0808c343E3395b348495EDd585E32c0C147B8dE2",
            "0x7F73D6242d5731E89D0d3A2c3E7Dbd3795b5dA8D",
            "0x5fb4a0983daD1A0fae31ED67F1aaffeA3F3E8eC2"
        ]
    }
]