bnb1859r478lkzxl3y33uht7dw75r5xmr53gh543vh	4210141.24075104
bnb1rlhp5uhsysz9qf5gq78kxgvpkfcg0qv0ldu5r8	3961840.52409632
bnb1ju6eehwue87tayz5u7pvuh33eke8l84dumf0mp	3522010.53717696
bnb19uvv83huy7925hpfmyu7974srxvxem2r4gv5pd	2952466.5732217603
bnb1xutm7nm9l46c9p5xvx94xuz08r3qadd28teygq	2962771.14140896
bnb1wsg43lqyllnwx4tq0tascknsr22u9m2sn8yhph	2911775.34187936
bnb1kwhutx2kgcz9wpnyx2lrwq7zz25ckwa0y4k3c0	2826204.41450048
bnb1wcqhkzkmp67f5c9qcspmmr7mddktj5xl5t2e62	2593254.53605056
bnb1nk9y3fdqj8vwg9zzy2ewxfkn6x430vxc5dj9uh	2585522.17224448
bnb1jccz63p5nufzgts9cdd0cxcrftgxaf9g29msal	2192785.45526848
bnb1cpwrzcmpsdy5xm0yd3d6wlqlr506uawsykuz99	2250713.9695737604
bnb1zhpqqc35amhtmamhcwwynyyyjzg6z0f7a3hm8a	2317663.9788492797
bnb1sea7shprks76xqwqm4xyyzszuupnsc8w7dmd5l	2033474.7713923198
bnb1ylyf0auut2sx3y30kgwd5ss2zm9uqeuwr77y6s	1994065.4016774397
bnb1devefureacvt9lhwlwshs3j5w78m967clghws2	1527272.70336032
bnb13h88jdmfgu5mrd4yu9q23gtg6lt4nytwyaqdtk	1750843.6679552
bnb13vedtsftqjywaj074dneknyr6adpxttrand20e	1578429.64428544
bnb1t8mua25fp0pfu25z9np08nzn0v3mjgy7fvvl9y	1570172.66225184
bnb1y4m7jrvmvnsxhzghayyy5295gwfcn7uc9r0x4e	1530617.9018041599
bnb12tkrm0qhrn3pe3vnrfkt2vj0d3el5h5ncs3gh8	1517544.85174656
bnb1mjpj7lvgymhz9vzkzc7vpt0q80cnx77valvpgq	1441564.86637472
bnb18s9wcpe0d0tvxc7vp6yz4d2g7dkg7n382p5url	1321422.4459148801
bnb1mkjq25mes24edt35deue93klc0s633yzss95y9	1200149.61250752
bnb1xuz5rfrtktfe9zfh0z7a0ystmgy68fg75gfjtz	1197581.0428947199
bnb1grf3guxfrphukjs5gu8pf7e6jtxgq202ur3u2q	1182762.09245408
bnb1q8l5auwwq7flq5vlq08fxxzurznv0v8m6gx0gj	1140288.61304544
bnb1y3jw5un2nkyha8wy5tf7yavcsnt0grlfjs95qm	1112495.96288128
bnb185k8v8t6utwz20ngcdy3dkwl4hydg224nsjuwr	1078813.77644928
bnb16zcr7p6tzfcnhlp2glehge3zm3c06wgfkk3ppd	1105501.45704416
bnb1e2dzpcdaqs9vxmscdk2rc7y8fxxepxv34u47vz	1043630.4307011199
bnb16a95z4chxq9w0erj9mhrkrkf7zt3guajxddtve	798327.1863209599
bnb10hecw5ml5zleyhrz7xt0k05pf4ma7mzykf34v4	999999.8833772802
bnb1e9avaj624p2m2auhxd44jsqhffxvp8jpcvf8rz	921807.535688
bnb1d7p0hulh58tzv0g4x7x5y9r0k4qvews5cessnm	900770.70824128
bnb1367fjtjcugtdyvjnlykmxrr7987zct2vqstt76	895369.44251776
bnb18lu2l78mlrmrukvs06kf4dmtnwrezme7hraclv	863051.5057952001
bnb1gjh3zw5vaq2lyljzety2gdzj2mpy4u8wsuxv4q	872297.1448118399
bnb1h5lc8ynlum4jt2l33uw9lmmg202arwmda6r24j	856656.73673088
bnb1qew564y4av4n2l9wwy6n7nluy5glk05xqhs9gg	743749.9284067199
bnb1u8jxqw7jylneh60l8sn3pk7kwejejyd8g7hphq	693493.19843552
bnb1am5590t7tev9wlp7hlrp2qsjp693p4f8wn699v	679999.72684224
bnb12tevktzcu7adzds0qa9lu0mx64mfauwudmxru4	670019.86462496
bnb145x6fvha7mgx2g5y45rx22qd2vym5cl405s5tn	618095.9875843199
bnb1ntf8rt2dfn6z6xrhcf82etsa5239vex0ddf3h4	607398.8644185599
bnb1087n7v9vdh2j3semze30tesn7h6zuth6tsxdyt	603497.54642176
bnb1zr90fjgxjsjzsj9fjsd0rd7zkm5hqqdd6d5ncq	600000.89929792
bnb1plhkl3mgkzn70680ttx9vx4q3ej4n94sqdz9c2	600000.89929792
bnb1azlzyuu27tdxjg874qr494247z6jj97dv3y486	599999.6877084799
bnb1gpuypp4f24hheupkxdrac98rzwtawwvtdwu0jc	577804.58075712
bnb1f4xl0jvnz04sdx9n59jtxs6w98weulnrdae93w	563596.27139424
bnb1fc5dm669l25lznql5jlscnltjxcnk6s8n7sag5	560390.405736
bnb1z8s4c0g3qznfxkv6zwf5x5r4jn3pmsav4tuc4g	560323.7683167999
bnb1pszusstt9fnctws87m3eewxj36jr5cladj750y	541484.76411424
bnb16uxqjzkfzcngux7nkkhzgztnjl8ethh2h4whs8	544854.1943468801
bnb107lpz8zcxrqsl2pfdzm6ajnkmf0dshltuzxpmr	543609.891992
bnb1yws0a7fdk9l8x9mkd352q05xyrutvx5arkeura	522991.06290207995
bnb1n9uyass9d86dedwxr4daal3vaeegnm0888nkjl	521873.97743840003
bnb15w49r6caypgklgm8phjep0sa2l4vdf5qleaysd	509799.2770793599
bnb1923uqcc0u6ezrwmv7fdlhucq9dl2f076vjc4ja	499999.9416886401
bnb1jfundmcdsugw490rewkrm0atejrlegnfarw422	466940.5122288
bnb1mqm5sn5ydvl7p9qxw9rmrf48lgx92f3cn45zzd	403809.43286815996
bnb1yhenddk5w7nl3uuj5msxvl3pa5k3snmkc6044g	439840.89122432
bnb196v9l9zuyyrz40vydp9lv64mmynqlwquee8jru	437826.01798560005
bnb189p5gyzktj9u774tredf5t8cqelfg66segjx4y	427596.56834368
bnb1m6uvglhskrrpwgt6qzhrgdenqsvyt2yxk7u35v	429479.37833344
bnb16p0sp5nlphcr9y6v02lan7z3739udvwagrg85x	385100.06873568
bnb1l6exfwglm575lh2gspp6pm73qumpfhl4ndq2t0	363835.46247424
bnb1vkw0rsjv4ygjd0cwczay6t23re52e79zu8wj7j	390633.39770816
bnb1zk22tfw3fyl7z0wdmxl668y5qq70yvz84gf6xw	388885.07414624
bnb1r009aaudhlacjmnq965k644tcsr4rj4ewh7uyt	373983.73562368
bnb1m5yy49sksmjh7j02vyfdnl7vjcttmk25kcl0vf	365490.49364928
bnb1dqr0qjy7v0srhr9e0g7trcjsdsvu8p09jf5n33	363877.86810464
bnb1f3setp3my3yz9mqu3u2zc7vgcjvas9vd0u3dle	350000.32265888003
bnb1zp9yqmqkz69tnrpd53dpjyca2zuj6usanup79j	340137.98461727996
bnb1twa0h0a0sx8wm27mvpzggx6gazuzxakzm40cdp	340606.86973056
bnb1va2akjq4lmy2xcaj9ljk067dhktty839xnufd9	333871.64403360005
bnb1da9hxsw93gddhuta30lc3f2936j35y93gdqv6g	321463.75657856
bnb1xyhmppadjr8v2npk6g6srzw2p3mwnd3ht9p3gd	322137.40030720003
bnb19km30jq0qe5xyvdtayhdj2qg9uwtd9g7x9mv36	318664.98497215996
bnb1zf7lpum3al3xewlt492cdgmrv3shd42dy54ael	250000.57663903997
bnb1637hwjptdrmln46v7vvj3d9mzktrxdlrsnqhj4	300849.77384639997
bnb1lgyux9fp3qnff6zkjdjknxdkaw3cwclyx43khp	300572.31986464
bnb1g8tvafknlpmht2p375jkm2al0xshq47f2uqs2f	300000.44964896
bnb12me6l98g9tc5jmdw5x544f28zn36sktru5akkg	300000.44964896
bnb1skp2q4a05ed8ven2gn6f4fj30cl4ew9wy0ay3r	295717.48097856
bnb1fg4zezx3w7k27l3rg03te46m9russws8djz2uq	262564.75913184
bnb1cr9mqk287hl9ettzwh6ggewch97hxtzl3r9ntx	283201.76206335996
bnb1regtphttn700wd2a8gk9u327d5are573jx6hg8	281500.69048960006
bnb1z5u77wf2x7ej8un5ls8304f75wm2erqgqk64pe	279552.45467008004
bnb14fhxm0scggqllvquc9e07d0emdgm86v684ltw9	278367.52019776
bnb1kckre5jptlxwdrwjwruc93nh3tqh3y2m864hp8	276475.01749248
bnb1y23lz9an6540gw0xfcryjznrstg32ksl024d7r	271606.85112256
bnb1rq5z3k2e42nrsujc7w2sgc3glu46m0e48s2zes	271475.99946304
bnb18te0xhxpqwd3ddsmxq6nlwcghhwtvfm047axqj	269572.59245279996
bnb1wy6k9uxe34tx3pxmwcpt80pvt2p4edme8045l2	214551.89280352
bnb1ms6s0juntctw9rl95mv87rkhae5uu0mna9004h	255199.50692608
bnb15tcnmznknk9xdza5faqe03pymfj3a8u3tmc8l3	250000.57663903997
bnb1kq3x7h4tl6qrtgyvngzyynfl2825c5ejcjkzhg	253967.3204656
bnb1vhl95durh3dt3lx35raylv648ksljeze9460h8	247749.44345952
bnb1ep3nf4mafemfrwlgyl7vksruezngweq3udmxj4	243702.73472992002
bnb1p949mdjvugak9wdw604923pgewnleqxn98nyx5	236131.51231936002
bnb1c2x0363wtr60quzy483u9xewgesqswpqrvav5e	204999.72165856
bnb1nckmzqs3tgaernfllxkw60v0cvj553dwuegz8d	224921.88682048002
bnb1qx2ugn98cw40ja9hrfh2e47rvnxsc2gl73dfke	226546.62825952
bnb1ayphwzju9h8yfsdd48srag04nxsyy4uzxrtk76	220000.41051519997
bnb1fdjtpuawchjx04eplt4ger4d9h3nsznjd7p0m4	219766.57375328
bnb1fp7ru0nyka3hcxkj9mh8cyf49u63hgykcl7z9m	215682.30575104
bnb1sr8cv6tdf4w0kt0a8auclpjnfeg23cjd7e56xx	214305.9401472
bnb1ak7f3lp02zmtv4gm28ycp22jpz29euuwu9r9pf	213949.73285184
bnb102l7dnmw7pjr5hzkws6qhe7fatkvlqmykhmsyh	213930.3474208
bnb173sjk9wxz67raqlheusumux4rjem8k96fjqyjp	207529.52040928
bnb17e5n6pcvj3vx3zzugz3zka83a4hwaeawtd77yk	203408.90472384
bnb1tu4h2yeumjh3dyf26jfcfl4nv54rfh58yyhs42	200292.69668416
bnb1h0mtvjg4zn4adlhm82suzj79egcnentfmngwzn	197619.93037952
bnb1368ewg45c523kmlnfrhldkeudtne9xglt23jyw	192282.87889632
bnb1nqckk6repqcx32a9suu3dgy2hcml0ws4j4tpan	194909.60480223998
bnb1ypl77fddyeqrx2h2gpkq63ztnulta6f65utwzw	190045.07320063998
bnb1ajrn6uqwp90jtq0eepm3gdjastspt8na8c6agu	187595.23935296
bnb1dyltg4dr4t35ptsdh70jeqee8842upkz4hrc20	188546.33706336003
bnb16dnnyewcyqmpn4ur6jtzsdlsf85v5x0pg7t5a4	187928.42644896
bnb1faa0qz8vraufemjn2yt9hevrjkk8rvne3nn2zl	185476.16942239998
bnb1qzcwt8vyhmgpxgncf69eah0n7znp0yvfshfhx6	187029.42708448
bnb134fk6ywlrhaxwg9jzuyjhsj2sedrvy0k7upsap	184733.46509568
bnb1fvf0qpwl42s2s234umszud03u6md3kd0g8mffn	179999.7851536
bnb1udjyrjhpwm0yq2hwmdf4acvc4r387a9v83vree	177557.22084256
bnb1sp88zx3tfnqeeurrryq6287z20lw4knvanfxmh	170672.96964448
bnb1qv3lehm9t705qt0mg9nzzkcymjkv8j7ymk7klm	169038.53548992
bnb1v7p5w0euauelxtqh5w8phlw326wsrdtmt4vcfv	166564.46985344
bnb1c0ehe7tlyurqhvrd3zx8fnafekhxe9m0htzquk	165288.66617312
bnb10mtrckhp58pe5uh9qskpmqcq0rtrqhr84saa3h	158117.26827776
bnb1p0mn2sh4p72zqvzjaw8h0nk57s9re506y4j8lt	161428.54221728
bnb1fzu4nnvg5vjthee5j2qsmj9kywxg6mvvg4t884	160000.07826752
bnb160308gggrcp50e5vfsdzq2fgjg23pjqs46zwah	159160.4467856
bnb1vgk8c7ef9mczcs5wpkg8vqhkzpf47agxng5sl9	159128.94546016
bnb12ekm8lq8tr4wgrysfjjrd9raly57c6sxf4g8f8	154727.24102463998
bnb17uyy50cg9kkqrv4j26ym2759e4ezs6fyk89zcq	155838.26854112
bnb1rpw69vck9txkql2hw8t80uxdapve0rlw6ywkhf	154448.57545344
bnb134ajamqtcm38z7efqyh24ts9ca6meg0r9aalph	153750.699936
bnb14lzrsuqjlnqazt728ruufkegs6qh3ty3npak3a	153590.77012992
bnb1y4q892gh6c0d6qwcntn7elen6xjtfz8gyc44uq	150370.3653984
bnb1cj72vmdqfkskdfwdglr7duknp7gqrvy24hked7	150224.9746656
bnb1a00n709j23e7wumc6puj9m0sh8g4u22nr4tdvg	149968.11770432
bnb1842ha4gdwxyzsy2836kvt3ah87vjy6qeqyzp3r	147862.3752576
bnb12wfl47w364tuhc6pe9nvanahvwjukes2jued9w	147322.00636736
bnb1hnexk29le7qtzzmf0unzz0gr2n0mtc66mxexn8	143676.3337424
bnb12c37jwarlcfl4svxdryqu89dxzjrduejkz6tss	138680.95048128
bnb1w9yudrlzwekvsgp9spf6p8y442u782z0v4sgtw	141780.1962688
bnb1vwq2as8p63jvgl64cxs73al04s7n6wp65nv9dl	141055.66578368
bnb1h9qf5h5j4dnd4zecsd8qvj72rm284lvhc02w8j	140265.70946880002
bnb1egx5rqs7yaj5au0npwhjgny0s0gpthsk2snc0t	138153.90907488
bnb17a8cc9wamlj25fgwpvym3e9n3sqsslfe76m5s6	135771.92423583998
bnb1awx3rfhuxwmne8hxl70pgxzsflht9zrnwt7xze	134213.820216
bnb1283plut7k2f6gx6theptc3kxwfaq30rw5nw9jj	135141.89772704002
bnb1yzlm0ar7a5tu336dak8rwq8wa22gr75hraqgt9	134739.65003296
bnb1ed6rx4nrwffkgssdyppmrfg0dcnfemtzgtu44p	134447.65697792
bnb1umndam9rfzrgd95txyr5c9kpjvkkrg5c7cdck9	130652.95885183998
bnb1vclzda3lcy2m05e6vx9h8308e9f948lqqcrj8r	128987.02337183998
bnb14ckaje8u95cgyq3zlwg7w8yzm0dhkv6gxsqgu7	127558.55942207998
bnb1u5spl7ufmrhr0ett5za2d8qv9y2jftl4cdsjfl	127166.00444352
bnb1ksknwzf5llx3gcvarru4vp80dd0djsfm2a4yfv	126596.55740672002
bnb1de43c9q2lj7tf98dmc2xnnal9gx8jq79f0xmsw	123649.97188864
bnb1jrgf2fvkjfwzywrndrnykkc6p36mt3ytfzq95j	124397.52257311999
bnb196jfucq9mdjtw52td8a3f932w06m4q7udzux43	116467.66968831999
bnb1320f0fverl76txqupxguer6kceugq2z9wfukqp	110763.5066048
bnb1nzg556qryclu7a7929sv4khs2gw20eu8re25gg	123291.34141440001
bnb1ppulh3ucal4ers4stg9gfhmjtffltha9rzmmnh	123245.30101568
bnb1zhj3tq45j5882tjp6pet39tlsjmly8e4pgl5c6	122192.42979231999
bnb15jfs60nwxquvaj9lwn7n4n2hs7ggnxvtqy4kt5	119987.33701152001
bnb18m42xp89ykqz7gljyjtwers703lj4u33vhytjm	118684.87836352001
bnb1rsxmnwf7lhgrgzr6878kjlatlk08mmysc6wns3	118431.65617056
bnb1drhuq0uju64au7dwv9qnjg3ejr6aesqt7287k4	115739.50443488
bnb1pqw3ytwyw5fwn9vv7jwus6dwta22t2xg8fkc68	115755.25509759999
bnb1j45qd8xsdkf9uda93k0eh63js2sus4ng5xtnmt	113649.51265088
bnb1s9g7c9v3rg6ee8g9mcf7txg3ayxr0vkp22wfxr	106902.17105952
bnb1l3k02y4nvgsnvdg396lxr7cpqknqqrfhc8yjfq	106347.263096
bnb1fr24vdtm23ufx25ukld2d7grtjfr5hk5anj95n	105837.18394176
bnb1lq3w6nkjc9suldhw7yzf6kek6uhlemv2h83skk	105621.52102144
bnb1u0fztkdccczgl4h8dp3qfjyq62an8d78wg8uqs	106166.73626944
bnb1pdxa35p2q9e6qmgdsxqucnr4065ur2rzqduazs	105402.2233328
bnb16nxntteq8x9qmqle8m60ndadp3cw002q04j9dd	100989.61459232
bnb1kgfr5468a7vu94mp5jt7qpzfuqcn8ryc82q52w	104208.8077344
bnb1qz0grtc9qsh2ur43cphl8sm2t2nsya2xa9qtc6	103327.98221152001
bnb174tkeu48hqd4dcky3vwdkl7h6q3aux9l4zekgt	102208.47356896
bnb1eht48a77ym2hhv6cc2hp5f4x9xeqsxg22c9ewu	102494.4086768
bnb1g0we8gc3trgjwuhuy3v0sud2urehyjjcaaz2cj	97982.44960224001
bnb1hp82p7sd60us3cgfqgqmxgdgav9zr0796rlmsr	97867.34860544
bnb1c8whfhqet3w4v6u3vw3xa8mlxstja82lght2v7	100088.19204896
bnb1t57fmptcaxc4aag2ax86a7x354p543t3zs8m7c	100021.55462976
bnb1mwchwe6lq4m5f78clp05ermumzv0wwapzv09d4	99999.74601984
bnb1hfyj6nqnsge8zjlxneyun6gnl43e3kscgvgk8s	100210.56258240002
bnb18s0yptz5205ql87jgmc24ud58v8t0z7sdp45sy	100000.95760928
bnb1pyzndgy0clkrehqke6h5jgrtdqzgdc78ac4qsr	96258.35782912
bnb1ahunptx3xze043skl2486naze8qxjfklaq793x	99999.74601984
bnb142fqapcl0658s4gxlnmu8n47asqc44vu7saw20	97941.25556127999
bnb199u6x3k9my0fvnseldyf5tcvz6qvmu0xgwp5fa	96011.19358336
bnb1vp5ak37k0735jpscwrs7p9c5z3e4ueed7jugwg	94524.57334048
bnb1sdh8a7xahvr4v2tjagt4udm6fqwmrst0cz0mjz	95218.8140896
bnb1patrmmvazgp5m09s4j7d3u9syzn6nelf4jc0k3	94817.77798496
bnb1kcs49v4u7f3fw5yqrq7xuva7k4cggzkz9gf8sr	93000.39382496
bnb1afp3u6gu6tsc6w4tw9wqzdhhna2np2tzprtzcc	93114.28323232
bnb16x93hvxf2l2w8lqvpsjmlqf6hl54ze4ty3djux	93722.5011312
bnb1asjaxc4d0udwp6ltmvvlvd0m503t0mjcy2hyae	92113.51035488001
bnb1323qet0asr8g08rkx93w28jkxqfcysaz935jc7	84482.92006176
bnb1da45jhxdx7v2klcahc2mavv9pmnryem5h2fngf	92609.05043583999
bnb19c2ewmwgcda55hel53mgtalzhnvsvncwxnthtz	89531.61325824
bnb1vlkzn7d03n9xtz0f4tuq0nfpplvxeenqdepmv8	89761.81525184
bnb1tkpcmg69hsgw7tn9297n2u34jp773cwa30e692	85504.28995968001
bnb1p65c8nhh38wnexrfvyp8rnd47e7huanwwtzh89	86994.54497088
bnb177xy982fqxc6qk9zwfnhhqgd4n55vd5wfsgx7m	87676.6698256
bnb17dr32lkqs4tsspxvufnmqkacj4svy6ly65d43e	87057.54762176
bnb136vyll3taevqahu8l63plc43yqa0ku729g7tdp	85287.41544992
bnb17cnrdhde975tp50rtyrqtp2gxemaf8rdta4e5z	83570.59321344
bnb1xjsklr8yst8lpgw53m8dw7qcqrgwgjprpvf7ee	78684.25300191999
bnb1vvv3k6kjpqrre8fr3htjhutxwan9vag6jrj9dk	80001.25072319999
bnb1skc0uc7m30hlcxgvlg4flkvm38sefv5uwen523	81852.55938752
bnb1savrv84exx5ra8rvhgp7eyhxnq5u3wzjxh7lec	73994.19027968001
bnb1uhm7phhcw3a4tn8k4jq50e7lh0z695am0gu2yw	81103.7971136
bnb1a36gc2zpzws48sp8s2znm9gukmdnyz0wsnknea	78567.94041568
bnb1uag25q89qmjpsf7x56p4gk9dcj6qk2qkscjczr	79560.23216704
bnb1nlxa3z3nrgdg8zkv550ua3pllm5sqc66vwc9ca	78851.45234464
bnb18mdluksg8zzjwce5jk73w8s3g2ky2748vdhl4w	76806.28936991999
bnb1w4ktt8uf0gqju50w5v8g3jw5u6gpyvy9z0ke9s	77425.41157376
bnb17pjul7euxs6egrlu3wdk2nlhyk4mrspdmhh9fk	77750.11754368001
bnb1qelv08zkl623u5uv98cwpqrcdrjweyf9ufz09q	77476.29833024001
bnb1c2sltux8hj5vyc9vdwpvsajjqac43veceeazly	77465.39402528
bnb1t7kptjtwehqyjqke4wv0tfcchf66gtnarv07av	60000.33224768
bnb1nsfe7phf7c6wqak0znekzy6q430zw68wgf5zz2	75511.10025855999
bnb1myst9x9cy57vqf3z9d23du9x0cq4asmkyxez45	74922.26779072
bnb1y2eqpzcpyxkexzzd3e5vnghd7xd5jr4p2ud0ly	74689.64261824
bnb1t6q635w940ml8az63g0fu4nr6xaa0gdjpq7fur	57693.46595392
bnb1ucu2zgzn9kpv39c4ynrlsjm57dp9rcv9mr8r76	73624.65550048
bnb19dxth5fqfcxyykkftd4yydvdxxejp63ym8yymz	72610.55513919999
bnb180hp2ms3a862j4u0wm5l5gl4z9t33fddhfwea6	72533.01341504
bnb1f2t5gr99srrv6gr0ldna8xufztdgfhxttgy7kg	71578.28093631999
bnb14t4e82ta8hgmdlua2q8c8dpwrpt6g67fgj88au	71395.33093088001
bnb1nz3x9f477yn5xw9yq2z7hay55jfkzy4gngcyvv	70853.7504512
bnb1xpmcnn8738fv6zst6skr87smfwu0ah60vr7mcg	67239.57915168
bnb1jfck260nln85qy9lacc5c7dfxppueaa2g976vh	70096.5070512
bnb133sp2s58cjlqlrgh7s6a4fqwg5auua0j4v5rpd	68984.26794528
bnb1yfyxdqfmwua4wj75wnc30tv0ll0m2jwxyx6xyl	68629.27223936001
bnb1pj04e3nkkgd3t3xcxwe8z4p25vg5svm7rqjm8j	68446.32223391999
bnb1lp83jqpjkx5wedwtyggd44ta0fx5w2fef0us4l	68363.934152
bnb1ka483sgw3tqfldugds9n9f5jqw848vmk8qn9vn	67407.99008384
bnb1sfj05y8gdu0w2mn7w7d9n2dyvm0x4yvq0lfdp0	65361.61551968
bnb177hrykeh5zvg0lh00jlxhgnvngveu56xyhxesk	66300.59733568
bnb1lwca9rwt7ja2cqkc943jvxtz36zsne37765r39	64301.47475968
bnb1px9383sy08sj7d9nhkg6thcwv82qdgcdajt82u	63395.205858559995
bnb190we7qptyc05fvw4jju7rvm9fg5q4ny683ksq8	61135.59155296
bnb15flf74fv9nka0u5lejjmngal3wa09kxlcfuqw6	61995.82005536
bnb1jx0esfkr0vssqr2m048xlrfwav4vsclj326ahj	62199.36708128
bnb1ke2dxg5ngz9a670lvqrgvg3lfga45s038vpxj5	62131.51807263999
bnb1jexqjxdazm3jqavzaemdvgfvc9qnsp46erjnv5	62004.30118144
bnb1r8n9cqcd44pkzrslllzanzlvreev40hy7nastg	61999.454823680004
bnb1uxsx5ex2kea37wjfazcv6e0rsegkcpylg4kdd0	59480.560377919996
bnb1gw5u9m4phtmq4q0nckydk5rd5dd8jhxqcsxd6d	59493.887861760006
bnb1zcza9pn7ut7cm0qu46872qj5he6pxr5kagnetw	54828.05692832
bnb1j87zk6xnv2s79rfz0p4tmwwzg9ll2l2s2ptkkd	59159.48917632
bnb1vhf53um9ypt36lytwyy84206paz6hgq70sl4cr	58970.48122368
bnb18u8erwhu8js22hrul76w0zajtlhrd6cvxndqfu	57763.73814144
bnb1se0kwzsmzwepx9pxzrfycpar86xsys93ahp8lu	57693.46595392
bnb1hwyacmjwc3y3f46jpjclc4tkjuzgg70fs5q5qu	58260.48981184
bnb1aey6sq47eg535050hht3q83zzjq524quar43cq	57394.20336224
bnb1ux84kgg4ya46zks92psy3nz49mpyek6tjdzgkf	56599.4006896
bnb1uma3wqqj4vjxe4q8xsnde83fzxye9l6h46nzxa	56517.01260768
bnb1qhefqvcfgg7y3m3wvg29g4r50958nwnt776eay	56384.94935872
bnb195lkv0f6x5n3xz0gkrs7s3m6yu7fsgg8j96axc	54614.81718688
bnb1rnhamj2wn7zezx45e9dk9h4wn8kdpt9tvpent6	47380.416640639996
bnb1eralzf9ku9ksvcdwkd67qf3ywvcz487p9h0frd	55105.510910080004
bnb13rv02shcdg98ec0l9crz6zyhewz0864k4nmpvg	50214.3243408
bnb1xunf2r7ssh42qshhhsxtqvhralezgdnjnvk003	52740.48832320001
bnb1z9nj8pz0laggj4seulr3m4jjl7ku4950lk7y04	54017.50359296
bnb1h73h9tyqat8039gwx30uv3xj4wyxegg79485v4	53731.568485120006
bnb17jtep28er5jzykatr2tqnd6kufhlakq582tzz7	53724.298948480005
bnb1evjlm9f4jp7cye2alkh8nlj72e3ltw77380mqc	53720.66418016
bnb1yj743dhufwxm4f4p3jwugwuus5vae6u9jzvplf	53220.277741440004
bnb1npuyw2ezgn29fw47pqa44s4rawzs7d3xdrgr9t	51287.792584639996
bnb12jcyf5dkefyd4p2pe2cvkwf5u3p9tymdwpykgf	52522.402224
bnb1ny6qw9tqsf9s4rfnlcexmxjgmqcpyzxcx6r29s	50255.518381760005
bnb1yxx3grdj8jnxfy9yg98v56grumhmpvw0pml8ly	52500.593614080004
bnb1ezq8ja7ydlakghwxqcuzyd8u9g82704j8zfn8e	51885.106178559996
bnb1c8gfa6k29vyeqxa7prjrtxe9ujgzyl84s562mq	49999.87300992
bnb13t2uuxcjelhysamdy0pqw7m6g79zv8ddng5wng	51129.074368
bnb1uewdxntnk9pgdh84vdth05z5fhcs0gzs05ek5w	50862.52469120001
bnb1nlwp6zwg5gk0r6prtl339at5mzun006l0s7a40	49999.87300992
bnb1l3ftnt3s23de9e8hcemvpyrrq3hufsu5t4p8vn	50425.14090336
bnb1txsadmg2gklm9vtzapwp9wa3mazzfrh0d05v64	49719.99584928
bnb1zyvkhqr5c3520rhwerntdxt2az556fwqg3s6q5	49999.87300992
bnb1mmhmjqsenyy2xsa3eefqff73u8s3kakp6exfj7	49999.87300992
bnb1ke0y99g8p07sjfkpxarq8tnxkwnz2aeq3rgsh4	47335.587831360004
bnb180vu8m9zsw8m9ty4qvjsczh5rlrtmzs6ct8mx3	49000.31172192
bnb1mu4dge3np02qmxwjcvvjcg72czcm3pa5ax79gr	49132.374970879995
bnb1xr5e7ep9pfflp4gy4e6md0mk986uw34awg3ktu	45725.3854656
bnb1at96vtr6jcllqp4c23z29ch4drwemkfyzgj3th	46455.97389792
bnb1hwhwyhjya400zd55c6l95s82s7g4xdtapaa8v5	32000.50028928
bnb1gtcvdjs66ayk8ftal7z37qgk863s7wyhzl3u3x	48262.45375296
bnb1nx073cvdh4jwwp0k7q04mw6c6m4re86m2h2qh8	47779.0295664
bnb19w8ac9srzwa3mcne6eh2vkvevgg3fumj55wdyq	48164.31500832
bnb1ylumlnyv3p5220zquynzrl2qxzvyl8j45r7728	46676.483176
bnb1p6djp0pww5wtr3rkuxppek56pw2c2f9ae67cj5	47044.80636576
bnb1q5e903ewlaaekwr6e2m9ptyqay0l60madhm63t	46638.92390336
bnb1mw0dse480untejufrkfgchkn4y55uqnpqt2sq5	46047.66825664
bnb1wfkdaekv47thqa9skdqsdu0jkgepx9kwvsed3f	46336.02654336
bnb1ln8gpa7txja4fv9wk57rdnvlp5hqcd9mjyu7vr	46149.4417696
bnb1wckqz9sjckkrdrccq8qapeyuf282xqjxc7puzg	45898.64275552
bnb10w94uklqzmf3ed70qw8xt729kvd6jlrw2fkqme	45509.72254528
bnb1envrhm4253rlvme6ymdcp5t9txnp8xa2mqdd3x	44149.107604159995
bnb1exnnf7lezfy53vf6q6lsaze6lc00ctemaq269k	44149.107604159995
bnb12g5qm6vt7glnw6hlyzd08zjl3qppksaurd7h6s	45679.34506688
bnb166fw6frtj8duaatgsulmy7wkm40484ada7j2pa	43980.696672
bnb1kdj6tm53lx9st7zzuugcz3amcuh60cveegh28g	43807.43938208
bnb1shhwvdww2uuzt4s7wqjswmltw2hlmru9t3n69c	43672.95295424
bnb13t833dp6pz56c3ut0adt8a7u7u3j7sjxn7e3x0	43527.56222144
bnb1e5ewkvyh8e8mrmrr5w65kvtd03zhvfuw8qsfuc	43305.84135392
bnb1vt0sy6l4r72ua9gjynky03um3gux8u0s3xfvpm	42798.185378559996
bnb1vkhuxdn49ukgxmshsxdcnzcg0mdmw93shrhss2	41247.35089536
bnb1kfmhmpmn5p623nc0pr2a9u4n586h37fkjv42mm	42645.525109120004
bnb1dw2p9e54c4hvdh7y0cl7t29gjnhgvha6ndhl73	40887.50883168
bnb1myzyxl9c5hxvk62pvsn57s3w596af998y3lxwa	41418.1850064
bnb1z8y6sursld5eq482kc07kk4j3najm27960gqmu	41740.467797440004
bnb18x9tr8garka4zsrfjq640tlegw3r4a22y43etw	41557.517792
bnb13gmnynvlkxkzpnpfttuxsww7kt2jskp6wntqv9	39998.20218272
bnb1pjexmh4fx5xdymlpfjtzvl23xnz00e6l2f79aa	41402.43434368
bnb1dt4482mqws7lx4t63v88a378x2dhmgha602yqw	39999.41377216
bnb1ehdfr4lt60adtwa529gf9va7xscm0vg45up42r	40075.743906879994
bnb1mgykcx8ml28mwc9hlt07estqmw33ket5vvx2h7	40612.4780288
bnb1knem66l99x8yfw5rmyd8gn07vqfc9kcstxgz89	40497.377032
bnb1vudr77y9k2s0yzj8aaftcast968zsncq9k8sw3	39042.25811456
bnb1nyme79kd0y3zxgsxldn3pxp7vg0atnvhqkfjjd	39581.41541536
bnb1xa2lhe0yfef7m7u2vgjs72wpk0vqf599h6k7pu	36243.48650815999
bnb17gxece0k4l3nx8e0zqpxqyftay8dvsz5hc5pry	36860.185533120006
bnb14rk989c4ufkc3amf0hm7zae9cf0m90adnds7x0	37533.82926176
bnb1g70pfy6m5f5pvxd5du5aqtdgvxz2z7flln96lz	37516.8670096
bnb1ve32eqkmtzvu247vk9y6e8v34n8k80fntm4j95	37805.22529632
bnb10x2za2thl97wq3cdrlnpw4n9s97qdzjnjjh2vd	36163.521605120004
bnb15kwejq0hv49w7z7zqvgjjslf0tgerjxuwpj8hf	35878.79808672
bnb1ka5lalveaqafq32a0g0cva5nvs98mm3v35ufcf	36596.05903520001
bnb1pm9qgxhm6rpzecx9ppczyd0hmye37f8u7gqlc5	36472.47691232
bnb1v2zvptzwx3pqj9s2tt0kzunucd6pdzysqwkzk4	33083.66124864
bnb1qgkwn7t85cavj9dtyjl54qhztd5sdgzcgwpxh3	30715.00389344
bnb1y47uavx0kzhq067aqankmsakhrq8frdm4huf58	34500.009304
bnb10yhnlcev5f98q6udmzmfl2hmgq0vmrun3evslv	32050.175456319997
bnb1646yxaa8qk6w3u8gyprecg9kzfwc8ged67w5pm	35086.41859296
bnb1l7g7zd58z04ls6f2n7q9y4dddcv3yeedg7umz5	35018.56958432
bnb1dh3js22qlk30lfc56lx2qx5darutdp0jqnjwex	35000.39574272
bnb1vwsg7n6akl3cfu3advpajcxpgc42kkpdxdyns2	34531.51062944
bnb1p06d5wsuuqsvl4s35zesumpn0svpynluwmymjr	34301.30863584
bnb1cfqzdqcuskrx3dm3g6atnrdh3mzf5zeku3l95c	30000.16612384
bnb1ggayvcanas6wda9wfgqd2c38w6qxn5nvgcc2dk	33671.28212704
bnb18jlkedpvhne8sqgx6epqa78vrj7lj5sue6w957	32725.030774400002
bnb1dhtyg5jgvw0j9jw37tstznyz0f6kt9epzyq2sp	19999.70688608
bnb1h7p5l9ft3lu48wexad83hnqc5uk7rgv44yplxl	30344.2575248
bnb12ppe5t47pnt593l03zxw3zu6d2gtvl5m02fepn	32680.201965120003
bnb1v5g0r3marhuktlym5en2rxgjx3hrr6a6yrmvnl	30420.58765952
bnb16es0vrgv6qa4s8ld93xayzsyqet2xufclarmv9	31210.543974400003
bnb124w0yzh5fl82pjkcs6vn8khq90zsexmeng9qn6	31537.673123200002
bnb1vmqc0unyv9ra6sshtuqq0hhqj7k4qwnt46ewhd	31662.466835519997
bnb1rx4a0grmnf9vjljal07cgrjj385yr492fwap0l	31444.380736319996
bnb1ykja4rnkrav0xlcrr5y4mczujm7f5ast95tv6h	31153.599270720002
bnb1h52t7mmkhs5dt0zqrdw0gstzvj9vwydyfse74z	28154.91540672
bnb1375tzqwyjptccjlnylzkz3q6zslkr98y0cj48h	30696.83005184
bnb12glc86hrv6apa6s4wcss8y99ddzzyjqzm6penk	30644.731705920003
bnb1kwuj9puxjjxp4tr5wllekcdcn0ce0l69hfv7p8	30236.42606464
bnb16ajuf64zqpkkw0kg9g5e9pr508egnech4rrl6n	28719.51608576
bnb1pnrjfsmwqd34xlknp0wx8qd6qn5mvmaha2h86c	30026.82109152
bnb1lmzd8qayljxv25q7nljar2rcynulvq5dzt8rtv	30000.16612384
bnb1v3wket664enqfya2fsk2gl6n07s4695p4vvmys	29721.50055264
bnb1yyl8kh2fk2mwlyl8m04ycyz709368j8q3mdcew	29696.057174399997
bnb10rv47gyhz7j97kakaypvgk26ymscad2jp2vchr	29626.996576319998
bnb19dxdxajfz0ry3g3peq3gaj7k5gls64qhv7033g	29299.86742752
bnb190pgdfzsgkr57scvzqaxvsgus3penn2e7pt5lc	29595.49525088
bnb1jp2haw8c635wufu6c57r0guk57nymg87ml4ll2	29549.45485216
bnb1x0fysej2vw3ghmly4huf693g4w8jgmzdsync05	28001.04354784
bnb1xlmuwu99yg3vanqj4xfl397p0ngfepheu2wfcx	28907.312448959998
bnb1z0v4qlkvk86pec968dsesrkapud0gzdkdylnqv	29142.36080032
bnb1eqr56au9fzh6d4tjvsvpk7m4rmt0vusk2rpsxq	28124.62567072
bnb1fndp0jmwft2tf4hlx244yvunlch665mapga8vr	29061.18430784
bnb1yk07u9ytj73p4xuem8zpc44k2eeat2j2xkdeq5	27459.46306816
bnb1lss0l32lq9cju3ea5jwqqncrd09g5tnlw2uzpx	28244.57302528
bnb1plgrnrmemjap06lc0fs5gyndwhv3m8dvef76pp	22743.956967680002
bnb18adfq2ka9nn78xezxtcxxj50m6a6st2srm2agk	28094.335934720002
bnb1rzqjc59daekxenngdlpdpwju5mlmqv6ljd678h	27778.11109088
bnb1k8e6s5x5vjlvmghr0w90xjfc5cek0dq80fj39g	27882.30778272
bnb1xnh2uarjk6hlun7a6h8htq86j82x3rpmves08e	27240.16537952
bnb1rm7aht9ej2eaefrqqn3gq98wvnqh2zns5ttmkv	27646.04784192
bnb18yez6ept6x089cukeqcj4lnfpvwl6ca2x67jgu	26725.239867520002
bnb18sj7alq4xjwpm65swjk4a7acnekqymgedfe3lv	27066.9080896
bnb1z426hfsc4fq9ssu426vfnsz2eruggynkwnla6g	20760.5850544
bnb18c0qur6s6adayhhfgxgyy07cltrsmw64y38dts	26465.95972736
bnb1vf8dfvngvkyzqxlnl33drwccppv9y84dy4lrd7	26887.59285248
bnb1mfge43cjpe68sp9kythc4vqpyrpd9hkyr2cjv4	26797.93523392
bnb1gymht9ffkxxj2ecdw5epcx6ua5nslr3mnw2u39	23829.54110592
bnb1qs8cq2t048rc5lw66vw79pn8zw6pvyagrm56ln	26492.61469504
bnb1whjp9gk9zlpjjve33r0y7w5lfcswtyp4m608wr	20446.78338944
bnb1pl65p034vwwz2rd4gft6f95tqdvdhsevd7lxcj	26640.42860672
bnb1nq9umrklt842n72f4vundl9w9fey04wz5q86yw	26332.68488896
bnb1348jr4jjmjrdxk4vtglmzs7wect9nhy8lrcxpw	25558.479236799998
bnb1upuy4dfemc2gechyaplaqsa2qa7gp0g4wa0ae0	19999.70688608
bnb1dxm39zmw302dxqf3888y729wlkpmhp5wlgv4qc	22271.437086079997
bnb1xk2049agff679pnah2u9z3mtzx58c750svw6k5	21771.05064736
bnb1mn4wl7fn78a08f62ctxnt6kl2jgkrra9mwuzsn	23168.01327168
bnb1x0nz9hjxy4x4k23v6j7f3ts8eznq8gdzp7d04w	25264.06300288
bnb1ujvc6tyma948zgnwxhw8c8rw34nhlv625al0ec	25048.40008256
bnb1jhkjkcwp72r48yenn5zq6pfgche4j577tlh88z	24999.93650496
bnb1wenmf2rzkmf987ds9glnjm9r34cgmrtcnnh2rf	24751.560669759998
bnb1erwqf9s38l9dely83g50f8y2j2jmpm4v3alqga	24626.76695744
bnb1dxf32yq6lgx33zdrexsapy05f3gxqzumhetlny	24430.489468159998
bnb17umjq3zskuttsewqxl0s6p8aj2syfwhw0qxwcf	24184.53681184
bnb1j0k3fwz4ujqjyhmgxey9a3svp0afjc0ck0rf2y	24200.287474560002
bnb1yg7xjzqhq2pcs97t0axrcskq732pvcsmwm6ac9	23791.98183328
bnb165pnwqpq55h93amx3a6gw33femcp97eaws2j9e	19999.70688608
bnb16znr4gq8a89eg40qzkvnp8vr30efxu9mntgykq	23000.81392896
bnb1vv0ms2x6wj55h5vtlm5p20vavg9zr8s20n4cal	23372.771887040002
bnb1gdqcs924qjks2rxyttxls2s9dnkkncu26a0se4	23317.0387728
bnb16k475042gh550qwn5re3j7wfc484c743cdns7s	22838.460944
bnb1un9e99dlc0zmfajnm8f7gwdd9j97suxr9fxe59	22683.37749568
bnb1sh8l6ry4updm6lrwxzeng5anqdumdtzqe7j5xl	22726.99471552
bnb1ftk3vy86790r2qtta6342zn6myehla0jqqjjqw	22724.57153664
bnb1jkjufugqnvz8llfueureuhsv46z6jwj523fpr2	21899.479128
bnb1dmqq9k5dghc3992q45wsheqq9wvjeumszpldx9	22358.671525759997
bnb1rf02c5h6m8e95yx6rs3wnmr395gj724y6r6zy6	22496.792721920003
bnb1tkfdgcn0ccuyelu3zf98a5p2g3pj70fe8pxrgl	22353.825168
bnb1hz8f8ejs6uy3fdyg99fk38pkmm3grxf2n643y4	21594.158589119997
bnb1m35frlx3yz2tk740d0lqzxg3tlejqzhgcwm2qr	21590.5238208
bnb1ynwgr2jv6pjlhpx4gj5p5fwt9jjp7mdhvrg84n	19919.74198304
bnb1rt63zl9ugf4wgax3dv9jndnvzeqpjqrc6kxn6d	21526.30958048
bnb1emjhh8en9mcy2alclfhasq8t5fgl3ulapymumx	21433.0171936
bnb1qpwpuap3h6sdty960k9kjugne0nggxpwgmuk53	21059.847646079998
bnb1u2ccasfwuae40wht4zr3k7gunvklu4vcfwd052	21206.44996832
bnb1kqm2ecnxpydr5hpcv7x9rpqzv7zxk2gl6y6454	15441.7074128
bnb1wnz7h4vze9z7d6fve4fmvnelu5wvygg8rtq052	20792.08637984
bnb1kqv28qez2l0yngwsz0x57h9zmfckv2xtv8wwlk	20821.164526399996
bnb1ryr84ww8a3x55h8zqajexm0h4rvekf5p7yv6yk	10080.424140800002
bnb19nh5z6h4cllcdg8rp3jm7pdnlweu60h5l9zsp3	19999.70688608
bnb1nlun9rtdcyerg3vqu97mfcx3svdtuset58jrzm	15499.863705920001
bnb1ma807q85ms9aa2upg4hmha4kjaaeahsl0gjnpa	18608.802208959998
bnb1n7w32q9ehdcz92h6w7rt68hqyvd5n3fl2n7tmw	20122.07741952
bnb1cdgkckwraeuexurw4kszuwk0ra7l8cued5cttt	19907.626088639998
bnb1qsea86cyf5crtsrngdfhwk4xm5gvzj5690asjm	19777.98601856
bnb16k8fuj2emd20zh6qch5e70fkgky86l5vyvg2um	19488.416142399998
bnb18rtwuwfsfa4mjlt0v448l5a8p4yp8w8dmy84c7	17900.022386560002
bnb1uacq9mwuyxswfr03vtg57ph77lj39l8dzpgzcq	18104.78100192
bnb16eh2flx9l6vfmjx9egh2gdkhtp0g65fxyaf582	19292.13865312
bnb1rjjx7382fzjw92chx0n5pcs9gvd0c44tltt7qf	19286.08070592
bnb1tkgp8ggvm84cmqmczmt5cwqpwxupr808jfmlnk	17880.63695552
bnb1z8cxmte8tfw0wr3a076s2vspurk99ads4dzzca	19117.669773759997
bnb195x73dfsdy5hksvwd97mhyjwarsy9jdyysxakc	18785.6942672
bnb1gd9ejkln27r6lt340usp6vk2h6hmgp6u924lh6	19081.322090560003
bnb1prdkexdzkr5mhw0zw8nlysgt7wtum0r2eltgr6	18448.872402880002
bnb15unemd0e87ks9usnv2f2phlsm7yptv6zql7ux5	18629.399229439998
bnb1pkhgklqs8zt5ylcdp6p0wumsqa5ackqj5hsfkx	18395.56246752
bnb16tvezd4v32eze76vfpve64s4fka5lfhcuvdy9x	18531.2604848
bnb160fxd2ngr4xd8qcrundqvccl0vx06kwr48g4m6	18290.15418624
bnb1ju8z2jt30cmpm6vllkck4lepjs3llh8wc35vjp	18270.768755200002
bnb19rcldxq0qccglcyyu23m43tsv57txsp4ugrjpe	17614.087278720002
bnb1kcu3ehagg4kdexfsmemv5d6xddxsg3jykd4hgc	15853.6478224
bnb1nudt74776dequ8lxwwdl49j0j362krqglae662	17792.1909264
bnb12ecnrm7tjxkvzxvrg6udyreh2550tjw55kuxce	14631.15407744
bnb1nt08gyeqpaq23wwt70652q7qxsc7ue6mgphdav	17380.2505168
bnb1zv93hlu96jeg6k2qxdrwkvu37f4ylgy9cpt6dy	17480.812440319998
bnb1xplea76hhgw22yexp0qjdcer8ej5ppvrjcphtq	16867.74818368
bnb1r22z3r30899juyz682d6q5qjcdg49nzywrs60e	17014.35050592
bnb178ffmj7ce7a7we365fc45hgnqk4c9wte5c8qfv	16963.463749439998
bnb1nhsxkz3dnzyqa8awr365nw6a34z2436wdwf4zp	16836.246858240003
bnb19pdp30d8a8k0rmk6wn44e8x789nx5sklrzv65t	16350.3994928
bnb1u22vyjjx6v4yhy70n8e4hyl32wym6dy8tw62zj	16723.56904032
bnb1x4vn6rn6rujsqd2wnmg6exq900jv20rqdfl7jt	16581.813075840004
bnb1rugk96uaj3h5t6t7nc7xtqzx8qg8v9he90vqls	15684.0253008
bnb1rzzr6ladwumz77wej6r59wvju55pt404ck7l80	16561.21605536
bnb1wlhvcgsrn54jr2w003e9m6jwyv3c07g8lwav0u	15393.243835199999
bnb1077kxvcunwugm0jyh824ugasa2ttl3vkxp2wet	16352.82267168
bnb1g5drx6skah0rm4ejefdfahlsyfkrneuudjtr3z	16247.4143904
bnb1pq975jggw0j9n9v9xzfwenkx0sm0ywmvk0ppsr	16116.562730880001
bnb17c2w4r83qwgy3vh3v6t9fzlxxnw45nkx7062qz	14866.202428800001
bnb1kldfyslphmpn70frclgptncfjyf0pyp243fh5x	14801.98818848
bnb1g3e3ml360aj5c3tk68x4x4jgj9676ruqejkfxa	15514.402779200002
bnb194pk5f7asjt4hm8ez6hvsvxzgeurf3qzk4cneg	15350.8382048
bnb125nk0gzl5h40xjaferzxq4kmww4mzej0ee8yvg	14495.45606016
bnb1h066plzq6xr5v94jft9laqys0afl7fdeg4h3px	15192.11998816
bnb1zwhwaezlv3mzs9h2dcjuna8vjexw6c2s88yx29	15188.48521984
bnb10fg8z9dumqhmfhm5s4ghyh9che07hplvk38k6t	14947.37892128
bnb1dk7my4lzjg0zu5hwy40cxf6rq6hajzykyj7vud	14669.92493952
bnb1cmr48486xw3hda63gygx4wkvuvt5yzecastcwe	15043.09448704
bnb1gvnneevr42ree4ylsh5sd2f3cqwrk2kkpy02j0	15000.68885664
bnb14dfljrfgklz47gvw3ncmymnlgck7rqkcrgl7lu	12487.85235808
bnb10hhfeyykqdj9h6le4sd2r4r3pcey5sjj9exj8z	13772.13716448
bnb1rfv6d7u60ppkw6warky3qj40yqd920kyt7aghz	14170.75009024
bnb19e2l574980xrsj52fj8mvw3xzu95743xg75ml3	13999.9159792
bnb1sk70g9c2mm5rcdqqwlrez35ethhxgejjelgrlz	13528.60768704
bnb1jed0duuua28cnd9f845kdx9e9y0h7hkzcmxypj	13344.44609216
bnb1rkrkr7gjpc5n3lwulqmdrvygup9zyhzy799t3t	13947.817633280001
bnb1qyl5m0zh0a9v7zkgm7xlrzx3jhrnx3vn557nv7	13826.65868928
bnb14hre8yganfdpyq9j5px7mfxc4tudsmkat8jzze	13603.72623232
bnb12vqfkhz8c80x9fyusmfxgcv3vf93d80xmvz0ad	13568.59013856
bnb160lnja6l0pq6xxcwgar25yesldrx8xsvl52jmy	13380.79377536
bnb15zf3vqn8r5fvd35z89w6qkgrymq6t36kdqjdef	12988.2387968
bnb1qk5ugzxcavh2z4l9ayru36xclnjp4g9hnx4twv	10200.371495360001
bnb1kjsfs8hpc6fwln9fn8enyzsw97s4n0z7fd4t4q	13282.65503072
bnb16dclws769493quc30tvufyg06kjrtkl2cux5tp	12721.68912
bnb14jdt3rxytmk2ul3mgslrpfzefazlw4esljdc6f	7039.334646400001
bnb16fn3sdt558xa3gjhuyyhwmnyhezhtx9f50w9x2	13033.06760608
bnb1th49sgwvnh38ch90jhxj4zu0ql7hfq4hpmnk3f	12464.832158719999
bnb17h2ws5j6k9y36dq2r2j4ut6alzlqpvslrxer0y	12781.05700256
bnb13xayja7mmwxzznledqsddaclfahdy407m434ux	11649.4324656
bnb1u60924l08dq70tven5dlz8n60m6an59ksyf80e	12512.084146879999
bnb1fg4s0udm0vxlr62czepc560qvkm8u65xgd06zz	11546.447363199999
bnb174ksd655k7qzuhv84p7h0uzcr34f0yl8fwtyen	12491.4871264
bnb1y8xazlf36kencpsmp5mvwwhj7eepfkf4ztykea	12146.184136
bnb1f040c8he9tswy7qckn6qnttnh239uyw9hg8efe	11965.657309440001
bnb193902zchc050qa752payuxavl3zegpl40nx6qe	10800.10826816
bnb1cj6kehr2zn0nukvsmrfmxqp02lsf9j9u830anr	12021.39042368
bnb1q088cl283vhx24vquj9uwytuevxrz98dq3yav4	11999.58181376
bnb100cv83e6egqtnav9c08www3y377uwhx3gr8um9	11243.550003199998
bnb1976xg39yru50dqmwnk68ju8745fl97rejyjvc8	11415.595703680001
bnb1uhvralzp63g4tcmnk5mwjsms30qh3heu8p0ngz	11797.24637728
bnb15antd35tkyurm78kcrkhnf06z9nsheczqtw9sp	11724.551010879999
bnb1dgdxwulcepwdjdlmvx2q9cz5td0tdklqyuv0fc	11720.916242559999
bnb1hut9uz7kjkfcgm7p4ww0hc2seack3mf8quwy0z	10681.372503039998
bnb1rut578s59pql883p47k8hw0w09yujveaw8c3dl	11636.10498176
bnb1hsakn8w2qu6eud9dfang26nhz2g6h32psh9ldn	4480.45774912
bnb1jgakwh49wxlrk5y2n0hwyun7ueayszn4zp5j54	11620.35431904
bnb1pp5szct76xg9424x2d53d37kzsszssjsl8f4ve	11575.52550976
bnb1sesdueuw2walcpu9tkt7gcwfnnls9tx68s5l0m	11128.4490064
bnb1wcjgsu5u0dfmu3v8gf0eypzvpnt0dxgggx5wd7	11398.63345152
bnb1n7tx92khlcrjj6ugpehnat72kmp47umk68gff7	10968.519200319999
bnb1rk9tl9wyu55sk6x4nd34hg5f7q687q4q5c2ml5	11447.097029120001
bnb1vftev5w20zs50vkh6tu99yj5nkz24epm0f703q	11317.456959039999
bnb1f8zl50cggsyjtszm75lnskx2g563jvnnhjepmh	11221.741393280001
bnb1g09z0xer5w03gx0z4fu0rhux3sksxthsh5fn5g	10989.1162208
bnb1z2mnh90dl6y7ts55d5t2sn4tz27cx9k3wd9tdm	10980.635094719999
bnb1f5sn0qx0rumkguvzlt4cmn59k6a8fjl46966d7	11088.466554879999
bnb1tv7csvm6y0kdnfurkmgwat3xzcrhsqn0cj4r8f	10870.38045568
bnb1we2rzwn0y82hq7uj9el636khjvmrlng85y7glg	11049.695692800002
bnb1tw3rhz2n96c5mdgyf4c0y7zd66gmajjde2aq7x	10849.783435199999
bnb1zc346s48m9n8en62z0pf42nt2lef30prc45x4p	11008.50165184
bnb19gj3uepn5ra602dpvmkjuuw78gjprjvea6fjvp	10842.513898559999
bnb1dp2ld8ljne45wetssxsz6ufj7kxyw6d88a3z43	10454.80527776
bnb1k43qxms27d3jmn9vgdadlj8nzh0k43ckv644kz	10682.58409248
bnb1tdcdcvskw6077qdw0tlvlhpd3hem9ddx3pafwr	8280.00223296
bnb1730yvn53eqdnzpe0npg0xrjumeu7xhfs2xw7sv	10613.5234944
bnb1yde4crz8sk27xvxn9qkndealn5s9ydr4dpf44w	9485.53372576
bnb1n2dc9jp3afu5qeajxv0w6d9cj7vwhtx2k0p6jc	10368.78242752
bnb1mdn44ha6lfamtwfa96sjam65c8fagaw3xhqtg6	10356.66653312
bnb1ac8yph5pqj2q0h5wmtwqm49d8gm6a7gw5mvpwu	10343.33904928
bnb1q27dfjj7u5c8v3l4z0n4c8hatdex2ra6rujn26	10000.45923776
bnb1gjq5dqkwpxc06x5jcp58rg64kex590t03ucrss	10262.162556800002
bnb138kf8hffzye3fzr93426dnk8hz3f0v2uy3jws5	10069.51983584
bnb1agw54hev0het64h3q2zm8am3huc0myl8vs0psw	10000.45923776
bnb1tvds29m5pz7salul2q8hjxyl8v9cu728zfxaye	9909.59002976
bnb1r6847va3achrjxxtszpsuf8m2kjrzgyqzg8uk3	10035.59533152
bnb1kvtvftccvmn9mh2qhztvpsg0zxlf5cnd90z2f2	10022.267847680001
bnb1fcggj86uc70ddcmy6ue7c5fml4en40h6akrfg4	10000.45923776
bnb1hmwz4e37685j2tzlt8guv5cn4dtwz4vj2zmnu6	8788.86979776
bnb1y2cly5luyzjr7gt3d97etg4pmvvyfl3yur5ua6	9799.33539072
bnb1n0nqhy536za2j6szald86x4f2dn6g8fx5dlxcr	6119.738261439999
bnb1x9thgqjhty6rjlcd6vy3prugjpefmfwqzz4era	9450.397632
bnb1cqgyl7yvng7xl4plnve7h3r0scycm5yt50x4aj	9753.294992
bnb183gxx9ea5fqjgaxsfjjm8qc6pr4p2pj3e92gen	9715.73571936
bnb1fw0ut0j27gnk2flxvclrw25wh8m3vslgx96ug8	9252.90855328
bnb1yhaletwspqzw05agefcsh6ufr94h9g5l8trc62	8983.9356976
bnb1uj62c2et9pskuqzv49pvrc85kezlhwh5xwys6w	9295.31418368
bnb1zn6q4yu4kmp7psedf206pl24a36hctcv7dfgc8	9103.88305216
bnb1xqrsghjjcqcpv0uftth7klwy35h4nta46nexc4	9050.573116800002
bnb1laqhyfucgx7utlvqqvft5ftd7yupvn404md0f3	8000.12507232
bnb1v87dy28978et8vsrssrpcfqdn2v59y60nvgkvx	9044.515169600001
bnb178yfv4mtshsnect90y9twkt3tnu9wdfz2jj96d	8723.443968
bnb1hpsrt58fqqey6xrlhzfwphdpj2tw5r0mv3vayy	8625.305223360001
bnb16sydpwht9zvvehyajnctggy3dm7yfhkrqfvr55	8533.224425920002
bnb1pkww3q9ch4vr6uuy0525n3j3657qhhkpuwfnz2	8406.00753472
bnb1tkhxs7u3ws83w0v4whve8sxxvnhchk9cmmxchc	8767.06118784
bnb1qx2xkgmz27t0s7f8fc4xlyc7485ytr37rpely7	8764.63800896
bnb18gaw8eyxmswj0vxdtd2ua6xlkt6twjnnymw6pk	8507.78104768
bnb1upauy2lhuve94ys3ulzjpg5v60plcrapzpxldr	8649.537012159999
bnb1qypt5lw7c9sa2nvfw9cmdwwt9s5fjjngww3mvj	8599.86184512
bnb1xe2jn2w6gefd3vk0zalckm5pz4g95nc3sghva0	8431.45091296
bnb12m8awu57mpxx8jyaf2g20z5ynhsmtr8kjlmr59	8248.50090752
bnb185f2h2vu4xufth96p5r46gw0p0t89mljr00xen	8313.92673728
bnb1ptr5psyexlwk0wm50vmtc9zkselnxu6l2s70a8	8307.86879008
bnb19y0wrtk5334mqwcrtzqwymkeafl5vdaxywuxea	8185.49825664
bnb1h26y8uh7dzk74qe6y9al70975fyeql33muj0lh	8218.211171519999
bnb1n7vd2frs2lltn07r333dmgtl7574j6cedgsjkx	8144.30421568
bnb1sxg7389ldm09ep8jq5469583tducxr5chlkvzp	8000.12507232
bnb1ft0mvnap9q537dga53vuvju86vvdcy0gtcwy9e	8038.8959343999995
bnb10pcax8fq9sjqxu2n0q6p3yrngsrttzhxmkplat	8059.492954879999
bnb16g22ty7974vsez06phd5hy6ulwx7zkctzy8sds	8059.492954879999
bnb1uk4u23y34m7hq0grxz0e34jxeqc5krsgmkdjs5	8000.12507232
bnb184euge8a4pveeafhk4ytap95rdmf0lxq40vwvu	7974.681694079999
bnb1n3klj982pseatz8d5g85g2hg8k24l7d85vrzzv	7693.592944
bnb17rgya8gw4nnelnlt342y5cm6sylz40upjc8ml4	7894.71679104
bnb1xsmsnp7gu5gyjlzvzp4gzaxwdavhfpgxznsnlr	7198.05286304
bnb1lje7zp9ftact0e4mnpx5uw0v4uwlas2j8hwx40	7801.4244041599995
bnb1mes90fgapscq49qy3u8n7kteellnshyl2tz4az	7677.84228128
bnb10ymuac5fgyqppageqq95mux2p2aksyhhw72c4m	7625.743935359999
bnb1sf58t00clyyugv6fg5myrpnm6zzruxp5qkjzf0	7608.7816832
bnb1h0vd5tlhujy93aaegxp88xsdnamsp0yrwqfyv5	7406.44624672
bnb1a79mvkwf05n4nvdlvkk59tfmsx3valxktffpue	7513.066117439999
bnb1qk2e6dayp9g236s84s5dwgacnxsxz2a8h4kkql	7207.7455785600005
bnb1xwhs35kc5dd4tg0c7s03gl39qjp92wpe4xr92l	7141.108159359999
bnb17cv2vkkx9pp3r0ewgu8w508njd7j6ss9995r5n	7327.69293312
bnb1hduawkppfwg08rq6erpvcelmys0lmpfzt5r3eq	7444.00551936
bnb1hxepem8n9ztcv2rscxqrsxfkmmswnq0fe9hucf	7435.5243932799995
bnb1qs7cx62gdt89c055ftjnj92m06rsl6chgjx3xe	7299.826376
bnb1yyyhpp4q0apn4qeuyqqrx2jueg2c587wf8flf8	7236.82372512
bnb163h9re847lu3smw6fwyuej25auysvzxpu8zftj	3251.90605696
bnb1tqxmc3kkmcgyh5l8lp8a4rr5z9k8lcv6jlfmce	6967.85086944
bnb10heqljggrkhksuqdejtrq7vm37ek8eaqjhqaj5	6589.83496416
bnb1qcq3rfy9vwqglcg2022zv3v0x7244eyc7j974d	6838.210799359999
bnb1w5e6htsx55xf4fpp2yyawlgvl9rt06u40nh9dn	6817.61377888
bnb1avnu2rawqg2jmagwxvul662pgmjve49y7eh893	6889.0975558400005
bnb1qpqlczwcucdh2dajve4ftccwzpsc4r4488n8au	6175.47137568
bnb1p5lqhax6x74szyzz9ray3hkyepd7txznwsfy8a	6650.41443616
bnb1eanr7w0saq2lsxlnc9uj96m7j73raykmdpu5wm	6450.50217856
bnb1t57mhrm8hkakjr4ug3a7m8lzlmcdj8427cu338	6656.47238336
bnb1kdqv2rv7mneqe4mvstee6lgf0g62zd9899qz30	6194.85680672
bnb1rnxzvqklz5j0g745gtwswacknmneepdyv7ke3c	6639.5101312
bnb16jq8a6h24942j9ffhzcea3ly6s5ys0ur6tkatd	6452.92535744
bnb1syvmm0t8jner6t9zx6jf2c3lswwm90hutt5e4z	6500.177345599999
bnb1048mpkna4p40y6gmkcn63akw25x9xym7wkls0d	5814.417722560001
bnb1u833delsr9qduepw0vtkmw7a6j5f3wr9zt665h	5814.417722560001
bnb1c4z6fyfvmmpjk2z0dqfmue2chtfme5mhgqgg75	5811.99454368
bnb1em9nsygepjt5zx9h75y05wgjluz8ywgehhc2yr	6514.71641888
bnb1ly4lny4zk6na3xx7gzfaqjn5n4jrfl2ud4jf4e	6352.36343392
bnb106vex9cmmy2kc70p8pqx0z60kxzxe9uf7qxm09	6368.114096640001
bnb16ncamujv0zt3un2jd7yp7tl3hd3q0mdssdk99t	5814.417722560001
bnb1mmydtak38chkasc2fs9qd80g3kp9uccr9jfmvr	6110.04554592
bnb1t8f47y9jw78d79vlcl8qa6ldzgz562lnu4pvhz	6358.42138112
bnb1yngsvy7tgmamkf2252eujclmw7nk7phg5urghg	6330.554824
bnb1s90uykywr9e4e8yw49l5l9qdj97yftjyshaf3u	6318.438929599999
bnb1z6s0ax5l0q5r4t0ywmk952z926wdq3hvxapnfm	6299.053498560001
bnb15clp8sfv0jrdlfp7wcnx0xy2ckwk4ftt00sh5c	6122.16144032
bnb1dfcejdy6r0j0zqtkxhjl2r2zsyjagjqkk84ny0	5890.74785728
bnb1ljfdv5vqldp3wxl6yp8wfxr9vcm0yu6zyeg2p8	6248.1667420799995
bnb1xvvnlp02zz8lw02q5ay5v5cemsysm3h0lnqtxf	5606.02433888
bnb1ee26vcmxqpnjj2zkpmaaa4jsdx8dev6m3hzgnr	6180.31773344
bnb1cp3utatyj4rtzed8m06vrw4zucl38ctcskjqru	6157.29753408
bnb14q5pt2qkfvsx3h90re83mk6ve26ke7tr9u0y94	5952.53891872
bnb1w0dggkpmfzr6hfnukk3hm4zes02ffzzyjvyvcy	5877.42037344
bnb1afs3glmmxqmpq403p0d8xrwyedrqhn6u6gtjwp	5294.6458528
bnb182c45t9wna0jc5jwpwrexxa7sckr4jwaswy88z	5791.3975232
bnb1wrz6yv47j0mcjuanalpk9an0dfme0gxv0vgxgl	5814.417722560001
bnb1fnf9kppfa69w09vegvnxu7nkh8yw80yfhujr2v	5455.78724832
bnb1sxr28jlzup9gckus2jly3j2gtwkqg3msjy6hsh	5253.45181184
bnb13qf7ew7t9qk8jcpqw6n4e79ax9vwp2rmtn3nt6	5784.127986560001
bnb1gzzujsh6mpvc4w6zdw65jhhr2etecaxewr6mff	5078.98293248
bnb140ym0f0mvhusw4n294ry52hmtseaklkyffjml8	5700.5283152
bnb1frz9tjmt2jl2a2ud7elnhyz6nq5xgupe55htd6	5637.52566432
bnb1tnrsm5dfwt6yt5ejqyz0hmhpnfsu7w3z22x59a	5637.52566432
bnb15kargly2atr90gswqsv2weqcr90l3jrugxqquj	4858.473654400001
bnb1xen322z6kfdz4mrqhexr744c5khsw7uggh2pe7	5596.33162336
bnb1uupqv4wh2dermzkxvqftfwj9gf923u2lxf0ya8	4910.5720003199995
bnb14jntfdgm4eety8r83nf0g8hsrjydml7ud4gmv2	5453.364069439999
bnb1mmae0cp0f7dtcy34t9jsr37fdwtge66xsrjpux	5374.61075584
bnb1snyfc7jva3fysulp90jz46cgdh5twfy36zfcfw	5168.64055104
bnb15ec8kt6uqpjnf0rx2ertscyfmdq39cm65ms4aw	5322.51240992
bnb15znh3ahlmfhkf4zcmhdyh2zsa6s0xa4rt4hra9	5223.16207584
bnb1z73qfvnue5uams3w40yaczafy7pwv7f92rese7	4297.50774368
bnb1squ7c0m4gsclz8a3hm2xfl3zx7wqa966fhax4r	5000.22961888
bnb1q7jpkp88ruwy0r6s5klsszldj9jxw3n4jmftd7	5133.50445728
bnb1mjdse6xxfxxfl4z8tnmdhaxfj0vjlt2q0hdllp	5131.081278400001
bnb1tqetjwr6q40jd7gafu9vxj0k0f2uah4mcjgvfp	5076.5597536
bnb1zpn7fyv9kfrvcf7xuc09qmcqgsgwh3hm2mxfsm	4986.90213504
bnb1ptu34ytjmsjhtpds7qhq7gzgs9tp9dvxh8z49l	5068.07862752
bnb1wa2g4k72jh4vr9erjsmw68leqptet8gyaa3l8l	5000.22961888
bnb1s5lvqww40ywqyg3f9awawfrdx6z9qfc6k23rts	4896.03292704
bnb1w86r3c8s3h2gg53np4pwjxkkz587ywf2al4vql	5001.4412083199995
bnb1clgu43mv592tz0ccu222xygxy0r93asvv2whxt	4737.314710400001
bnb1qrme50srncmfttz8s6f2kxfvxlreywkr4ymtxx	4875.43590656
bnb1h9zxfev58qxjf435crjwc0jp4yhr0x3289j6f3	4818.49120288
bnb1j8zng9ev6rmct3wpwk9zvuxxx2neny3fspggfz	4870.589548800001
bnb1lrm54zxzq830l5t7n7w6w2vmus72j6sw8j00ax	4692.48590112
bnb1khnycprytrdtllu2kru4ngv65x9g8zhau05s5v	4786.98987744
bnb10fyvuev2f44hk2tet45vlxrnraf9pm7jankrqf	4783.35510912
bnb1wrx0azvjvmy94f437kun0wt9l84dj7dvle3ktw	4767.604446400001
bnb18vdvqp5h983wd9dzc94p5t9egrvt3acv7jwc5h	4705.81338496
bnb1mmgsjknn7sqxme4vy34mjmlfm0shkyknnhmcyy	4395.64648832
bnb1khffuuul9u0q4mxjt3la4qkj0ekn9phdm406e5	4435.62893984
bnb10pqd0gkpmpluspf2zjecdq4v4ft56vdx2adsh6	4682.7931856
bnb1rs3ddenu00p8p7cpw6vnat9cxz2qc2ayxxx4qz	4458.6491392
bnb1qpnvnvggzqv72vt6gdq88v9pcj3hzsxwlxyvtf	4577.38490432
bnb1cf0lg2k3fc2w0hzytu6hud0fe32unv4x729gwl	4297.50774368
bnb1rtjc5r9ufr70u9vv76sy4p64jgavpkhqla05fj	4320.52794304
bnb17dgg2uuvqc75lg437r32wzs636fwp6xkmf3396	4421.089866560001
bnb1vv7j6lmayly5qpamfwew87spp35z2ejueyt372	4375.04946784
bnb1jmwzglxzy77v00k4572rr4qehtj0s35uvrf9nd	4263.583239359999
bnb1zqewsml5wav2f8payv3kngsvqtsw0yj6jtqxzn	4336.278605760001
bnb1v02cvc3qcw8s36lchy39xfqu32r8jkmwwv4zd5	4321.739532480001
bnb177pjjc2v9f75h32968gg0e2xk7v7r2nkhz8ej5	4201.79217792
bnb1cje5z8ttc4z43ffdhr5q89ac6u73vy2qyfj66d	4160.59813696
bnb17j2y75n20s38u9afedtxhlfyzjh20zc4kk2nfw	4194.522641279999
bnb1fj20x8zj66kqnj8tpl877dy25ktxdx0zpnl5ev	4259.948471039999
bnb14pxmayh44ygftyzryfths26s97n9mvsedk2s45	4068.51733952
bnb1553zyg28j9pr7usjc7cx5puvu4u7znyhj4pmm6	3949.7815744
bnb14gx273k72u9rh9ue4ecfpeu0yg3lglt5cp5z7d	4047.9203190399994
bnb1ueka8sht9jghnpkcqcmtl2urc04d3gqmdrz87k	3906.1643545600004
bnb1rjk4yfq94y5dc6rs8jkxxqh0hpvldcmwhvk2rz	4097.59548608
bnb12f0p2wn8whmykymundfrkua6xrzvxhl5mu8dtv	3999.4567414399994
bnb1plrh8y036wnh722lsc6ufx7lazdrz7m66tdl7h	3994.61038368
bnb1m4mykwuvgjv8fea4vregpwwj6t8eyc7ldw0wud	3913.4338912
bnb18yuzq552dqwfmcur957n460zq2svksaexnwrmz	3999.4567414399994
bnb1qtl978856v9864s6npal57wu08tyn30f9npr5e	3984.9176681599997
bnb1aeexvc3ugrkrcssaa9zj3v4tg8z5cu4ynfqwzz	3924.33819616
bnb1cqf0dzrgs54efmzr070tt9j3cpgpe72l8mugzc	3797.12130496
bnb12jzza498kdzd7hxevksddq2m5f3f9ncjgfe6m4	3751.0809062400003
bnb1kfmvygat92s6dt238utqe2kv9xygvsvf0rwqxx	3719.5795808
bnb1rnmh3t8k9vefenx3m54pf53xstkesnjsxs40cq	3644.4610355199998
bnb1dqzvulzuwq5w8wej2w5mxw89py36p26qz73p54	3609.3249417599995
bnb1s0t2zm3ylhfjhzlh60euj6wz4mrm97d5y0r9gm	2329.88649312
bnb1xhckvydqs89ws7cpyy7g52e72aucyt5prwq5ms	3700.1941497599996
bnb1aqjys3p6yp4f2fl448p8rdm68mgh0hsj9dkvtk	3656.57692992
bnb1nr7vytg3w883unxnu0qnvdwwctn5qx6lqjs6av	3661.4232876799997
bnb1xzj58zac6w83qcv4ag5u057ya5ny02kfdl7t3x	3660.2116982400003
bnb1hph5vfw7ec7z6t6mccwk686c6rtm64gzxx8p8j	3650.5189827199997
bnb1qxz2sdq0nhctjnq702m555xwx508yvlyrcn0jn	3541.47593312
bnb13j4xwtn0puedu20n9aphmns2ynflmk5g9jtmae	3509.9746076799997
bnb13237ejj35shsrpsx4n8f6t7wm7f6msu3muuz7y	3467.56897728
bnb1wakmvn0ekfqwwucul6yfnesy8werhy7m0slfv2	3548.7454697599997
bnb1dqa5xw3ep59q0wd2lwzgvl4fe3auu67vfje7yj	3215.5583737599995
bnb1au60fnr53k822h3dt2lurtac8q75eafzr8nl6x	3517.24414432
bnb1kd5r9gddely33s3a8xug2fqzh5w9nwr5f43284	3503.9166604800002
bnb139cr9zurcygf9u39rvx7a2a4gc2mv4ux64sgg6	3485.74281888
bnb1yv5jphllhsalk6udzf9uxlmgexy23wk8kxvz79	3444.5487779200002
bnb19unjsczlfn6fezrkhad7yg3tg376ep97w23kgl	3091.97625088
bnb1s4cmttz0vlz884x7mqrc47wzm3d7nf3snxr0nu	3359.7375171199997
bnb1t4x3tykyugz9jxhtm93ksamqyh76swpp0hrj22	3119.842808
bnb1dxjvktecj0cxurc27s5lnena0fk30kunhxv33j	2862.9858467199997
bnb1ghn7dkypm3y2enrqjx827apvsrxtv2cz72mv80	3268.86830912
bnb1k6dqfm05y5jlx2r4afwyqazsmlqzcdxgu9p54c	3227.67426816
bnb13n4a3lkjl4u3ec7s3epxl9y4eelcrek0mz2dgm	3278.5610246399997
bnb19wsg2zjt5t2aytjjteur9lnch0ex306dfenlru	3249.48287808
bnb1lrsyxqdq88tk9h29fu6g33837an4cdx39xv7p0	3261.59877248
bnb15yt4ymqgawgngvg5r98kr0v3qssqcvhqqpsx5y	3203.44247936
bnb1tfu4la3j3t4jfgk94kn4f6kkcm0fuc9r6geruq	3236.15539424
bnb198z6y8qndtxx4qskpr05jmkswv24g8fu84xrsr	3148.92095456
bnb1ugz4pnt724mvh369kun9eqdkrg6zytvfvyxjqg	2999.89545344
bnb1gnw6fae0xl6rrp2qzvyttfq7qvwv59almedjya	3144.0745967999997
bnb166pngqahg6sn2z27ztx9vrpv3nrdgahlfddyft	3114.9964502400003
bnb1wuh90k7d26dl7jaae36ze5y6mhde22kpej53yg	3168.3063856
bnb1z363jdf6zvyhemgccxt37y7rmk9txz0x2m4z72	3152.5557228800003
bnb1q6h5rpeaw0plfg5xtlqq4lkvyxr02f5fpeq8m6	2747.88484992
bnb12xacynyfuexhu2v95yvw2np4rpunl8d874m94c	2034.25866976
bnb1rdl8f6s2ryhqydmrckvzkal26v3dq47rzv5j8j	3055.62856768
bnb1j4a048grlyd3mq778wpaeruj63unyazandm0vx	3026.55042112
bnb13emzrfrljh50pyd4ua6lcrrkypwjh8x67tk7dj	3003.5302217599997
bnb1s5h9kmvevmkr26sud2g272rs64a3ddsgxf365m	2951.43187584
bnb1rf8l9hypry6q88mrwf46yff89a8fcluxw50gwg	2784.23253312
bnb18w97408dmz4gsgrg6e79svpy9tfyg8lm0qads3	2893.27558272
bnb1zg7venh02tuc9zdk0dkl88wlvyaskud93d7ql7	2924.77690816
bnb1zql5ltnlp5tuzen5pk4dd43an4ztceauyxkhpm	2812.0990902400004
bnb1vr8rjqq9deyuvd65y5758zkwlcrkd4xpmcw4xn	2929.62326592
bnb1ud20jx7f3kmx9608vpyfk3y849mxemp9t2wlck	2888.42922496
bnb1dpdv863strffwpldzamp8mllqp432e4p6d82yh	2557.66530784
bnb12qyay9w2fmp6qku4lqr6a5l8xkclt79sypfzx3	1835.5580016000001
bnb1xqc0tgsu0a54zrpkmtsmt5dth4gvjmv42xvw78	2459.5265632000005
bnb1xmvk5uxlh2csecnf9ppy7wtvcw5jutz6v27xz9	2694.57491456
bnb1xcmayyzgmnxmys60adkyd5uzfentes8u0alx28	2760.00074432
bnb1jzcdaw4nl6kp3vs2z6wrmpvkttdj96t7p5xznv	2699.4212723200003
bnb14rg9ev58w6d6sqjn08erzxy820h5003ad7emk6	2769.6934598400003
bnb1lcsrekgqrt07yl070d22l8q7ajuatc7jmaa4fj	2749.09643936
bnb1eyr7lxsjg0367zs3kwsw7zw8ur2srku3g4g8ap	2470.43086816
bnb1ny55md9z39kd0s73qtz40rfun0zwy38m865mqn	2539.49146624
bnb1vxs0z9pgl94me8tgkvzlg0eqm4ueqpnw33ergt	2541.91464512
bnb1jgk2maa6p5njc296k9m2jrfj3j5w9zguywvrj2	2312.92424096
bnb1dkwqzquwyrck6ka2ffaqjurreaxpkz3n2lchc3	2524.95239296
bnb12953mal7nwzc54wddzfg9x0w2etmw853pgw5za	2583.10868608
bnb1w4z85q70z4rcg48hpmc428aj90e8czzu79jphc	2340.79079808
bnb19dql40gzpym3lmwtwjeqkwmcc06del4j8a6pxd	2386.8311968
bnb160pjusqjedxmrzcfg8yj8hxryezjknlvfdgue2	2480.1235836799997
bnb1ta4uufm80a73e5qw2wl8gxe7npjjwe2aufkgzc	2255.9795372800004
bnb1rwqsjyp3wkk40ylyt0030nw5whu3nekvzknj07	2348.06033472
bnb15hp7klz9elx6eg5wargd2zljj84rmuha5clln5	2332.309672
bnb1vhxgdg8k650awk8v9d3fayvuratx55fjra8hj9	1903.40701024
bnb1wdhgtcyxtjwu2whnrv302jejamf4r5xxgs8njh	2349.27192416
bnb1prczmw9ev6sweg33ggl7ctmrq2qwq87cyk45x3	2286.26927328
bnb1mwntftfjchtfdty5sh4rvanm7vemryyz9xh68r	2300.80834656
bnb1r5dh7yvxn8atazt6sjcgu9jvahcgmmm3fffwaz	999.561288
bnb1t8jxxt69tpqj2025fxrc3aj4swh0mqu5asydgk	2297.17357824
bnb1ra8awp7hlmrwpmtqmagp89w0j2uv5625m5axmt	2258.4027161599997
bnb1t4nac022fxhwpz7gpwt5vvvjncmcwf73gda5ka	2271.7302
bnb1879h7dgn03l78u3836d66ljm0n5prrrsw9984x	2236.59410624
bnb1fhks7ldzcafh33e683hu870me95dpnu3kh5f7y	2231.74774848
bnb1w9rlg3dst6tq58y3zn0eampmdjwl7axnac74ks	2169.95668704
bnb106f95k2hgepymugcw6h0qxj550ld6kzdetngh2	2235.3825168
bnb1d2llfy6r8meh2efe7dx8n5acpk0wyq5pz8443l	2195.40006528
bnb1xdfnxqp9cuzcslkft39ny6rwzeulkx6lfk27az	2208.72754912
bnb1e9uxcsx2kerpm7fza34f20nsq08z68rjjx7pp0	2040.3166169600001
bnb16zks743gmwftphaw98f4m4mke2dtshdr2wg8he	2104.5308572800004
bnb1n054ad38a5p274kz0uxuvwg7cv78w3xmgve30x	2167.5335081599997
bnb1efzu5w8fqr3mdmhmyax3005lerekmwadtygnyg	2000.3341654400003
bnb1d4vkzqwutcfahzc3thuvqsh8kjdzguqhjrndpu	2017.2964175999998
bnb1lzvumkuhr5zavlarq2xnuncfm4hhgx49wh7v8f	2096.0497312
bnb1t3xemvj9ywjhq7vjdlzpafed0amuq9v5mmg5gt	2040.3166169600001
bnb1mvg8fw0nhnazpnswwgs5dln4lvdexgqca3agal	2046.37456416
bnb1ml7gslskcyz8yp7tqjm2aqyjjlry50map9s5k4	2000.3341654400003
bnb10ccet2wmyltj0llkugty0qyjdzmxy3ug02vlvt	2016.0848281600001
bnb1lre0y6f0apnfxzenan8atr6pkrnrh7w543sppm	1961.5633033600002
bnb1mr9rq7x3tjqqp8mgxe2sxak6jkwwc5xla32u3e	1072.2566544
bnb1amsjet7uwp6xf2xumv0ahgcyenaxdpnhug8rst	1690.1672687999999
bnb18y3us7fgqxavwph0fvqemnzjuvqkmtcc4k7lu2	1754.3815091200001
bnb1fmjccwaeqrwlx7u4fvp3qldh6gx0hqj7vfsmqk	1560.5271987200001
bnb1hv4gksf79y2z5znmgyqj8cfxy7qka5cxfls750	1734.99607808
bnb1l0uwgmzczyy5cl8vgwed5g6l0nj774lxts3fgp	1657.4543539200001
bnb1r26gq7pwap5kvvaddtrsqcez5tzr5pg58fvq6u	1659.8775328
bnb1slxfwsr9ex3tury8qp9lnsvta2cza34hgdtun8	1526.6026943999998
bnb1e6nmnnr7ft8sgzrr42h6adeqjql3rn5u8g0jzt	1606.56759744
bnb1tjryu0d4typp6j0k7qkvyr96hgalc85ea2sqjw	1549.62289376
bnb1k347q96j05mwy7z687xx2hdl6rnlnp33gy02tn	1447.8493808
bnb1wz8jf3lwwpdzc4p9cmst8d7wcey6ll5l0d32q7	1538.7185888
bnb1jgc7ssz8anqmf6dktlmy83kr7ar053qkf8nl6z	1533.8722310399999
bnb1dwxpxgc7t2yt0qznspf30x9ve4676rjg527vkc	1502.3709056000002
bnb1j9vqmqnwa88x7ewfk2g95w709pttk33aqwa55s	1468.44640128
bnb14j3qrp0vhkh07xqehzdfnpr0xd5207zjut7vuj	1333.95997344
bnb1cj729ys9x9xaghdanzfjkafnvyf3yw89k5qnfz	1338.8063312000002
bnb1uhw3vta46y6ymvrg8xsl2tnuqae5d4v6vv8a9s	1300.03546912
bnb1mvfg0n0437zgyyvhxlvd787s3vrdjzg3hv00ya	1439.36825472
bnb1c3uwpnj94r9tm6ajg6hra8rr2vqnq0ul60x504	1155.85632576
bnb1z2az70sggtsxy4ft8jqlae59gzn08dk8s82ttq	1384.8467299200001
bnb1qppgwudnres9wv9qfapp07x0qsjq9f3lkxmmrz	1413.92487648
bnb1mmxv67a0zmls0cnwpevcqjj7ryrqplrwtyccfx	1293.97752192
bnb1l38vlm7rwrgy8gx7yzp9wkq55r76vasswtv24u	999.561288
bnb1fu05hmv6zkj335qv6mpwjsm7kd7wkhyz2x5um5	1315.7861318399998
bnb1ydz8u4zdyd43p6qssxa48eskxarfcyfusdphy5	1310.93977408
bnb1r58tdmg7x2ly23pvm7pxvcwn6qmyxata62s6uk	1278.2268592
bnb1jut78n804espeeguqg89d9mwy5w2xu5plgzsy2	999.561288
bnb1gf8sy22prepvvcuev25ycjmkds67zvzg644tr6	1250.3603020799999
bnb1v6fwju5xgsgknw56u5hfwpyfyl0zgztqjpadk0	1140.1056630399999
bnb12lzpedec5p3325stlpny4feahh54zawywatqze	1068.62188608
bnb1vq8myp56cx8xm45tw3tsk6s75jsd89hd503chf	1113.4506953599998
bnb1vp798vrv0ceyycns8kp67l06c5sx8kqxzvs405	1193.4155984
bnb1lv2v2tgcmzhhk55v62gynxryvvvzymzjc95vlr	1039.54373952
bnb1034utk5uhgyu2htmlzsm8z9j3vvc5ctyd9tkyx	1154.64473632
bnb1t28tus7qgkqnqw9wem8x8s0ajs5geuy33dzv9k	1172.81857792
bnb1r8lkrtutlc4n0ttz0rzlfmlz2jj033lah5syzq	1069.83347552
bnb1xgrfng7metfu72cxkmxga6nzmajevg304h4nsp	1079.52619104
bnb1588p4lqw3l0z5w3mfwd9asqtugdml645r6347s	1108.6043376000002
bnb1mke80jkjzudku2qamcsz2399zczg3rqn9fftzq	1097.70003264
bnb1p27sdg30e7ls06jddr5xnjhzp9t8cmkld0303l	969.271552
bnb1jmwcsnkg68d3dexac4p3czctru324ar226mlg0	1049.23645504
bnb1r04p29xa834hckf4pnvuy22dxezm32tfl43klm	1058.92917056
bnb1dayvu3md66ncgh2vlpzyrl3us05auumn0lrj7k	999.561288
bnb1vr9tqw4lg6cpderfgyuqhpwzhpt4l2wl99t9yy	890.5182384
bnb1wjg7wh6p0uwfupj3xnk97mg66rtpdut4cevxuf	1018.94671904
bnb1h4uejj09xmncz27yghjyl46jgf2f5wuefpnvza	999.561288
bnb1c0arx8596ccduwtxykhnye2z6c2w8fsjjqj30d	957.1556576
bnb1nxfk6u9h887fd8pza9xtwuyxt0mpzmt5pgj7n0	999.561288
bnb10qeezkrd5n6dmwkhpqc004hll6nac0lm433nhk	825.09240864
bnb13036t9m592njcguknj6gngj7y8pmhung3uxvvu	900.21095392
bnb1q7jynusul9zzuktjsqzawfxdkl5460m4q8lahz	879.61393344
bnb1zrjnml3sxf306p3jaezt23xle5z2cy74wxr369	832.36194528
bnb16r23qz0u3mfjgl82vrql93j4jm0z9anwksejeh	814.1881036799999
bnb1f95r29xcwnhnym7mn2axnk5ycv4rl03d5qhpl0	670.00896032
bnb18q360q63yxc5etu47fhqcvknxkg2vtmrl4tw5d	682.12485472
bnb1s7h0jj0etxxhdxmx0gfgx5jq5yf67xcgqayxre	719.68412736
bnb19wh0dusjzvwxze7pg8dcxw4x4yg5fvtssssaez	632.4496876799999
bnb17kwk6esla0rk0yzxk80gmpg4xgk3rek796s59p	548.85001632
bnb1xl0x8faat7atrl2q2nxxjp57tvjctcldgmx809	599.7367728
bnb1798s60dxzyhj75pzfa7ms0ntzw2e2xa5dmcfkz	602.15995168
bnb16xwd37e32uljducdtf20ue44cgmllfywrw80lc	575.504984
bnb1p8rg24v0m62h49qu2c5mzkqce0rkmjnaevtg5g	576.7165734399999
bnb1rve8xzp032x9l08ej402jxakcjymf572klzrnt	451.92286112
bnb16gnwqqkhjfca7kwtx6fgzdyk7vvnznm86gde5c	569.4470368000001
bnb14gdkzdnx2ysg26zvgffxzjumydkx3vp36rdfql	554.90796352
bnb1dq2ms3k6497fgvrafusecugj7x25v4dgvwaqmm	466.4619344
bnb1hcpst9s56pgz63tesys7qvcgftgqsz254sxwwd	500.38643871999994
bnb1f9q2k2n39uuv3qa7rkhvavlgnqzq0390ckze54	507.65597536000007
bnb1recmsxkpzqcsh92jh9elgnhhyxkspqqg974w7u	504.02120704000004
bnb1eh4t3pdectqku4t9c03e4qsr9amgnyxe3tft9d	497.96325984000003
bnb1qveevplpu4ndyrs67x0hlder4tw5w6amcrlwus	474.94306048000004
bnb1vcls2wewc2c7cnhtqhxuapwu7rjkt7u69yy938	455.55762943999997
bnb1nk84xeyyyt35qjczdwfnjw7v6vd92crzrcww47	387.7086208
bnb13cs99gj80zdk9fge56atx7zsdltz47p035yuuf	403.45928352
bnb15fvnf4tyzl42jecggzvw0nkkv350xh86cwvjuu	399.8245152
bnb1k0ahjsk0dl2u4rpjdsamlyysvtu8aqfw9wurkx	394.97815744
bnb1syf0ue5sdaqvz8pnynmnnpvhj7n57dufnkgd9t	386.49703136
bnb1rzdp2skq3xnsf8s0ejjngdsdkgf6r9x7qjvkkw	335.61027488
bnb1n6uhwyz949x4zntc5drhsnjgtkyj3rwkxlzwxt	340.45663264
bnb14xwfgsd85v4ld95qj5v5hcrl28se6xfv8ywyxe	340.45663264
bnb1957ec68e8x9jlwe4dmjna4qm3wmsm39nx77f7x	325.91755936000004
bnb12yey4zvhzd072q6ds7h8md7nh5c6xdhz0amvqh	305.32053888
bnb1j8g4dyrnnwygwycmmgjl35dmqgrvfmsyewpchs	157.50662720000003
bnb1z03jwx76gsagq3wks97n89s0gs6fz2p2zm3npw	288.35828671999997
bnb1fl0zv0xjhvpg5sykcau90kz5aj7jk686ak0jpt	310.16689664
bnb167g0lwryhq788eg7u2yrqkmfst7gpkzyktqz5l	300.47418112
bnb1yag45vt3khzj8ur8fc5qzxsppczk6hnkyegdal	273.81921344
bnb1ja6m05v7ccejcwqdys6cz2vfu2q37pj92zrx4x	245.95265631999996
bnb15p4lgzx8r0lrvhpnl9cn2fhp5m0yy34y5azc5q	236.25994079999998
bnb1qqm4wjp5e2ksz5neuxtgpy8crr9xj6wylf5crf	157.50662720000003
bnb19rnmr90wxjsmazwgupau88avm6zly5p9370qqw	226.56722528
bnb1tycq26ase2h9zwuefd8uxjnkd9sn0ejev38txc	199.9122576
bnb1jvulqla3m60duttrkcq4yv8l7zfm8aly5ddlka	187.79636320000003
bnb1n4yptlvz8przxrmg55vmg3pxfsts8ckuscvtt0	180.52682656
bnb1a2zgjdpefqyuwwjx0n4n8sx6l3fmg3yc7w4ppz	170.83411103999998
bnb17cjygxq28a9urf5y32tz2d2jsy90dz5yvt0fel	173.25728991999998
bnb1xdtz9n75zddm40xr84h7g2zds67qd2wkpfaqwx	144.17914335999998
bnb1sj6vzk3vrvdnwwhmldxxtn0t8mzg0h5ll4cqgm	151.44868
bnb1u29z2cc5jyx3je85tjsquyvafyz9l367frtjvu	132.06324896
