5000000	3	90
4000000	6	68
3000000	9	99
2500000	12	98
2000000	15	97
1500000	21	92
1000000	39	91
900000	42	95
800000	45	94
700000	48	93
600000	51	96
500000	54	81
400000	57	71
300000	60	61
200000	63	51
100000	66	41
90000	72	31
60000	81	21
30000	90	11
10000	99	1