bnb1859r478lkzxl3y33uht7dw75r5xmr53gh543vh	4170395.75
bnb1ju6eehwue87tayz5u7pvuh33eke8l84dumf0mp	3487592.2
bnb1c3aezsxgh58fq2y2nwywxtg9jfgv2psyayvd7n	3498700.65
bnb19uvv83huy7925hpfmyu7974srxvxem2r4gv5pd	3269033.7
bnb1wt39r25xf6pg6t42nsx7397cwv9s7fgvp88adc	3196909.25
bnb1kwhutx2kgcz9wpnyx2lrwq7zz25ckwa0y4k3c0	3071733.65
bnb1xutm7nm9l46c9p5xvx94xuz08r3qadd28teygq	2990198.7
bnb1r6hpmhmjgmw240quzujanlt6k3nzqgt7ledf0p	2895919.7
bnb1wcqhkzkmp67f5c9qcspmmr7mddktj5xl5t2e62	2956799.4
bnb1zhpqqc35amhtmamhcwwynyyyjzg6z0f7a3hm8a	2753420.95
bnb1jccz63p5nufzgts9cdd0cxcrftgxaf9g29msal	2580319.95
bnb1sea7shprks76xqwqm4xyyzszuupnsc8w7dmd5l	2274992
bnb1nk9y3fdqj8vwg9zzy2ewxfkn6x430vxc5dj9uh	2208357.25
bnb1lnpddlgpwtzysgwmhfn5vcgfmewjxg0awg8d0e	2177554.9
bnb1z07wjmhpmnww98edpdf2sd7weauhl905jse34p	2096940.7
bnb1cpwrzcmpsdy5xm0yd3d6wlqlr506uawsykuz99	1843441.55
bnb13h88jdmfgu5mrd4yu9q23gtg6lt4nytwyaqdtk	1744637.1
bnb1devefureacvt9lhwlwshs3j5w78m967clghws2	1521859.1
bnb1mjpj7lvgymhz9vzkzc7vpt0q80cnx77valvpgq	1564724
bnb1grf3guxfrphukjs5gu8pf7e6jtxgq202ur3u2q	1566601.75
bnb1suua2l65n00f6r56n89sep7rcwe6yk8sq5pjle	1548018.55
bnb1dkfezulrxcmx0yg65fxn4cgnasqdkax7nqgmqw	1343119.05
bnb1mkjq25mes24edt35deue93klc0s633yzss95y9	1272939.05
bnb1q8l5auwwq7flq5vlq08fxxzurznv0v8m6gx0gj	1260693.8
bnb1t8mua25fp0pfu25z9np08nzn0v3mjgy7fvvl9y	1245741.4
bnb16zcr7p6tzfcnhlp2glehge3zm3c06wgfkk3ppd	1223523.05
bnb16a95z4chxq9w0erj9mhrkrkf7zt3guajxddtve	1205918.6
bnb174tkeu48hqd4dcky3vwdkl7h6q3aux9l4zekgt	1189037.7
bnb1e2dzpcdaqs9vxmscdk2rc7y8fxxepxv34u47vz	1155535.45
bnb1zzeux0hds8nqe8ng34uhvgsye72mjy8j94j5y2	1139646.35
bnb1xuz5rfrtktfe9zfh0z7a0ystmgy68fg75gfjtz	1111671.5
bnb185k8v8t6utwz20ngcdy3dkwl4hydg224nsjuwr	1106341.3
bnb1y3jw5un2nkyha8wy5tf7yavcsnt0grlfjs95qm	1108755.55
bnb1m6uvglhskrrpwgt6qzhrgdenqsvyt2yxk7u35v	1091615.1
bnb1dgx4kq72khej4z0hvve495l47736nducy2zjyt	1059008.95
bnb12tkrm0qhrn3pe3vnrfkt2vj0d3el5h5ncs3gh8	1055067.85
bnb1367fjtjcugtdyvjnlykmxrr7987zct2vqstt76	1039592
bnb13vedtsftqjywaj074dneknyr6adpxttrand20e	1033597.7
bnb17smatgucyky0gmth30yde38732vry2ujuuejf0	1004274.35
bnb15w49r6caypgklgm8phjep0sa2l4vdf5qleaysd	997082.35
bnb10hecw5ml5zleyhrz7xt0k05pf4ma7mzykf34v4	996454.5
bnb1d7p0hulh58tzv0g4x7x5y9r0k4qvews5cessnm	988760.8
bnb18lu2l78mlrmrukvs06kf4dmtnwrezme7hraclv	963883.15
bnb1h5lc8ynlum4jt2l33uw9lmmg202arwmda6r24j	860664.9
bnb1yws0a7fdk9l8x9mkd352q05xyrutvx5arkeura	903887.95
bnb1tua6uwvwk38nv9tcdqhz60uulk76q488qketqd	896809.05
bnb1e9avaj624p2m2auhxd44jsqhffxvp8jpcvf8rz	887444.95
bnb1ga9wx9jt8mkw42pr8t346206l7nk48a2sp4qvs	866482.3
bnb1y4m7jrvmvnsxhzghayyy5295gwfcn7uc9r0x4e	883263.15
bnb1u4u020f9tfxwheuz49knr93d3cyrmkaf9qjrmr	792246.6500000001
bnb1qew564y4av4n2l9wwy6n7nluy5glk05xqhs9gg	833161.3
bnb1u8jxqw7jylneh60l8sn3pk7kwejejyd8g7hphq	709187.75
bnb12tevktzcu7adzds0qa9lu0mx64mfauwudmxru4	737922.4
bnb1dwe7fw6wn6nnljd9m5ty293wygyh6uq9t8rdsp	696198.65
bnb145x6fvha7mgx2g5y45rx22qd2vym5cl405s5tn	673648.25
bnb1jfundmcdsugw490rewkrm0atejrlegnfarw422	641308.9
bnb1twa0h0a0sx8wm27mvpzggx6gazuzxakzm40cdp	635092.75
bnb1fc5dm669l25lznql5jlscnltjxcnk6s8n7sag5	615298.8
bnb1f4xl0jvnz04sdx9n59jtxs6w98weulnrdae93w	587129.65
bnb16uxqjzkfzcngux7nkkhzgztnjl8ethh2h4whs8	598075.7
bnb1azlzyuu27tdxjg874qr494247z6jj97dv3y486	597872.7
bnb13sy8qcfwra5t7ueh93xt4w3v7q8dg4mal8xmql	583145.05
bnb1pszusstt9fnctws87m3eewxj36jr5cladj750y	593743.1
bnb1z8s4c0g3qznfxkv6zwf5x5r4jn3pmsav4tuc4g	558337
bnb189p5gyzktj9u774tredf5t8cqelfg66segjx4y	498278
bnb1wq6fpuksnhnl6r9e7v8r2zuszyf9wn6v3awlw4	509010.9
bnb1mqm5sn5ydvl7p9qxw9rmrf48lgx92f3cn45zzd	402377.9
bnb1rq5z3k2e42nrsujc7w2sgc3glu46m0e48s2zes	495320
bnb1da9hxsw93gddhuta30lc3f2936j35y93gdqv6g	485557.15
bnb1gpuypp4f24hheupkxdrac98rzwtawwvtdwu0jc	436252.8
bnb1c0ehe7tlyurqhvrd3zx8fnafekhxe9m0htzquk	469533.2
bnb16p0sp5nlphcr9y6v02lan7z3739udvwagrg85x	447971.7
bnb1l6exfwglm575lh2gspp6pm73qumpfhl4ndq2t0	410423.95000000007
bnb1zk22tfw3fyl7z0wdmxl668y5qq70yvz84gf6xw	426962.65
bnb1vkw0rsjv4ygjd0cwczay6t23re52e79zu8wj7j	415831
bnb1u0fztkdccczgl4h8dp3qfjyq62an8d78wg8uqs	408059
bnb1dqr0qjy7v0srhr9e0g7trcjsdsvu8p09jf5n33	399531.55
bnb1sgl37zu6tlfd63gp382q5zcc4rnhyrc204hy5j	389525.1
bnb1n2et6zl8eag84dlxyyfugrk9d84egx5jp7djvh	385669.55
bnb1rlhp5uhsysz9qf5gq78kxgvpkfcg0qv0ldu5r8	385662.29999999993
bnb1zp9yqmqkz69tnrpd53dpjyca2zuj6usanup79j	376280.8
bnb1rpw69vck9txkql2hw8t80uxdapve0rlw6ywkhf	374079.7
bnb1regtphttn700wd2a8gk9u327d5are573jx6hg8	373959.35
bnb1yhenddk5w7nl3uuj5msxvl3pa5k3snmkc6044g	371455.20000000007
bnb18xhwea4hkh32v6en48ksfr45zcwq9km9hnpq7q	348659.75
bnb1am5590t7tev9wlp7hlrp2qsjp693p4f8wn699v	368688.6
bnb1kzrt44aqten9qd0mqlygcgtlpz3augcf5723rc	354752.65
bnb1va2akjq4lmy2xcaj9ljk067dhktty839xnufd9	353811.6
bnb175rv204cf3ywh3zwmwmg3j0fenltzlq4wf7qap	352750.20000000007
bnb1lgyux9fp3qnff6zkjdjknxdkaw3cwclyx43khp	337568.7
bnb1z5u77wf2x7ej8un5ls8304f75wm2erqgqk64pe	339527.65
bnb1y23lz9an6540gw0xfcryjznrstg32ksl024d7r	338798.3
bnb1zf7lpum3al3xewlt492cdgmrv3shd42dy54ael	249114.35
bnb1xyhmppadjr8v2npk6g6srzw2p3mwnd3ht9p3gd	320996.65
bnb1n9uyass9d86dedwxr4daal3vaeegnm0888nkjl	318276.45000000007
bnb14fhxm0scggqllvquc9e07d0emdgm86v684ltw9	315947.75
bnb1fg4zezx3w7k27l3rg03te46m9russws8djz2uq	261633.64999999997
bnb1cr9mqk287hl9ettzwh6ggewch97hxtzl3r9ntx	310862.6
bnb16dnnyewcyqmpn4ur6jtzsdlsf85v5x0pg7t5a4	307501.5
bnb1g8tvafknlpmht2p375jkm2al0xshq47f2uqs2f	307291.25
bnb1t360q7zpepd8ljpdtgvyav9e8a8ff2cw5mhwch	306630.05
bnb107lpz8zcxrqsl2pfdzm6ajnkmf0dshltuzxpmr	305687.55
bnb1kckre5jptlxwdrwjwruc93nh3tqh3y2m864hp8	303547.35
bnb1644ltagd7n2jx2a8r5x9lpnymcahpxt5wevfjf	257085
bnb1h0kn5gat05yhf2guvf7het7x8ufduzcup6hkqf	298936.35
bnb1ms6s0juntctw9rl95mv87rkhae5uu0mna9004h	298936.35
bnb1ayphwzju9h8yfsdd48srag04nxsyy4uzxrtk76	291088.95
bnb1ak7f3lp02zmtv4gm28ycp22jpz29euuwu9r9pf	290005.8
bnb1wy6k9uxe34tx3pxmwcpt80pvt2p4edme8045l2	213790.9
bnb1kq3x7h4tl6qrtgyvngzyynfl2825c5ejcjkzhg	279944.25
bnb1vhl95durh3dt3lx35raylv648ksljeze9460h8	271921.4
bnb10heqljggrkhksuqdejtrq7vm37ek8eaqjhqaj5	271237
bnb15q2654gzgylqrqz2770dw22ce4ve8cekekztqr	249114.35
bnb1ep3nf4mafemfrwlgyl7vksruezngweq3udmxj4	267581.55
bnb1qx2ugn98cw40ja9hrfh2e47rvnxsc2gl73dfke	261491.55
bnb1p949mdjvugak9wdw604923pgewnleqxn98nyx5	261435
bnb1dyltg4dr4t35ptsdh70jeqee8842upkz4hrc20	259528.25
bnb1skp2q4a05ed8ven2gn6f4fj30cl4ew9wy0ay3r	250844.2
bnb1h0mtvjg4zn4adlhm82suzj79egcnentfmngwzn	249273.85000000003
bnb1nckmzqs3tgaernfllxkw60v0cvj553dwuegz8d	239967.75
bnb1c2x0363wtr60quzy483u9xewgesqswpqrvav5e	245029.7
bnb1sr8cv6tdf4w0kt0a8auclpjnfeg23cjd7e56xx	243331.75
bnb1fdjtpuawchjx04eplt4ger4d9h3nsznjd7p0m4	241300.3
bnb1m5yy49sksmjh7j02vyfdnl7vjcttmk25kcl0vf	241059.6
bnb1eralzf9ku9ksvcdwkd67qf3ywvcz487p9h0frd	240536.14999999997
bnb1klxmfftml79cuwluc48cfrnul7dnacv3s7h6kf	236715.4
bnb1efeq3ryrnjqdn2vcydf5xghmcwz98583ye0vrl	232174
bnb17e5n6pcvj3vx3zzugz3zka83a4hwaeawtd77yk	230036.7
bnb1nqckk6repqcx32a9suu3dgy2hcml0ws4j4tpan	227494.85
bnb12vea3zezjht64rx56pcs7qk9h0w89e68vsmdgu	216387.85
bnb1368ewg45c523kmlnfrhldkeudtne9xglt23jyw	213754.65
bnb153j579dhk9may5hsp3x035m7s9ysgydvs8xjr8	208853.64999999997
bnb1qzcwt8vyhmgpxgncf69eah0n7znp0yvfshfhx6	205354.8
bnb1faa0qz8vraufemjn2yt9hevrjkk8rvne3nn2zl	203645.25
bnb196jfucq9mdjtw52td8a3f932w06m4q7udzux43	189191.65
bnb1xkqag4ag0ksqhyl998qf6mp2tjs95a494ve8ee	204262.95
bnb134fk6ywlrhaxwg9jzuyjhsj2sedrvy0k7upsap	202656.35000000003
bnb1ajrn6uqwp90jtq0eepm3gdjastspt8na8c6agu	200925.05
bnb12glc86hrv6apa6s4wcss8y99ddzzyjqzm6penk	199066.14999999997
bnb1fvf0qpwl42s2s234umszud03u6md3kd0g8mffn	197636.45
bnb1udjyrjhpwm0yq2hwmdf4acvc4r387a9v83vree	194953.95
bnb1637hwjptdrmln46v7vvj3d9mzktrxdlrsnqhj4	192923.95
bnb1v7p5w0euauelxtqh5w8phlw326wsrdtmt4vcfv	192870.3
bnb1qv3lehm9t705qt0mg9nzzkcymjkv8j7ymk7klm	185588.4
bnb1842ha4gdwxyzsy2836kvt3ah87vjy6qeqyzp3r	176311.3
bnb1vgk8c7ef9mczcs5wpkg8vqhkzpf47agxng5sl9	174720.65
bnb160308gggrcp50e5vfsdzq2fgjg23pjqs46zwah	173444.65
bnb12wfl47w364tuhc6pe9nvanahvwjukes2jued9w	174221.85
bnb134ajamqtcm38z7efqyh24ts9ca6meg0r9aalph	172902.35
bnb12ekm8lq8tr4wgrysfjjrd9raly57c6sxf4g8f8	171298.64999999997
bnb17uyy50cg9kkqrv4j26ym2759e4ezs6fyk89zcq	171097.1
bnb1tu4h2yeumjh3dyf26jfcfl4nv54rfh58yyhs42	170393.85000000003
bnb14lzrsuqjlnqazt728ruufkegs6qh3ty3npak3a	168591.5
bnb1y4q892gh6c0d6qwcntn7elen6xjtfz8gyc44uq	164109.55
bnb1a00n709j23e7wumc6puj9m0sh8g4u22nr4tdvg	154243.75
bnb1p0mn2sh4p72zqvzjaw8h0nk57s9re506y4j8lt	163119.2
bnb14ckaje8u95cgyq3zlwg7w8yzm0dhkv6gxsqgu7	156568.1
bnb1zhj3tq45j5882tjp6pet39tlsjmly8e4pgl5c6	159617.45
bnb10mtrckhp58pe5uh9qskpmqcq0rtrqhr84saa3h	158505.3
bnb1xptyg49k7dnwfyp3sqx6zvlnj6k3qwzsy0lyc5	124794.25
bnb1hnexk29le7qtzzmf0unzz0gr2n0mtc66mxexn8	157754.2
bnb1al44gwe58lda6v8e3wrkqqp3yv0s33wd52whut	154000.15
bnb1egx5rqs7yaj5au0npwhjgny0s0gpthsk2snc0t	151690.3
bnb1v427s8xf0qsl5px8fxxymm8pjqry29q7732zmt	149989.45
bnb102l7dnmw7pjr5hzkws6qhe7fatkvlqmykhmsyh	149471.8
bnb1awx3rfhuxwmne8hxl70pgxzsflht9zrnwt7xze	148590.2
bnb1yzlm0ar7a5tu336dak8rwq8wa22gr75hraqgt9	147942.05
bnb1ed6rx4nrwffkgssdyppmrfg0dcnfemtzgtu44p	147521.55
bnb1uxsx5ex2kea37wjfazcv6e0rsegkcpylg4kdd0	142089.85
bnb1vwq2as8p63jvgl64cxs73al04s7n6wp65nv9dl	145601.75
bnb17a8cc9wamlj25fgwpvym3e9n3sqsslfe76m5s6	145511.85
bnb1nzg556qryclu7a7929sv4khs2gw20eu8re25gg	144486.7
bnb1hp82p7sd60us3cgfqgqmxgdgav9zr0796rlmsr	143811
bnb1umndam9rfzrgd95txyr5c9kpjvkkrg5c7cdck9	143452.85
bnb1vrmdxy83vg6eyv9sxvmf0qy2evfc6au4ehfnce	140143.95
bnb1u5spl7ufmrhr0ett5za2d8qv9y2jftl4cdsjfl	126715.5
bnb1ksknwzf5llx3gcvarru4vp80dd0djsfm2a4yfv	138973.8
bnb1jrgf2fvkjfwzywrndrnykkc6p36mt3ytfzq95j	136585.65
bnb1xv4jh43n50ujjxsmdrv9h6lzhjhjxwgrjqgtap	136143.4
bnb1320f0fverl76txqupxguer6kceugq2z9wfukqp	110369.65
bnb1cj72vmdqfkskdfwdglr7duknp7gqrvy24hked7	133304.3
bnb1rsxmnwf7lhgrgzr6878kjlatlk08mmysc6wns3	131098.85
bnb1ppulh3ucal4ers4stg9gfhmjtffltha9rzmmnh	129538.65
bnb1kcs49v4u7f3fw5yqrq7xuva7k4cggzkz9gf8sr	122604.75
bnb1pqw3ytwyw5fwn9vv7jwus6dwta22t2xg8fkc68	127037.4
bnb1p65c8nhh38wnexrfvyp8rnd47e7huanwwtzh89	126999.7
bnb1j45qd8xsdkf9uda93k0eh63js2sus4ng5xtnmt	121599.9
bnb15tcnmznknk9xdza5faqe03pymfj3a8u3tmc8l3	124979.85
bnb1z9nj8pz0laggj4seulr3m4jjl7ku4950lk7y04	126479.15
bnb1xjsklr8yst8lpgw53m8dw7qcqrgwgjprpvf7ee	126451.6
bnb1xpmcnn8738fv6zst6skr87smfwu0ah60vr7mcg	119297.3
bnb1mxs79jfff9ayq003htagtjur2j935g2fkshayh	125655.55
bnb1r73fjf57s62s9egvw6m7cl5zwxrlmhsr2s5r05	123535.65
bnb1de43c9q2lj7tf98dmc2xnnal9gx8jq79f0xmsw	121536.1
bnb1utad4swt4hp5448uk46pzgr5al9sz4w0ypheme	121230.15
bnb15jfs60nwxquvaj9lwn7n4n2hs7ggnxvtqy4kt5	119575.7
bnb1l3k02y4nvgsnvdg396lxr7cpqknqqrfhc8yjfq	117728.4
bnb1z0v4qlkvk86pec968dsesrkapud0gzdkdylnqv	117579.05
bnb1lq3w6nkjc9suldhw7yzf6kek6uhlemv2h83skk	116858.4
bnb1pdxa35p2q9e6qmgdsxqucnr4065ur2rzqduazs	115627.35
bnb1tl80z8ewv9yg8hryem44at3hwrqjev3ks6l92x	112299.6
bnb1l4nxx7gpszccavj9yml6w3wu8tlfp24ch3zdj2	112711.4
bnb1323qet0asr8g08rkx93w28jkxqfcysaz935jc7	114679.05
bnb1fzu4nnvg5vjthee5j2qsmj9kywxg6mvvg4t884	114592.05
bnb1kgfr5468a7vu94mp5jt7qpzfuqcn8ryc82q52w	114419.5
bnb1t57fmptcaxc4aag2ax86a7x354p543t3zs8m7c	112031.35
bnb1s9g7c9v3rg6ee8g9mcf7txg3ayxr0vkp22wfxr	109112.5
bnb16cwvj6nuw3tur9xxrfkehuyu03vw6y6ra2fcju	112466.35
bnb1eht48a77ym2hhv6cc2hp5f4x9xeqsxg22c9ewu	112415.6
bnb1c8whfhqet3w4v6u3vw3xa8mlxstja82lght2v7	106917.2
bnb1g0we8gc3trgjwuhuy3v0sud2urehyjjcaaz2cj	97634.3
bnb1npuyw2ezgn29fw47pqa44s4rawzs7d3xdrgr9t	104350.7
bnb1fr24vdtm23ufx25ukld2d7grtjfr5hk5anj95n	109205.3
bnb1dfwkg25fhgyax6cxlj87369ltxgread9g470y5	64239.34999999999
bnb199u6x3k9my0fvnseldyf5tcvz6qvmu0xgwp5fa	105417.9
bnb1sdh8a7xahvr4v2tjagt4udm6fqwmrst0cz0mjz	104865.45
bnb1vp5ak37k0735jpscwrs7p9c5z3e4ueed7jugwg	99533.80000000002
bnb1patrmmvazgp5m09s4j7d3u9syzn6nelf4jc0k3	104095.5
bnb1n569app6rzgdlqwmu7vd2fvklzlndwu6mpe359	103847.55000000002
bnb1qz0grtc9qsh2ur43cphl8sm2t2nsya2xa9qtc6	103202.3
bnb1crnfrhyknx7r0ee9e78q4xu4hnqtqgkeka7jvr	102983.35
bnb1afp3u6gu6tsc6w4tw9wqzdhhna2np2tzprtzcc	97977.95
bnb16x93hvxf2l2w8lqvpsjmlqf6hl54ze4ty3djux	99978.95
bnb1n3zyr8fm9zm3yh7fsqu7cfsdhwleqe26znemw4	102428
bnb1pyzndgy0clkrehqke6h5jgrtdqzgdc78ac4qsr	95916.05
bnb1da45jhxdx7v2klcahc2mavv9pmnryem5h2fngf	92280.9
bnb19c2ewmwgcda55hel53mgtalzhnvsvncwxnthtz	98347.7
bnb12ppe5t47pnt593l03zxw3zu6d2gtvl5m02fepn	99868.75
bnb1cj6k6j7c46ksdc5neru6vnn80ts40lcjm7ndwu	99646.9
bnb1myst9x9cy57vqf3z9d23du9x0cq4asmkyxez45	99549.75
bnb1skc0uc7m30hlcxgvlg4flkvm38sefv5uwen523	99245.25
bnb17dr32lkqs4tsspxvufnmqkacj4svy6ly65d43e	90266.85
bnb1lrfa304a2xh20l2s8hhacr37cjhdstpw0wh0uw	92298.3
bnb1ef8jvud4fs02ekzkvt888gr4pfjee07k0frwgt	94656
bnb1px9383sy08sj7d9nhkg6thcwv82qdgcdajt82u	93722.2
bnb1kdj6tm53lx9st7zzuugcz3amcuh60cveegh28g	94074.55
bnb1t7kptjtwehqyjqke4wv0tfcchf66gtnarv07av	93667.1
bnb1jhkjkcwp72r48yenn5zq6pfgche4j577tlh88z	93551.1
bnb15unemd0e87ks9usnv2f2phlsm7yptv6zql7ux5	93223.4
bnb149ezz4kdlsm5sfhn68kzt60k5y9gca6895xl86	92802.9
bnb177xy982fqxc6qk9zwfnhhqgd4n55vd5wfsgx7m	90207.4
bnb17cnrdhde975tp50rtyrqtp2gxemaf8rdta4e5z	91758.9
bnb1savrv84exx5ra8rvhgp7eyhxnq5u3wzjxh7lec	73731.05
bnb1uag25q89qmjpsf7x56p4gk9dcj6qk2qkscjczr	87449.5
bnb1yfyxdqfmwua4wj75wnc30tv0ll0m2jwxyx6xyl	87971.5
bnb1tkpcmg69hsgw7tn9297n2u34jp773cwa30e692	85200.55
bnb163h9re847lu3smw6fwyuej25auysvzxpu8zftj	78004.2
bnb1wvrt4rs9zyu8hgdyzpxl6q05n5qlskq959am3g	85990.8
bnb1wjzuntqc9xrmwewyqvqjzgxy3y8q46g8v73ag5	85751.55
bnb1vkwtw0srnfn4uhsykgspgvptea2zxs863mcaqg	80261.85
bnb18mdluksg8zzjwce5jk73w8s3g2ky2748vdhl4w	76533.9
bnb1c2sltux8hj5vyc9vdwpvsajjqac43veceeazly	85055.55
bnb1uhm7phhcw3a4tn8k4jq50e7lh0z695am0gu2yw	85007.7
bnb1ve32eqkmtzvu247vk9y6e8v34n8k80fntm4j95	84005.75
bnb1y2eqpzcpyxkexzzd3e5vnghd7xd5jr4p2ud0ly	81988.80000000002
bnb1vvv3k6kjpqrre8fr3htjhutxwan9vag6jrj9dk	81864.1
bnb19dxth5fqfcxyykkftd4yydvdxxejp63ym8yymz	81526.25
bnb1w4ktt8uf0gqju50w5v8g3jw5u6gpyvy9z0ke9s	79821.05
bnb180hp2ms3a862j4u0wm5l5gl4z9t33fddhfwea6	79641.25
bnb1f2t5gr99srrv6gr0ldna8xufztdgfhxttgy7kg	78545.05000000002
bnb12tdc972mxv7e3szacvpt8p4rqyep0822vm488j	78534.9
bnb1k3wjvu4spg439tqcrrnpd323zyqtryh6xznxxr	78417.44999999998
bnb1nz3x9f477yn5xw9yq2z7hay55jfkzy4gngcyvv	77796.85
bnb14mzrmv0h3ynlgtf9wvsf5wrv0usufk28ugst4z	77382.15
bnb1nsfe7phf7c6wqak0znekzy6q430zw68wgf5zz2	75243.4
bnb12wey57nha3jmn7ycu46066uw8khc0ynna90wyt	75257.9
bnb1vfz8p9vsjl6pjyr3vs83qawl2j90067xn3uywz	70416.35
bnb133sp2s58cjlqlrgh7s6a4fqwg5auua0j4v5rpd	75743.65
bnb1pj04e3nkkgd3t3xcxwe8z4p25vg5svm7rqjm8j	74634.4
bnb1eh2qwqhqlhscjze8wvedcplt6urredhq507ptm	74052.95
bnb1ka483sgw3tqfldugds9n9f5jqw848vmk8qn9vn	73992.05
bnb19w8ac9srzwa3mcne6eh2vkvevgg3fumj55wdyq	72977.05
bnb177hrykeh5zvg0lh00jlxhgnvngveu56xyhxesk	72784.2
bnb1ux84kgg4ya46zks92psy3nz49mpyek6tjdzgkf	71960.6
bnb1a092te329r7uez2g2ednn3szjzyp89fv5nx5k3	43044.7
bnb104ypnylt98jx0l6elgce7rp5f75cztcyutgh20	68764.8
bnb1lp83jqpjkx5wedwtyggd44ta0fx5w2fef0us4l	71181.95
bnb1lwca9rwt7ja2cqkc943jvxtz36zsne37765r39	71102.2
bnb1s409l8uquj4rqjgd8vrztmnarjnn89cqkl0507	68128.25
bnb190we7qptyc05fvw4jju7rvm9fg5q4ny683ksq8	69398.45
bnb1yj743dhufwxm4f4p3jwugwuus5vae6u9jzvplf	68756.1
bnb1se0kwzsmzwepx9pxzrfycpar86xsys93ahp8lu	68975.05
bnb1jluwr2nl68naxs9nvx0mux6m2amdy32atteepf	68416.8
bnb1j87zk6xnv2s79rfz0p4tmwwzg9ll2l2s2ptkkd	68463.2
bnb12fwj0nqlrl4d7g8m8daq24vzet9ydgw5m3fvtj	68192.05
bnb1ke2dxg5ngz9a670lvqrgvg3lfga45s038vpxj5	67688.9
bnb1jexqjxdazm3jqavzaemdvgfvc9qnsp46erjnv5	68070.25
bnb1c6vp53d53089e0snf2czxvqxu2gp8xx82kq6v6	67770.1
bnb13whhaqah3ha7u2a8tv6duentqj0uxgwkc3euuw	67053.8
bnb1zcza9pn7ut7cm0qu46872qj5he6pxr5kagnetw	54633.09999999999
bnb1vhf53um9ypt36lytwyy84206paz6hgq70sl4cr	62915.5
bnb18u8erwhu8js22hrul76w0zajtlhrd6cvxndqfu	64601.84999999999
bnb1pqxxh7ral52cvh8r2a0qylxccxleqz2u5sg3n5	64007.35
bnb1k8e6s5x5vjlvmghr0w90xjfc5cek0dq80fj39g	64249.5
bnb1hwyacmjwc3y3f46jpjclc4tkjuzgg70fs5q5qu	63968.2
bnb1p6djp0pww5wtr3rkuxppek56pw2c2f9ae67cj5	63460.7
bnb195lkv0f6x5n3xz0gkrs7s3m6yu7fsgg8j96axc	63424.45
bnb1jzcdaw4nl6kp3vs2z6wrmpvkttdj96t7p5xznv	62745.85
bnb188prk8av7jkhf5qvj75aec3fmky0uv6vhfm96l	61915
bnb1gw5u9m4phtmq4q0nckydk5rd5dd8jhxqcsxd6d	60784
bnb1uma3wqqj4vjxe4q8xsnde83fzxye9l6h46nzxa	62032.45
bnb1qhefqvcfgg7y3m3wvg29g4r50958nwnt776eay	61909.2
bnb13t2uuxcjelhysamdy0pqw7m6g79zv8ddng5wng	60795.59999999999
bnb1vt0sy6l4r72ua9gjynky03um3gux8u0s3xfvpm	60712.95
bnb1wckqz9sjckkrdrccq8qapeyuf282xqjxc7puzg	60409.9
bnb1rnhamj2wn7zezx45e9dk9h4wn8kdpt9tvpent6	47213.45
bnb13rv02shcdg98ec0l9crz6zyhewz0864k4nmpvg	50036.6
bnb1evjlm9f4jp7cye2alkh8nlj72e3ltw77380mqc	56523.9
bnb12jcyf5dkefyd4p2pe2cvkwf5u3p9tymdwpykgf	57385.2
bnb1nlxa3z3nrgdg8zkv550ua3pllm5sqc66vwc9ca	58082.65
bnb1ny6qw9tqsf9s4rfnlcexmxjgmqcpyzxcx6r29s	55994.65
bnb1l3ftnt3s23de9e8hcemvpyrrq3hufsu5t4p8vn	57688.25
bnb1t6q635w940ml8az63g0fu4nr6xaa0gdjpq7fur	57489.6
bnb1s9ee9rwhzsz8z47c78e77d6nt90ju9r6x6vdpv	32791.75
bnb1uewdxntnk9pgdh84vdth05z5fhcs0gzs05ek5w	52313.09999999999
bnb1nlwp6zwg5gk0r6prtl339at5mzun006l0s7a40	49823.45
bnb1emjhh8en9mcy2alclfhasq8t5fgl3ulapymumx	55453.8
bnb1rj2ec5zypprcxxtkf0dg8rlv60d4xqpvk9rx9t	54998.5
bnb1txsadmg2gklm9vtzapwp9wa3mazzfrh0d05v64	51164.7
bnb1ke0y99g8p07sjfkpxarq8tnxkwnz2aeq3rgsh4	47168.5
bnb1n9avl327k6898alwwfq2hspvshn8j28j8ghye7	52081.1
bnb1kfmhmpmn5p623nc0pr2a9u4n586h37fkjv42mm	54238.7
bnb1nx073cvdh4jwwp0k7q04mw6c6m4re86m2h2qh8	53088.85
bnb1mu4dge3np02qmxwjcvvjcg72czcm3pa5ax79gr	54183.6
bnb18s0yptz5205ql87jgmc24ud58v8t0z7sdp45sy	53242.55
bnb1qycgsznfunus8lr7n2lf6hw90s7xfek42vehvh	53304.9
bnb1j987tqf9e5mxelnpav3srv4d7cv4vf2azv7z0k	52690.1
bnb1at96vtr6jcllqp4c23z29ch4drwemkfyzgj3th	46291.25
bnb1sh8l6ry4updm6lrwxzeng5anqdumdtzqe7j5xl	52845.25
bnb1ezq8ja7ydlakghwxqcuzyd8u9g82704j8zfn8e	51701.2
bnb13gmnynvlkxkzpnpfttuxsww7kt2jskp6wntqv9	51305.35
bnb1q5e903ewlaaekwr6e2m9ptyqay0l60madhm63t	48331.4
bnb1wfkdaekv47thqa9skdqsdu0jkgepx9kwvsed3f	49700.2
bnb1ln8gpa7txja4fv9wk57rdnvlp5hqcd9mjyu7vr	50670.25
bnb10w94uklqzmf3ed70qw8xt729kvd6jlrw2fkqme	50373
bnb1fcggj86uc70ddcmy6ue7c5fml4en40h6akrfg4	49823.45
bnb1z8sfl6xh70l4d28m9at35xkx5jlx6tj8qexufd	49871.3
bnb1lakfyhm7ls3wgkrgkre2c8qvcghvc053kjvwe2	49823.45
bnb19l4lpdr7z2xuc9gllh4vqwt7qlw3ccccjvr783	49823.45
bnb1zyvkhqr5c3520rhwerntdxt2az556fwqg3s6q5	49823.45
bnb17pjul7euxs6egrlu3wdk2nlhyk4mrspdmhh9fk	49823.45
bnb1vftev5w20zs50vkh6tu99yj5nkz24epm0f703q	48580.8
bnb18ywgmqjfqavf6fkth98mjeptnphfxl7yulf7rq	49355.1
bnb1pq975jggw0j9n9v9xzfwenkx0sm0ywmvk0ppsr	48859.2
bnb166fw6frtj8duaatgsulmy7wkm40484ada7j2pa	48634.45
bnb1dkpkyc9t0kuh2n5cmnalae3v63evyu9dmx4gkl	48557.6
bnb1mw0dse480untejufrkfgchkn4y55uqnpqt2sq5	47942.8
bnb1shhwvdww2uuzt4s7wqjswmltw2hlmru9t3n69c	47952.95
bnb1qmj3rtxtluhfv6sta290k586uw73wvkk9elf4s	47828.25
bnb13t833dp6pz56c3ut0adt8a7u7u3j7sjxn7e3x0	47403.4
bnb1xnh2uarjk6hlun7a6h8htq86j82x3rpmves08e	47633.95
bnb17c2w4r83qwgy3vh3v6t9fzlxxnw45nkx7062qz	46898.8
bnb1q573szwdrju7jkfjjprwrvy6pdtsca2fca2f4n	46734.95
bnb1azxegayhzpemvwh23wfl2vczt37vp2r9qltw44	44841.25
bnb1dw2p9e54c4hvdh7y0cl7t29gjnhgvha6ndhl73	44397.55
bnb1x7kdljse9qtrk5v9eqyxpmmll7kansu6ht4kl8	42113.8
bnb1exa84l59qrey488vpf8ru58f0fpsmav3cmp0t8	30307.9
bnb1myzyxl9c5hxvk62pvsn57s3w596af998y3lxwa	45849
bnb1z8y6sursld5eq482kc07kk4j3najm27960gqmu	45802.6
bnb1jx0esfkr0vssqr2m048xlrfwav4vsclj326ahj	45777.95
bnb18x9tr8garka4zsrfjq640tlegw3r4a22y43etw	45292.2
bnb1mmhmjqsenyy2xsa3eefqff73u8s3kakp6exfj7	44841.25
bnb1mgykcx8ml28mwc9hlt07estqmw33ket5vvx2h7	44588.95
bnb1jp2haw8c635wufu6c57r0guk57nymg87ml4ll2	44551.25
bnb1xlmuwu99yg3vanqj4xfl397p0ngfepheu2wfcx	43665.3
bnb1nq9umrklt842n72f4vundl9w9fey04wz5q86yw	41265.55
bnb10x2za2thl97wq3cdrlnpw4n9s97qdzjnjjh2vd	43210
bnb1h52t7mmkhs5dt0zqrdw0gstzvj9vwydyfse74z	28054.6
bnb1xa2lhe0yfef7m7u2vgjs72wpk0vqf599h6k7pu	36115.15
bnb1knem66l99x8yfw5rmyd8gn07vqfc9kcstxgz89	42672.05
bnb13lva64g77apzxmm3wy7slux6k2kddedl0r93zt	42134.1
bnb1exnnf7lezfy53vf6q6lsaze6lc00ctemaq269k	42348.7
bnb1qhx26x87tadk83hapzvhxtgkcjascpu2tumalg	40629
bnb1rzw2ankzunv08fd5tsl6xp55z9pn4yl2fgjvst	42170.35
bnb1aey6sq47eg535050hht3q83zzjq524quar43cq	40434.7
bnb1kqv28qez2l0yngwsz0x57h9zmfckv2xtv8wwlk	41813.65
bnb17gxece0k4l3nx8e0zqpxqyftay8dvsz5hc5pry	40096.84999999999
bnb1p2xf0w07jffvkdns5ksjevx5x6u7ql0zcjsyae	41784.65
bnb1h5h6q7tx6deyrvzfxs0g58uwy2gh09x8cjfr7w	41546.84999999999
bnb1g70pfy6m5f5pvxd5du5aqtdgvxz2z7flln96lz	41213.35
bnb1rf02c5h6m8e95yx6rs3wnmr395gj724y6r6zy6	38642.5
bnb15kwejq0hv49w7z7zqvgjjslf0tgerjxuwpj8hf	41079.95
bnb1aw7gc8fl0us04cnm9k8p7j48eqwmjcxf8zy3vf	36210.85
bnb1k43qxms27d3jmn9vgdadlj8nzh0k43ckv644kz	40969.75
bnb1ka5lalveaqafq32a0g0cva5nvs98mm3v35ufcf	36466.05
bnb1v2zvptzwx3pqj9s2tt0kzunucd6pdzysqwkzk4	32967.200000000004
bnb1qelv08zkl623u5uv98cwpqrcdrjweyf9ufz09q	39857.6
bnb194qf7hknvakgfwn0866rrdk62m8m6c0cr3wj9m	38330.75
bnb1dq3way4vj35we7aact0el83ks98q5yuze8z45r	39290.65000000001
bnb1283plut7k2f6gx6theptc3kxwfaq30rw5nw9jj	39267.45
bnb1pjexmh4fx5xdymlpfjtzvl23xnz00e6l2f79aa	38925.25
bnb180vu8m9zsw8m9ty4qvjsczh5rlrtmzs6ct8mx3	37249.05
bnb1646yxaa8qk6w3u8gyprecg9kzfwc8ged67w5pm	38520.7
bnb1l7g7zd58z04ls6f2n7q9y4dddcv3yeedg7umz5	38162.55
bnb1f8zl50cggsyjtszm75lnskx2g563jvnnhjepmh	38387.3
bnb10yhnlcev5f98q6udmzmfl2hmgq0vmrun3evslv	31936.25
bnb1wpr5lm20l59eq0pzvk98hnfghn7wjl9tyg8dkw	37875.45
bnb1vwsg7n6akl3cfu3advpajcxpgc42kkpdxdyns2	35784.55
bnb1ehdfr4lt60adtwa529gf9va7xscm0vg45up42r	37555
bnb1p06d5wsuuqsvl4s35zesumpn0svpynluwmymjr	37646.35
bnb1y47uavx0kzhq067aqankmsakhrq8frdm4huf58	36869.15
bnb1gdqcs924qjks2rxyttxls2s9dnkkncu26a0se4	37153.35
bnb1aksgd2hm9mt8vxf2kw9jlw6gqtn2nuw4acfl6m	36869.15
bnb1cfqzdqcuskrx3dm3g6atnrdh3mzf5zeku3l95c	29893.2
bnb1h7p5l9ft3lu48wexad83hnqc5uk7rgv44yplxl	35029.1
bnb1lu7h9stkuf6kd2ks9d06gwczrndyjqx9ns2h68	36490.7
bnb16zlavxuezdexgll486jkepfta2za5pj6lgdpnp	36355.85
bnb1nf75ufznxcpu0wt5ll99fa9urxfa8rfyujxrdq	35685.95
bnb1m35frlx3yz2tk740d0lqzxg3tlejqzhgcwm2qr	35667.1
bnb1ggayvcanas6wda9wfgqd2c38w6qxn5nvgcc2dk	35246.6
bnb1v5g0r3marhuktlym5en2rxgjx3hrr6a6yrmvnl	30312.25
bnb1pnrjfsmwqd34xlknp0wx8qd6qn5mvmaha2h86c	34594.1
bnb12c37jwarlcfl4svxdryqu89dxzjrduejkz6tss	13089.15
bnb1vmqc0unyv9ra6sshtuqq0hhqj7k4qwnt46ewhd	34763.75
bnb1rx4a0grmnf9vjljal07cgrjj385yr492fwap0l	34499.85
bnb1ftk3vy86790r2qtta6342zn6myehla0jqqjjqw	34412.85
bnb1tkgp8ggvm84cmqmczmt5cwqpwxupr808jfmlnk	32417.65
bnb1ykja4rnkrav0xlcrr5y4mczujm7f5ast95tv6h	34191
bnb1m4kmymfnf4l85k6u9k8egylhrd55rfdzqafd0k	34124.3
bnb1yk07u9ytj73p4xuem8zpc44k2eeat2j2xkdeq5	33428.3
bnb1rzqjc59daekxenngdlpdpwju5mlmqv6ljd678h	32549.6
bnb1lmzd8qayljxv25q7nljar2rcynulvq5dzt8rtv	31886.95
bnb1v3wket664enqfya2fsk2gl6n07s4695p4vvmys	32627.9
bnb1yyl8kh2fk2mwlyl8m04ycyz709368j8q3mdcew	32606.15
bnb190pgdfzsgkr57scvzqaxvsgus3penn2e7pt5lc	32495.950000000004
bnb19dxdxajfz0ry3g3peq3gaj7k5gls64qhv7033g	31132.95
bnb1eqr56au9fzh6d4tjvsvpk7m4rmt0vusk2rpsxq	28025.6
bnb15wjggz6hwvqtdnwzprpv4xc9ny2pax4vvu2fsq	31608.55
bnb1ly4lny4zk6na3xx7gzfaqjn5n4jrfl2ud4jf4e	30142.6
bnb137yck47w7esh2wkh0gwymnk36t3tacehsqzrrt	30890.8
bnb1dxm39zmw302dxqf3888y729wlkpmhp5wlgv4qc	29765.6
bnb18c0qur6s6adayhhfgxgyy07cltrsmw64y38dts	30183.2
bnb1lss0l32lq9cju3ea5jwqqncrd09g5tnlw2uzpx	31008.25
bnb1dt4482mqws7lx4t63v88a378x2dhmgha602yqw	29970.05
bnb1rm7aht9ej2eaefrqqn3gq98wvnqh2zns5ttmkv	30245.55
bnb1plgrnrmemjap06lc0fs5gyndwhv3m8dvef76pp	22663.5
bnb18adfq2ka9nn78xezxtcxxj50m6a6st2srm2agk	29959.9
bnb1n6f885mk73dyky4l5a0530azlhh29fz3tham6u	30160
bnb16es0vrgv6qa4s8ld93xayzsyqet2xufclarmv9	25121.25
bnb15flf74fv9nka0u5lejjmngal3wa09kxlcfuqw6	29893.2
bnb18yez6ept6x089cukeqcj4lnfpvwl6ca2x67jgu	29629.3
bnb1rzzr6ladwumz77wej6r59wvju55pt404ck7l80	29481.4
bnb1ylumlnyv3p5220zquynzrl2qxzvyl8j45r7728	28398.25
bnb1vf8dfvngvkyzqxlnl33drwccppv9y84dy4lrd7	29517.65
bnb16k8fuj2emd20zh6qch5e70fkgky86l5vyvg2um	29411.8
bnb1gymht9ffkxxj2ecdw5epcx6ua5nslr3mnw2u39	28924.6
bnb1z426hfsc4fq9ssu426vfnsz2eruggynkwnla6g	28839.049999999996
bnb1x0fysej2vw3ghmly4huf693g4w8jgmzdsync05	27902.35
bnb1whjp9gk9zlpjjve33r0y7w5lfcswtyp4m608wr	28476.549999999996
bnb1e652uxaqfv0984klgd0644a5ml7lc6th76dzl2	27599.3
bnb1z8cxmte8tfw0wr3a076s2vspurk99ads4dzzca	19954.9
bnb1x0nz9hjxy4x4k23v6j7f3ts8eznq8gdzp7d04w	27739.95
bnb1wenmf2rzkmf987ds9glnjm9r34cgmrtcnnh2rf	27393.4
bnb1mfge43cjpe68sp9kythc4vqpyrpd9hkyr2cjv4	26703.2
bnb1m9f9maps2kqjdjg3d4jjhj9tr7c80r25mjx9uj	27164.3
bnb1erwqf9s38l9dely83g50f8y2j2jmpm4v3alqga	24741.35
bnb1dxf32yq6lgx33zdrexsapy05f3gxqzumhetlny	26807.6
bnb1gd9ejkln27r6lt340usp6vk2h6hmgp6u924lh6	26762.65
bnb1348jr4jjmjrdxk4vtglmzs7wect9nhy8lrcxpw	25467.799999999996
bnb1khtg7refcdkrjnvwrxvknh4234hcsgrfkhj3cq	26677.1
bnb1yg7xjzqhq2pcs97t0axrcskq732pvcsmwm6ac9	26111.6
bnb16znr4gq8a89eg40qzkvnp8vr30efxu9mntgykq	25699.8
bnb1vv0ms2x6wj55h5vtlm5p20vavg9zr8s20n4cal	25659.2
bnb1nt08gyeqpaq23wwt70652q7qxsc7ue6mgphdav	25438.8
bnb16k475042gh550qwn5re3j7wfc484c743cdns7s	23336.3
bnb1c8gfa6k29vyeqxa7prjrtxe9ujgzyl84s562mq	24911
bnb1un9e99dlc0zmfajnm8f7gwdd9j97suxr9fxe59	25109.65
bnb1pl65p034vwwz2rd4gft6f95tqdvdhsevd7lxcj	25031.35
bnb1jkjufugqnvz8llfueureuhsv46z6jwj523fpr2	25011.05
bnb160fxd2ngr4xd8qcrundqvccl0vx06kwr48g4m6	24912.45
bnb1kr84m2uyudg5qv3qy03ts38yrep3qc3xhuc3x8	23207.25
bnb17umjq3zskuttsewqxl0s6p8aj2syfwhw0qxwcf	24099
bnb1uj62c2et9pskuqzv49pvrc85kezlhwh5xwys6w	24120.75
bnb14xaycnc3009g5n2vl6mt23x7lwuuyw5py8lqju	24120.75
bnb1qpwpuap3h6sdty960k9kjugne0nggxpwgmuk53	23907.6
bnb1hz8f8ejs6uy3fdyg99fk38pkmm3grxf2n643y4	23708.95
bnb1pkggw5erxqaqn78ynqs304w5360lcert2dnlxc	23645.15
bnb1qpqlczwcucdh2dajve4ftccwzpsc4r4488n8au	23517.55
bnb1kpc7jfyj5vxq8y4tcdcuyh5rrpzhcm6cpfmy5g	22693.95
bnb1mn4wl7fn78a08f62ctxnt6kl2jgkrra9mwuzsn	23085.45
bnb1jhdaa33w0067yqn3n8wuc26kjvaznnm0vmwv48	23049.2
bnb1c4mfa6rxt5q7h6pg7yf6sxktu58vr2yr7xv6lp	23027.45
bnb1k0pevdw060dug3ld2cmwk63gm5kn8qsnaja3q4	22448.9
bnb1eyt7lpfsmcjd2rsza55zjdjy67a96c30a70590	21014.85
bnb1tkfdgcn0ccuyelu3zf98a5p2g3pj70fe8pxrgl	22274.9
bnb1n7w32q9ehdcz92h6w7rt68hqyvd5n3fl2n7tmw	22092.200000000004
bnb1ma807q85ms9aa2upg4hmha4kjaaeahsl0gjnpa	22021.15
bnb1p5lqhax6x74szyzz9ray3hkyepd7txznwsfy8a	20421.8
bnb1qsea86cyf5crtsrngdfhwk4xm5gvzj5690asjm	21716.65
bnb1pp5szct76xg9424x2d53d37kzsszssjsl8f4ve	20840.85
bnb1fpdgkw8z85lkuuaqnnmvuqmahxn24r78vtp8dq	20568.25
bnb13dnnqvtv5srm99rm7jny27s6t37xffxmv5effy	21355.6
bnb19nh5z6h4cllcdg8rp3jm7pdnlweu60h5l9zsp3	21246.85
bnb1snel9skduw8fu4u7x8a0v0y7jejqetlsc57qfu	21213.5
bnb1rjjx7382fzjw92chx0n5pcs9gvd0c44tltt7qf	21172.9
bnb1kqm2ecnxpydr5hpcv7x9rpqzv7zxk2gl6y6454	15387.4
bnb1vudr77y9k2s0yzj8aaftcast968zsncq9k8sw3	19928.8
bnb1uacq9mwuyxswfr03vtg57ph77lj39l8dzpgzcq	18040.9
bnb1prdkexdzkr5mhw0zw8nlysgt7wtum0r2eltgr6	20194.15
bnb12jj3srxqdzhymqqzc2l684k4g7adcem52tgwcm	18880.45
bnb12rldmet92gfj72muyyg0n4xc8fpz9sa55g7m26	20598.7
bnb165pnwqpq55h93amx3a6gw33femcp97eaws2j9e	19928.8
bnb1xk2049agff679pnah2u9z3mtzx58c750svw6k5	20392.799999999996
bnb15a7a0h3fj2x6ful4gh02ywj3w5t3uspzy628gr	20349.3
bnb1pkhgklqs8zt5ylcdp6p0wumsqa5ackqj5hsfkx	19357.5
bnb1rt63zl9ugf4wgax3dv9jndnvzeqpjqrc6kxn6d	19928.8
bnb1nhsxkz3dnzyqa8awr365nw6a34z2436wdwf4zp	19930.25
bnb1ju8z2jt30cmpm6vllkck4lepjs3llh8wc35vjp	19216.85
bnb1x4mphla4t5d7cznpg7papdklrtkdvv2yqjx675	19973.75
bnb195x73dfsdy5hksvwd97mhyjwarsy9jdyysxakc	18719.5
bnb1zy3g3dw928af6vewvjpg324gwv082epnc94tvk	19772.200000000004
bnb19rcldxq0qccglcyyu23m43tsv57txsp4ugrjpe	19660.55
bnb19e2l574980xrsj52fj8mvw3xzu95743xg75ml3	19379.25
bnb1zv93hlu96jeg6k2qxdrwkvu37f4ylgy9cpt6dy	19192.200000000004
bnb18rtwuwfsfa4mjlt0v448l5a8p4yp8w8dmy84c7	17836.45
bnb1fdnkv6zc6aszqqesvh6fervw9mqzkyxvpec2pg	19048.65
bnb1qr9zvs0z3hl25as3tcrzjyg7lyqsyaax70cslz	18783.3
bnb1r22z3r30899juyz682d6q5qjcdg49nzywrs60e	18680.35
bnb1rugk96uaj3h5t6t7nc7xtqzx8qg8v9he90vqls	18219.25
bnb1fu05hmv6zkj335qv6mpwjsm7kd7wkhyz2x5um5	18668.75
bnb178ffmj7ce7a7we365fc45hgnqk4c9wte5c8qfv	18625.25
bnb1awaqr8g4tfwwyxcw25yu0swykzsmcsjaq59ejf	18355.55
bnb196archjv967cz9uf2kmaf6q3khq4xzxcdwa5wx	18264.2
bnb19pdp30d8a8k0rmk6wn44e8x789nx5sklrzv65t	17488.45
bnb1x4vn6rn6rujsqd2wnmg6exq900jv20rqdfl7jt	18332.35
bnb1u22vyjjx6v4yhy70n8e4hyl32wym6dy8tw62zj	16663.4
bnb1wlhvcgsrn54jr2w003e9m6jwyv3c07g8lwav0u	17487
bnb16tvezd4v32eze76vfpve64s4fka5lfhcuvdy9x	17031.7
bnb10xxd2z68cfljn8wqx2atnta02qekyptqq28ax7	15942.75
bnb1kldfyslphmpn70frclgptncfjyf0pyp243fh5x	14749.4
bnb1g3e3ml360aj5c3tk68x4x4jgj9676ruqejkfxa	16672.1
bnb14dfljrfgklz47gvw3ncmymnlgck7rqkcrgl7lu	16728.65
bnb125nk0gzl5h40xjaferzxq4kmww4mzej0ee8yvg	14443.45
bnb1h066plzq6xr5v94jft9laqys0afl7fdeg4h3px	16680.8
bnb1zwhwaezlv3mzs9h2dcjuna8vjexw6c2s88yx29	16672.1
bnb14jdt3rxytmk2ul3mgslrpfzefazlw4esljdc6f	15385.95
bnb10fg8z9dumqhmfhm5s4ghyh9che07hplvk38k6t	16644.55
bnb1dk7my4lzjg0zu5hwy40cxf6rq6hajzykyj7vud	14617.45
bnb1fq5rkp7vmmqnmnca4a3xlrp6x3wtwtegrn7yhy	16351.65
bnb1sk70g9c2mm5rcdqqwlrez35ethhxgejjelgrlz	16113.85
bnb1rkrkr7gjpc5n3lwulqmdrvygup9zyhzy799t3t	16097.9
bnb1h26y8uh7dzk74qe6y9al70975fyeql33muj0lh	15929.7
bnb1fw0ut0j27gnk2flxvclrw25wh8m3vslgx96ug8	14668.2
bnb1kjsfs8hpc6fwln9fn8enyzsw97s4n0z7fd4t4q	15549.8
bnb1nlun9rtdcyerg3vqu97mfcx3svdtuset58jrzm	10463.2
bnb1jhrn7w86ag8pgywuuxjef4xjvqmfepj4xprt6c	14946.6
bnb1hwhwyhjya400zd55c6l95s82s7g4xdtapaa8v5	15443.95
bnb1ryr84ww8a3x55h8zqajexm0h4rvekf5p7yv6yk	10044.15
bnb12ecnrm7tjxkvzxvrg6udyreh2550tjw55kuxce	14579.75
bnb19unjsczlfn6fezrkhad7yg3tg376ep97w23kgl	15285.9
bnb1e5gv4exwwkqvfx9s20pyl833prcuegxpx7uz2w	15207.6
bnb1qyl5m0zh0a9v7zkgm7xlrzx3jhrnx3vn557nv7	15174.25
bnb14hre8yganfdpyq9j5px7mfxc4tudsmkat8jzze	14929.2
bnb1cmr48486xw3hda63gygx4wkvuvt5yzecastcwe	14990.1
bnb1yxx3grdj8jnxfy9yg98v56grumhmpvw0pml8ly	14946.6
bnb12vqfkhz8c80x9fyusmfxgcv3vf93d80xmvz0ad	14742.15
bnb10hhfeyykqdj9h6le4sd2r4r3pcey5sjj9exj8z	14837.85
bnb1upauy2lhuve94ys3ulzjpg5v60plcrapzpxldr	14502.9
bnb15zf3vqn8r5fvd35z89w6qkgrymq6t36kdqjdef	14473.899999999998
bnb1cf0lg2k3fc2w0hzytu6hud0fe32unv4x729gwl	14492.75
bnb17h2ws5j6k9y36dq2r2j4ut6alzlqpvslrxer0y	14095.45
bnb1qk5ugzxcavh2z4l9ayru36xclnjp4g9hnx4twv	10164.5
bnb1zuctl7ev5q0r6pmy5rvxfyscgjy52zkgu409t5	13827.2
bnb10qklzqgkf5x388qcge9xv4d95ufaae363gv6ly	14205.65
bnb1th49sgwvnh38ch90jhxj4zu0ql7hfq4hpmnk3f	13656.100000000002
bnb1cqf0dzrgs54efmzr070tt9j3cpgpe72l8mugzc	13941.75
bnb13xayja7mmwxzznledqsddaclfahdy407m434ux	13904.05
bnb174ksd655k7qzuhv84p7h0uzcr34f0yl8fwtyen	12655.6
bnb18wx8c2kg30aga4vhpqjtzm90jagng7nwk89cta	13763.4
bnb1fraj3qx86empepxvcv37m4k5tqs3hpxa509pwt	13550.25
bnb139gv0ujs9j6kafnt2vmkrd8e0ntfnmsfe9sn9r	12833.95
bnb1k7v8kdtsdrhqd4hdxusgxh6wgja3d86lnjc4gw	13151.5
bnb1ynwgr2jv6pjlhpx4gj5p5fwt9jjp7mdhvrg84n	13302.3
bnb12xacynyfuexhu2v95yvw2np4rpunl8d874m94c	2027.1
bnb16dclws769493quc30tvufyg06kjrtkl2cux5tp	12677.350000000002
bnb13wxfh9p0yyzz3k9r2vdr9pvhsx9yap3cz7t8hu	13303.75
bnb1hut9uz7kjkfcgm7p4ww0hc2seack3mf8quwy0z	13241.399999999998
bnb1n0nqhy536za2j6szald86x4f2dn6g8fx5dlxcr	12008.899999999998
bnb1cj6kehr2zn0nukvsmrfmxqp02lsf9j9u830anr	13196.45
bnb1laqhyfucgx7utlvqqvft5ftd7yupvn404md0f3	11958.15
bnb1q088cl283vhx24vquj9uwytuevxrz98dq3yav4	13152.95
bnb193902zchc050qa752payuxavl3zegpl40nx6qe	10761.9
bnb1f040c8he9tswy7qckn6qnttnh239uyw9hg8efe	12804.95
bnb100cv83e6egqtnav9c08www3y377uwhx3gr8um9	11202.7
bnb1uhvralzp63g4tcmnk5mwjsms30qh3heu8p0ngz	12951.399999999998
bnb1u60924l08dq70tven5dlz8n60m6an59ksyf80e	12935.45
bnb1976xg39yru50dqmwnk68ju8745fl97rejyjvc8	12136.5
bnb1l3qz4kwumtthq8s7ze87rmvrn0cc42309wnyj5	12455.5
bnb1dgdxwulcepwdjdlmvx2q9cz5td0tdklqyuv0fc	12868.75
bnb1jgakwh49wxlrk5y2n0hwyun7ueayszn4zp5j54	12736.8
bnb1nudt74776dequ8lxwwdl49j0j362krqglae662	12620.8
bnb1sesdueuw2walcpu9tkt7gcwfnnls9tx68s5l0m	11089.6
bnb1n7tx92khlcrjj6ugpehnat72kmp47umk68gff7	12075.6
bnb1g2t0qkjlmsufputfneesljepme3ujp9lzyvm4c	12514.95
bnb1rdcw9feq09d4ha09z92fdw0wlezl8mzqpqreld	12403.3
bnb1g09z0xer5w03gx0z4fu0rhux3sksxthsh5fn5g	12146.65
bnb19gj3uepn5ra602dpvmkjuuw78gjprjvea6fjvp	12184.35
bnb1we2rzwn0y82hq7uj9el636khjvmrlng85y7glg	12169.850000000002
bnb1f5sn0qx0rumkguvzlt4cmn59k6a8fjl46966d7	12158.25
bnb1zqewsml5wav2f8payv3kngsvqtsw0yj6jtqxzn	11457.9
bnb1tw3rhz2n96c5mdgyf4c0y7zd66gmajjde2aq7x	12110.4
bnb1yyyhpp4q0apn4qeuyqqrx2jueg2c587wf8flf8	11995.85
bnb1tv7csvm6y0kdnfurkmgwat3xzcrhsqn0cj4r8f	10831.5
bnb1zc346s48m9n8en62z0pf42nt2lef30prc45x4p	12037.9
bnb1hsakn8w2qu6eud9dfang26nhz2g6h32psh9ldn	4464.55
bnb1v02cvc3qcw8s36lchy39xfqu32r8jkmwwv4zd5	11968.3
bnb1s9nz3xj078qg2sl3u2cuqe75fhuv64lvuvy33p	11689.9
bnb1qcq3rfy9vwqglcg2022zv3v0x7244eyc7j974d	11718.899999999998
bnb1zckmcy705dpxauegqmnj77strq7qncdhjnvp7c	11602.9
bnb1rf8l9hypry6q88mrwf46yff89a8fcluxw50gwg	6219.05
bnb127wmzf82jtv0cqzf3cpgg2y4vkxxvuw8w7f23v	11489.8
bnb1ac8yph5pqj2q0h5wmtwqm49d8gm6a7gw5mvpwu	11450.65
bnb1yde4crz8sk27xvxn9qkndealn5s9ydr4dpf44w	9451.100000000002
bnb1gwrcufymvgqre2e474y5a5qv4tqqxdjdnpzp7p	11436.15
bnb1tdcdcvskw6077qdw0tlvlhpd3hem9ddx3pafwr	8250.5
bnb1n2dc9jp3afu5qeajxv0w6d9cj7vwhtx2k0p6jc	10332.7
bnb1mdn44ha6lfamtwfa96sjam65c8fagaw3xhqtg6	11267.95
bnb10xjph45h0fgcls6lnyphtstlwaz6634aq7wa3m	11339
bnb1gjq5dqkwpxc06x5jcp58rg64kex590t03ucrss	11249.1
bnb1z363jdf6zvyhemgccxt37y7rmk9txz0x2m4z72	11107
bnb14gsx7t8sxms4nzw8n3x9rdwq5mqmm7wwzyw5d6	10580.65
bnb1agw54hev0het64h3q2zm8am3huc0myl8vs0psw	9964.4
bnb1tvds29m5pz7salul2q8hjxyl8v9cu728zfxaye	9874.5
bnb15l88qvg67n86ft7twrypgjp6aww65q9jfdj22h	11017.1
bnb10fyvuev2f44hk2tet45vlxrnraf9pm7jankrqf	10850.35
bnb1uany2rlyzzcpswafd9n4f278uwz0afr9m0em9m	10904
bnb1lje7zp9ftact0e4mnpx5uw0v4uwlas2j8hwx40	10844.55
bnb1r3avne5azhteyhqyv4rz85k9wzq0ud2duuked9	10806.85
bnb12m8awu57mpxx8jyaf2g20z5ynhsmtr8kjlmr59	10044.15
bnb1cqgyl7yvng7xl4plnve7h3r0scycm5yt50x4aj	10708.25
bnb1x9thgqjhty6rjlcd6vy3prugjpefmfwqzz4era	9822.3
bnb1r2kkc393ezm5sj46lrj7mpefpk3xsewsfpm3eg	10692.3
bnb183gxx9ea5fqjgaxsfjjm8qc6pr4p2pj3e92gen	10667.649999999998
bnb1e7c7fm309yq65vx7nak0232zt9lh62eujxfhnt	9964.4
bnb1r6847va3achrjxxtszpsuf8m2kjrzgyqzg8uk3	10000.65
bnb1jmwzglxzy77v00k4572rr4qehtj0s35uvrf9nd	10556
bnb1y8xazlf36kencpsmp5mvwwhj7eepfkf4ztykea	10109.4
bnb1lsypndn2acamv58tzgztutkfrgtcrg6y25eg96	10457.4
bnb1h0vd5tlhujy93aaegxp88xsdnamsp0yrwqfyv5	10383.45
bnb1qlgrcew9rqx76f40aqnpm5774xryjs8j05mzs8	10493.65
bnb1avnu2rawqg2jmagwxvul662pgmjve49y7eh893	10454.5
bnb1em5s72w6stjr8ps7zg6femcgel7hynruyahalk	10234.1
bnb1j0k3fwz4ujqjyhmgxey9a3svp0afjc0ck0rf2y	10440
bnb1tqxmc3kkmcgyh5l8lp8a4rr5z9k8lcv6jlfmce	10383.45
bnb1wp0sm926hqnxewnud6es6s44aed4tkqq8q2rd6	10287.75
bnb1gvnneevr42ree4ylsh5sd2f3cqwrk2kkpy02j0	10250.05
bnb194pk5f7asjt4hm8ez6hvsvxzgeurf3qzk4cneg	10170.3
bnb1k0pcvcevlzckucfqveypm6hrmd58qy62s6hdah	10174.65
bnb10k9s4vlj26ss2a55cfyuh55jm67cx7fxlkdlet	9970.2
bnb1ljfdv5vqldp3wxl6yp8wfxr9vcm0yu6zyeg2p8	10164.5
bnb1zn6q4yu4kmp7psedf206pl24a36hctcv7dfgc8	10158.7
bnb1fxz80nxxuvy7upqvxurfhe8npckmrrsrkgewsc	10081.85
bnb1jed0duuua28cnd9f845kdx9e9y0h7hkzcmxypj	9964.4
bnb1dhnge5xwvrhs58dcwg4hpklfg8xywjajqex2vn	10090.55
bnb1xqrsghjjcqcpv0uftth7klwy35h4nta46nexc4	10089.1
bnb1tfu4la3j3t4jfgk94kn4f6kkcm0fuc9r6geruq	10068.8
bnb1dmqq9k5dghc3992q45wsheqq9wvjeumszpldx9	9964.4
bnb1lfmzj65r3spv8jwqnrp6rjth50zvw4jkx9pe5a	9964.4
bnb1nvzt9glmcnvvgussp7vlwduv4lv0hs8w34qvq7	10009.35
bnb19y0wrtk5334mqwcrtzqwymkeafl5vdaxywuxea	10003.55
bnb124w0yzh5fl82pjkcs6vn8khq90zsexmeng9qn6	10002.1
bnb10zqqf8ah2q5p88lmttdtym8ne847x9xjpjlx0x	9973.1
bnb10dkwapwjth6grg65pg6hytrwhhj0z7xhcg4x0s	9964.4
bnb1qrme50srncmfttz8s6f2kxfvxlreywkr4ymtxx	9965.85
bnb1r8n9cqcd44pkzrslllzanzlvreev40hy7nastg	9964.4
bnb1cj729ys9x9xaghdanzfjkafnvyf3yw89k5qnfz	9728.05
bnb1v87dy28978et8vsrssrpcfqdn2v59y60nvgkvx	9787.5
bnb1q0yjlcn33jjah5dur0rupc9f7yq52edjkzt2tt	9815.05
bnb1yzfcly5kwawtdglerf00rt0ncan2up5guvszlu	9691.8
bnb1hpsrt58fqqey6xrlhzfwphdpj2tw5r0mv3vayy	9161.1
bnb152shmgrzwfqlla6gzcmz3nn8rsfv2davjrhwpp	9604.8
bnb1tkhxs7u3ws83w0v4whve8sxxvnhchk9cmmxchc	9626.55
bnb1qx2xkgmz27t0s7f8fc4xlyc7485ytr37rpely7	9619.3
bnb1pkww3q9ch4vr6uuy0525n3j3657qhhkpuwfnz2	8376.65
bnb18gaw8eyxmswj0vxdtd2ua6xlkt6twjnnymw6pk	9464.15
bnb1p00ausmd6yt7lvqym7x25ydw5n7hhxwpdq5d5r	9266.95
bnb1qypt5lw7c9sa2nvfw9cmdwwt9s5fjjngww3mvj	9111.8
bnb16fn3sdt558xa3gjhuyyhwmnyhezhtx9f50w9x2	9422.1
bnb1dqzvulzuwq5w8wej2w5mxw89py36p26qz73p54	9101.65
bnb1e0ddn0feaxp2zav82mqtauk9md3mrfh6f6ypv8	9338
bnb1kne5k8xu4pfwd2mrl2glctccpczyh77jjsmfu6	9268.4
bnb184euge8a4pveeafhk4ytap95rdmf0lxq40vwvu	9327.85
bnb1xe2jn2w6gefd3vk0zalckm5pz4g95nc3sghva0	9135
bnb14jntfdgm4eety8r83nf0g8hsrjydml7ud4gmv2	9219.1
bnb185f2h2vu4xufth96p5r46gw0p0t89mljr00xen	9010.3
bnb1ptr5psyexlwk0wm50vmtc9zkselnxu6l2s70a8	9063.95
bnb1n7vd2frs2lltn07r333dmgtl7574j6cedgsjkx	9016.1
bnb1lfe4v29gyvvl5wqgn3lhx0vg4zj462a48zzd0y	8618.8
bnb1077kxvcunwugm0jyh824ugasa2ttl3vkxp2wet	8907.35
bnb1z0ppaqmd8tmqj5fjz2yq5ajfef8gagxt7kems9	8959.55
bnb1yhaletwspqzw05agefcsh6ufr94h9g5l8trc62	8952.3
bnb16g22ty7974vsez06phd5hy6ulwx7zkctzy8sds	8846.45
bnb1hmwz4e37685j2tzlt8guv5cn4dtwz4vj2zmnu6	8758
bnb1mes90fgapscq49qy3u8n7kteellnshyl2tz4az	8701.45
bnb1n3klj982pseatz8d5g85g2hg8k24l7d85vrzzv	8520.2
bnb1tmypdtu4z4mzvlpz60etmnecakdy5yttxfz4gt	4483.4
bnb17rgya8gw4nnelnlt342y5cm6sylz40upjc8ml4	7867.7
bnb182c45t9wna0jc5jwpwrexxa7sckr4jwaswy88z	8530.35
bnb16sydpwht9zvvehyajnctggy3dm7yfhkrqfvr55	8502.8
bnb10ymuac5fgyqppageqq95mux2p2aksyhhw72c4m	8472.35
bnb1rg4dry4d23l0rwhmu7mvc7tzq5jc4j4c0x9ha9	8357.8
bnb1lvvsahh7x99zvw84sql0d6r6ewuc65c59e4eju	8447.7
bnb1ue9u9nzmmpk7aavwg0dns9lcgxv7zxcxtvlu2t	8201.2
bnb1sf58t00clyyugv6fg5myrpnm6zzruxp5qkjzf0	8236
bnb1za0xm0dsut4sz899q39dz4q4y4pezmwv4z0qs9	8202.65
bnb1a79mvkwf05n4nvdlvkk59tfmsx3valxktffpue	8247.6
bnb19760lyf8tnlrq86m4h26wr568tz3cd08vemu9m	8220.05
bnb1hxepem8n9ztcv2rscxqrsxfkmmswnq0fe9hucf	8153.35
bnb17cv2vkkx9pp3r0ewgu8w508njd7j6ss9995r5n	8088.1
bnb1hduawkppfwg08rq6erpvcelmys0lmpfzt5r3eq	7418.199999999999
bnb138kf8hffzye3fzr93426dnk8hz3f0v2uy3jws5	7972.1
bnb1uk4u23y34m7hq0grxz0e34jxeqc5krsgmkdjs5	7972.1
bnb1kdqv2rv7mneqe4mvstee6lgf0g62zd9899qz30	7099.2
bnb1jjexcgjcjtl6nfrg6wd6tkhudu77jngc3fzrq9	7348.6
bnb1w5e6htsx55xf4fpp2yyawlgvl9rt06u40nh9dn	7548.7
bnb1q7jpkp88ruwy0r6s5klsszldj9jxw3n4jmftd7	7495.05
bnb1v2h00hu68029ytcwlgur7m3g4ccm07vjpq3587	7468.95
bnb1xsmsnp7gu5gyjlzvzp4gzaxwdavhfpgxznsnlr	7173.15
bnb18eu9xmmexvelzkgck5ps3jgt44c245xz640yc5	6983.199999999999
bnb1mmydtak38chkasc2fs9qd80g3kp9uccr9jfmvr	7010.75
bnb140ym0f0mvhusw4n294ry52hmtseaklkyffjml8	7242.75
bnb1eanr7w0saq2lsxlnc9uj96m7j73raykmdpu5wm	7216.65
bnb1afs3glmmxqmpq403p0d8xrwyedrqhn6u6gtjwp	7199.25
bnb1t57mhrm8hkakjr4ug3a7m8lzlmcdj8427cu338	6996.25
bnb1rnxzvqklz5j0g745gtwswacknmneepdyv7ke3c	7290.6
bnb1mqk2grkjethuk6gn7t03zhu8k4s9xcglhdlsld	7194.9
bnb1048mpkna4p40y6gmkcn63akw25x9xym7wkls0d	5792.75
bnb1u833delsr9qduepw0vtkmw7a6j5f3wr9zt665h	5792.75
bnb1c4z6fyfvmmpjk2z0dqfmue2chtfme5mhgqgg75	5791.3
bnb106vex9cmmy2kc70p8pqx0z60kxzxe9uf7qxm09	7048.45
bnb1s0t2zm3ylhfjhzlh60euj6wz4mrm97d5y0r9gm	6095.8
bnb16ncamujv0zt3un2jd7yp7tl3hd3q0mdssdk99t	6668.55
bnb1t8f47y9jw78d79vlcl8qa6ldzgz562lnu4pvhz	6981.75
bnb1z6s0ax5l0q5r4t0ywmk952z926wdq3hvxapnfm	6916.5
bnb18jlkedpvhne8sqgx6epqa78vrj7lj5sue6w957	2372.2
bnb1gzzujsh6mpvc4w6zdw65jhhr2etecaxewr6mff	5060.5
bnb15clp8sfv0jrdlfp7wcnx0xy2ckwk4ftt00sh5c	6100.15
bnb1dfcejdy6r0j0zqtkxhjl2r2zsyjagjqkk84ny0	6796.15
bnb1s90uykywr9e4e8yw49l5l9qdj97yftjyshaf3u	6777.3
bnb16jq8a6h24942j9ffhzcea3ly6s5ys0ur6tkatd	6710.6
bnb1syvmm0t8jner6t9zx6jf2c3lswwm90hutt5e4z	6477.15
bnb1ee26vcmxqpnjj2zkpmaaa4jsdx8dev6m3hzgnr	6784.55
bnb198z6y8qndtxx4qskpr05jmkswv24g8fu84xrsr	6729.449999999999
bnb1xvvnlp02zz8lw02q5ay5v5cemsysm3h0lnqtxf	5586.85
bnb1shtx4q0z43feef69sflzcezxar3u3gl380rr50	6526.45
bnb1vr8rjqq9deyuvd65y5758zkwlcrkd4xpmcw4xn	6614.9
bnb14q5pt2qkfvsx3h90re83mk6ve26ke7tr9u0y94	5930.5
bnb1s3kt4v2s07e7s0fgv5g90r8g3ns5u3k9dul5uq	6577.2
bnb1a0al7thhcamhm6069y8kzjgffwh69xkm9gwfaj	6555.45
bnb1ekzvfzjkn8lmufzqmrkxkhtweyyl084ulj39p8	6262.55
bnb1em9nsygepjt5zx9h75y05wgjluz8ywgehhc2yr	6491.65
bnb1w0dggkpmfzr6hfnukk3hm4zes02ffzzyjvyvcy	5856.55
bnb1xfkr6thf6e88ute523n75ay5yx229lfh3j7pe8	6137.85
bnb1wrz6yv47j0mcjuanalpk9an0dfme0gxv0vgxgl	5794.2
bnb15dvcq2595u8ghcv6p3lnw0zxlehweknnygwwje	6359.7
bnb1fnf9kppfa69w09vegvnxu7nkh8yw80yfhujr2v	6079.85
bnb1sxr28jlzup9gckus2jly3j2gtwkqg3msjy6hsh	6063.9
bnb1tnrsm5dfwt6yt5ejqyz0hmhpnfsu7w3z22x59a	6059.55
bnb1frz9tjmt2jl2a2ud7elnhyz6nq5xgupe55htd6	5971.1
bnb1xen322z6kfdz4mrqhexr744c5khsw7uggh2pe7	6143.65
bnb15kargly2atr90gswqsv2weqcr90l3jrugxqquj	5884.1
bnb129qq0cgn3fjq384qe2zde56n7klaf8fp7kdp9q	5792.75
bnb1at7jcw2fjvhuqygx8d3x8hmrvyd97axdzv5fr7	6063.9
bnb1ss608acpxq0wxca89k330s2r3egkpv0q6q076f	5904.4
bnb1ypl77fddyeqrx2h2gpkq63ztnulta6f65utwzw	6010.25
bnb1lcsrekgqrt07yl070d22l8q7ajuatc7jmaa4fj	6033.45
bnb1uupqv4wh2dermzkxvqftfwj9gf923u2lxf0ya8	4893.75
bnb1pnx6ngvg5gtfkg3k7xv7wrpqakkuyjkpfmm0ku	5792.75
bnb136evdqmcpjfsehfrsvk97pdxs2xkgd6k4hq4my	5911.65
bnb15ec8kt6uqpjnf0rx2ertscyfmdq39cm65ms4aw	5840.6
bnb1snyfc7jva3fysulp90jz46cgdh5twfy36zfcfw	5150.4
bnb1dxjvktecj0cxurc27s5lnena0fk30kunhxv33j	5447.65
bnb1q62catxmf7kgq5a5m27zqqauukn3n2my499hkp	5118.5
bnb15znh3ahlmfhkf4zcmhdyh2zsa6s0xa4rt4hra9	5456.35
bnb1qtwvvd7gfahupmrmcee7a0tx8lncmwxe6r2hcn	5652.1
bnb1squ7c0m4gsclz8a3hm2xfl3zx7wqa966fhax4r	4982.2
bnb1mjdse6xxfxxfl4z8tnmdhaxfj0vjlt2q0hdllp	5552.05
bnb1tqetjwr6q40jd7gafu9vxj0k0f2uah4mcjgvfp	5621.65
bnb1ptu34ytjmsjhtpds7qhq7gzgs9tp9dvxh8z49l	5527.4
bnb1zhpz3tjqq7kc9dgycae7uwg3lemtdf5u0y7dee	5599.9
bnb1z73qfvnue5uams3w40yaczafy7pwv7f92rese7	4281.85
bnb1wa2g4k72jh4vr9erjsmw68leqptet8gyaa3l8l	4982.2
bnb1s5lvqww40ywqyg3f9awawfrdx6z9qfc6k23rts	4879.25
bnb1clgu43mv592tz0ccu222xygxy0r93asvv2whxt	5446.2
bnb18yuzq552dqwfmcur957n460zq2svksaexnwrmz	5286.7
bnb1nyqgeqwaa7payeclg72qyzyucvugl8n6a90g39	5244.65
bnb1h9zxfev58qxjf435crjwc0jp4yhr0x3289j6f3	5304.1
bnb1mmgsjknn7sqxme4vy34mjmlfm0shkyknnhmcyy	5108.35
bnb1j8zng9ev6rmct3wpwk9zvuxxx2neny3fspggfz	5305.550000000001
bnb1fy0erh8rkf8r74cgalex69ylp7mfdd30tfufp4	5299.75
bnb16ajuf64zqpkkw0kg9g5e9pr508egnech4rrl6n	5175.05
bnb1lrm54zxzq830l5t7n7w6w2vmus72j6sw8j00ax	4676.25
bnb18vdvqp5h983wd9dzc94p5t9egrvt3acv7jwc5h	5208.4
bnb1khffuuul9u0q4mxjt3la4qkj0ekn9phdm406e5	4738.6
bnb15hp7klz9elx6eg5wargd2zljj84rmuha5clln5	5159.1
bnb10pqd0gkpmpluspf2zjecdq4v4ft56vdx2adsh6	5140.25
bnb1rs3ddenu00p8p7cpw6vnat9cxz2qc2ayxxx4qz	5017
bnb1h2re75lvcxfx5y99gzqadeucr462n4r3kf0jgr	4954.65
bnb1kczlxy5d9yyymgduh7vce5jvye6wqcv238nkla	3271.2
bnb1fggeengt0m83yr2zuwft2pl76wjfljm8dffg65	5037.3
bnb1fl0zv0xjhvpg5sykcau90kz5aj7jk686ak0jpt	4850.25
bnb1aya0pyc400shvrxw00gcen0qux63lyr56xp7m3	4796.6
bnb1e6d00p27qn2arkzx96urdknjp8esfrnc95erzx	5018.45
bnb13237ejj35shsrpsx4n8f6t7wm7f6msu3muuz7y	4963.35
bnb1gtcvdjs66ayk8ftal7z37qgk863s7wyhzl3u3x	4983.65
bnb1w86r3c8s3h2gg53np4pwjxkkz587ywf2al4vql	4983.65
bnb1zpn7fyv9kfrvcf7xuc09qmcqgsgwh3hm2mxfsm	4969.15
bnb1q5xfyr0ajzk5ehqmez4l7kd0fn2ccsrre9jfve	4912.6
bnb1xaygypct5fdk6relc85g9kup8p4sw3k7qu0ld9	4508.05
bnb1zj6pxwk3xg0h9tkt23y4ztmmfyejds55aavjep	4903.9
bnb1rtjc5r9ufr70u9vv76sy4p64jgavpkhqla05fj	4696.55
bnb1efzu5w8fqr3mdmhmyax3005lerekmwadtygnyg	4880.699999999999
bnb18g7ulhx2eg9uqc6azt3psax36msdkkpd8p2294	4802.4
bnb1llhx9ru6ak9xe8ejukm7c7sksvafm0lud2zada	3002.95
bnb1eyr7lxsjg0367zs3kwsw7zw8ur2srku3g4g8ap	4848.8
bnb17dgg2uuvqc75lg437r32wzs636fwp6xkmf3396	4844.449999999999
bnb1vv7j6lmayly5qpamfwew87spp35z2ejueyt372	4734.25
bnb1ztuysyrfhv866rtac752g0yslkxuetgkhrwj7r	4637.1
bnb13j4xwtn0puedu20n9aphmns2ynflmk5g9jtmae	4576.2
bnb149n3t0k03yvfa2vy4ws9c3tvff46a7yt22pqsr	4702.35
bnb1fj20x8zj66kqnj8tpl877dy25ktxdx0zpnl5ev	4674.8
bnb1cje5z8ttc4z43ffdhr5q89ac6u73vy2qyfj66d	4450.05
bnb1zfhr5m5c7lja465s3jflsjxvyfy0lznxpz3vcf	4387.7
bnb1t4eq9ghwf8xcmzkuvlfl5n6pp5d9pnxrxk9udx	4434.1
bnb12qyay9w2fmp6qku4lqr6a5l8xkclt79sypfzx3	4586.35
bnb14pxmayh44ygftyzryfths26s97n9mvsedk2s45	4602.3
bnb1et403ll2s446rcjk5tufe2fw9rkmezgj6h7u64	4410.9
bnb1mnlx0tarwmtkgx4ld36t994w3cn94msvr2yk6v	4067.25
bnb12cxhs3900km9wstd4tehuwr6c785fql3pd0f9h	4476.15
bnb1qpnvnvggzqv72vt6gdq88v9pcj3hzsxwlxyvtf	4560.25
bnb19wsg2zjt5t2aytjjteur9lnch0ex306dfenlru	3983.15
bnb1553zyg28j9pr7usjc7cx5puvu4u7znyhj4pmm6	3935.3
bnb1v9dgna23lmsn437m57g84rw97dyhn7xmddztp6	4516.75
bnb14gx273k72u9rh9ue4ecfpeu0yg3lglt5cp5z7d	4439.9
bnb1ueka8sht9jghnpkcqcmtl2urc04d3gqmdrz87k	3891.8
bnb1yv2d5jap8dnrns5aghgdne3xjjpfk73r87a6na	4389.15
bnb139cr9zurcygf9u39rvx7a2a4gc2mv4ux64sgg6	4416.7
bnb1plrh8y036wnh722lsc6ufx7lazdrz7m66tdl7h	4413.8
bnb19n2pn9ljxasf3l86t5h2y8n8wpexgu7lyvzhq5	4384.8
bnb10ccet2wmyltj0llkugty0qyjdzmxy3ug02vlvt	4379
bnb1qtl978856v9864s6npal57wu08tyn30f9npr5e	4344.2
bnb1375tzqwyjptccjlnylzkz3q6zslkr98y0cj48h	4352.9
bnb1t9vvw0vghgwcv2u3qwfhg2pp6h2ru5hmnamtd0	3974.45
bnb1gu339509qec3n3rvjwu39zynm8v0z67cp28awh	4147
bnb18l77th75f7qphrsfrhwkvs0276x9l9ryzn34sy	4302.15
bnb1xcmayyzgmnxmys60adkyd5uzfentes8u0alx28	4290.55
bnb1dn4eydu2ggukvwz5lzegv8sk7r6636607vf7t7	2092.35
bnb12jzza498kdzd7hxevksddq2m5f3f9ncjgfe6m4	3949.8
bnb1q358qnlr880mx45tz8xvqqpqmup5maraqqnfjc	4062.9
bnb1qt53uw5r88uhhnla65pujzgaa6pe6ll8pc7e3v	4057.1
bnb1xysz3v7f6mk4jxz6l60kny7tku384tw9ztkc26	4075.95
bnb1mmae0cp0f7dtcy34t9jsr37fdwtge66xsrjpux	3986.05
bnb1kfmvygat92s6dt238utqe2kv9xygvsvf0rwqxx	3700.4
bnb1hph5vfw7ec7z6t6mccwk686c6rtm64gzxx8p8j	3783.05
bnb1x5h86esfpxfn074m47wshlum2rp0y2w5jd98d6	4044.05
bnb1aqjys3p6yp4f2fl448p8rdm68mgh0hsj9dkvtk	3958.5
bnb16q80ym3apgr7ykck9qmmxe00ee2qsyqqk2ncjm	3999.0999999999995
bnb1upuy4dfemc2gechyaplaqsa2qa7gp0g4wa0ae0	996.15
bnb12f0p2wn8whmykymundfrkua6xrzvxhl5mu8dtv	3984.6
bnb1qxz2sdq0nhctjnq702m555xwx508yvlyrcn0jn	3939.6500000000005
bnb18e5g063mu03ua3l3pgzt50uaq72l4z7wal8342	3964.3
bnb1wuh90k7d26dl7jaae36ze5y6mhde22kpej53yg	3959.95
bnb1dpdv863strffwpldzamp8mllqp432e4p6d82yh	3942.55
bnb18er3agrgu0523nup0qytqs52884yf4ff0rx4jy	3891.8
bnb1au60fnr53k822h3dt2lurtac8q75eafzr8nl6x	3861.35
bnb1kd5r9gddely33s3a8xug2fqzh5w9nwr5f43284	3846.85
bnb1yv5jphllhsalk6udzf9uxlmgexy23wk8kxvz79	3812.05
bnb18y3us7fgqxavwph0fvqemnzjuvqkmtcc4k7lu2	3671.4
bnb1s4cmttz0vlz884x7mqrc47wzm3d7nf3snxr0nu	3693.15
bnb1mh7ddh08mfmrkd084295pgrny783ckv53dqjp7	3693.15
bnb1rn7lhddkk4ezwff6wszpzmm42rpfv3c26sggsx	3598.9
bnb1t4x3tykyugz9jxhtm93ksamqyh76swpp0hrj22	3607.6
bnb1ghn7dkypm3y2enrqjx827apvsrxtv2cz72mv80	3256.7
bnb1c5gl3stacry8q8g49fmcqy7j6dr4sqafxsuuep	3445.2
bnb1dwxpxgc7t2yt0qznspf30x9ve4676rjg527vkc	3614.85
bnb1s8vrujk0s7dpc8nsc04ka48z8ymsdmf6zt2sqa	3604.7
bnb13n4a3lkjl4u3ec7s3epxl9y4eelcrek0mz2dgm	3549.6
bnb15yt4ymqgawgngvg5r98kr0v3qssqcvhqqpsx5y	3398.8
bnb1recmsxkpzqcsh92jh9elgnhhyxkspqqg974w7u	3545.25
bnb1ugz4pnt724mvh369kun9eqdkrg6zytvfvyxjqg	2989.9
bnb166pngqahg6sn2z27ztx9vrpv3nrdgahlfddyft	3378.5
bnb1z3wpqx7phyqp0krkg4ulzw30x2zjt2hhvdtefc	3461.15
bnb1agnj3j2mvctxh5ck3d8t2nve3f3sev5mrcxsvm	3397.35
bnb19q68mfm0rvgfrdsnu4lmld6atmxcxwcdm3687j	3366.9
bnb1r28td6ewqnx8szyjlaw9nhpeklm0af9yphnkns	3262.5
bnb1vhxgdg8k650awk8v9d3fayvuratx55fjra8hj9	3136.35
bnb1vz723d7nxhrj54xsrtcy9dnwlnhgq5wjejjyu5	3304.55
bnb1y9q6z5j3ufsjy32h2sn0f9ts0032hfqgvlwqt3	3324.85
bnb1q6h5rpeaw0plfg5xtlqq4lkvyxr02f5fpeq8m6	2737.6
bnb14hdkv6dvs23gn06mazvyg7x6akmtw6h6tfnpnr	3317.6
bnb1ltkqqar9gflzlsufftwn0ncjct4gd62h0qcx99	3024.7
bnb1s5h9kmvevmkr26sud2g272rs64a3ddsgxf365m	2940.6
bnb1f9a3mwatucs39qxwnghwl90nqp6kg5atgxfs5x	3243.65
bnb18w97408dmz4gsgrg6e79svpy9tfyg8lm0qads3	3137.8
bnb1zg7venh02tuc9zdk0dkl88wlvyaskud93d7ql7	3192.9
bnb1034utk5uhgyu2htmlzsm8z9j3vvc5ctyd9tkyx	3205.95
bnb1avw0ahyfrfqe53espmtzw63aj0awxnljq83vj8	3224.8
bnb1ureyp3xav7q9mwjkae3555fjvmauk729h06796	3140.7
bnb1ft0mvnap9q537dga53vuvju86vvdcy0gtcwy9e	3203.05
bnb1ud20jx7f3kmx9608vpyfk3y849mxemp9t2wlck	3140.7
bnb1fq2vkxzltczwm8srgtlpqph9jnurd8e42gjyr4	2989.9
bnb13emzrfrljh50pyd4ua6lcrrkypwjh8x67tk7dj	3095.75
bnb1wrx0azvjvmy94f437kun0wt9l84dj7dvle3ktw	3095.75
bnb166yh56yf4e0k9rjq04afga728sggl0czt8nrrx	3079.8
bnb1xqc0tgsu0a54zrpkmtsmt5dth4gvjmv42xvw78	2451.95
bnb14rg9ev58w6d6sqjn08erzxy820h5003ad7emk6	3040.65
bnb1xmvk5uxlh2csecnf9ppy7wtvcw5jutz6v27xz9	2685.4
bnb1qk2e6dayp9g236s84s5dwgacnxsxz2a8h4kkql	2798.5
bnb1wj5zjupnll38mervwwe9ghlc4adgn459m9p0kv	2963.8
bnb160pjusqjedxmrzcfg8yj8hxryezjknlvfdgue2	2979.75
bnb10295q4cjk37qn2glvhr3yenkazan7x8hk74pps	2950.75
bnb1gnn0mvuw5j8e50g7mzwgsrchs70c923ddnpqvz	2846.35
bnb1a042j5f5gmp3v0dpuhh9j0gqyazp32k0uvhhxx	2847.8
bnb1vxs0z9pgl94me8tgkvzlg0eqm4ueqpnw33ergt	2760.8
bnb1w5nj7vtfnc3s7y0x8t6pv004vpcsnkj8s9460t	2857.95
bnb1ny55md9z39kd0s73qtz40rfun0zwy38m865mqn	2682.5
bnb1dkwqzquwyrck6ka2ffaqjurreaxpkz3n2lchc3	2855.05
bnb1kgswu025w5temdlkvxneezv4pz8rcpj4d03rtj	2840.55
bnb1jgk2maa6p5njc296k9m2jrfj3j5w9zguywvrj2	2305.5
bnb1t28tus7qgkqnqw9wem8x8s0ajs5geuy33dzv9k	2830.4
bnb12953mal7nwzc54wddzfg9x0w2etmw853pgw5za	2715.85
bnb1zql5ltnlp5tuzen5pk4dd43an4ztceauyxkhpm	2801.4
bnb1p27sdg30e7ls06jddr5xnjhzp9t8cmkld0303l	2752.1
bnb168qmavm5n48jm5cxhxghw3cl8s7pmftc6tn8l6	2755
bnb1fg4pg2m5p87qwknpaum3ht78yx5exh7tfujzuc	2614.35
bnb1nyytapwe0py8ar0qzan26ex3kv985f0f9h90my	2599.85
bnb1lr5dhyke67ms9mxk33z5r09mqdeuml5ck7m2p9	2161.95
bnb18ftvh5e8nkwn6468ay3rdhe7ja54hks9aul7gh	2614.35
bnb1uqv5sl9wred4egjlyfvjz72t744zrw5c3t8x5n	2591.15
bnb1fhks7ldzcafh33e683hu870me95dpnu3kh5f7y	2588.25
bnb15t369umx5jr8pv62zkv3tgug352nf926atj3fr	2576.65
bnb1prczmw9ev6sweg33ggl7ctmrq2qwq87cyk45x3	2356.25
bnb1mwntftfjchtfdty5sh4rvanm7vemryyz9xh68r	2475.15
bnb1gm20hstancmq8d5h35cvcxtuq7qz466mh7fj58	2502.7
bnb1t4nac022fxhwpz7gpwt5vvvjncmcwf73gda5ka	2494
bnb1ra8awp7hlmrwpmtqmagp89w0j2uv5625m5axmt	2250.4
bnb1w9rlg3dst6tq58y3zn0eampmdjwl7axnac74ks	2324.35
bnb12svujs0wshaly8emjqmwxuxv4uwa3kvqve6s78	2457.75
bnb1gewz5qpn70tk2shk0s6zemrpgfjv5qf4cuj30d	2192.4
bnb1xdfnxqp9cuzcslkft39ny6rwzeulkx6lfk27az	2391.05
bnb1wdhgtcyxtjwu2whnrv302jejamf4r5xxgs8njh	2340.3
bnb1e9uxcsx2kerpm7fza34f20nsq08z68rjjx7pp0	2395.4
bnb1l38vlm7rwrgy8gx7yzp9wkq55r76vasswtv24u	2383.8
bnb1n054ad38a5p274kz0uxuvwg7cv78w3xmgve30x	2379.45
bnb16zks743gmwftphaw98f4m4mke2dtshdr2wg8he	2096.7000000000003
bnb1qq63jv6zxw6egj3ddz9kmu58fn3tkfrqdg0ahm	2285.2
bnb194a8cndtrxnrpdnqa9yklzz2wh69nrtj49saea	2154.7
bnb1q6w5dd7a6xhn4z92cjh7e3lqh9ynys0cq9s0cu	2192.4
bnb1ta4uufm80a73e5qw2wl8gxe7npjjwe2aufkgzc	2247.5
bnb1j7ujprl0eu3aej3rsw4m8vyz28xgd5hfrgfc5p	1335.4500000000003
bnb1l0uwgmzczyy5cl8vgwed5g6l0nj774lxts3fgp	2305.5
bnb1d4vkzqwutcfahzc3thuvqsh8kjdzguqhjrndpu	2179.35
bnb1v3w2ptspghggcfc6nclvzawg8vzzeasmsjpt0h	2260.55
bnb1lzvumkuhr5zavlarq2xnuncfm4hhgx49wh7v8f	2088
bnb1t3xemvj9ywjhq7vjdlzpafed0amuq9v5mmg5gt	2032.9
bnb1nwq83hng5gj6t7gyee305h4dv7dygsz23vsvnm	2259.1
bnb1j8g4dyrnnwygwycmmgjl35dmqgrvfmsyewpchs	2193.85
bnb1mvg8fw0nhnazpnswwgs5dln4lvdexgqca3agal	2247.5
bnb1ml7gslskcyz8yp7tqjm2aqyjjlry50map9s5k4	2198.2
bnb1kg5wpqz242mhhxxqx0xmw3xkjl2qn3smaw2j0x	2169.2
bnb1lre0y6f0apnfxzenan8atr6pkrnrh7w543sppm	2150.35
bnb1eyd0wv26w75krla2zpgcmhv3xeq7zcr9wd7jft	2128.6
bnb1ruxq9kpt2apu435q4dewv8kmcuzc64tvc2vnvx	1929.95
bnb1esvguccxrrwf5njfm77yumfntp0zv7jz3kxaye	2063.35
bnb1hjlvzem6zhjllhfektggrw2ksy4js4pe5tny30	1992.3
bnb1m8avjzhzc0z9hps0ygcd5jw2csgj9nsn282uku	2043.05
bnb1awjz7yxpzw4yvxfy2739wt58nztcsta84edx2k	1987.9500000000003
bnb1z2az70sggtsxy4ft8jqlae59gzn08dk8s82ttq	1857.45
bnb1p60u40ln46hurmz8708xhzakm26z6r8y6ny0fv	2005.35
bnb136vyll3taevqahu8l63plc43yqa0ku729g7tdp	1992.3
bnb1yvrq3km5y0mjh7yxjy00rjc0fm52fnlts25e9s	1960.4
bnb1n5sax29prz6d5k8adpq6v8kr6pm6rl8rp5sg0j	1909.65
bnb1r8lkrtutlc4n0ttz0rzlfmlz2jj033lah5syzq	1851.65
bnb1amsjet7uwp6xf2xumv0ahgcyenaxdpnhug8rst	1683.45
bnb1vq8myp56cx8xm45tw3tsk6s75jsd89hd503chf	1771.9
bnb1d2llfy6r8meh2efe7dx8n5acpk0wyq5pz8443l	1889.35
bnb1fmjccwaeqrwlx7u4fvp3qldh6gx0hqj7vfsmqk	1555.85
bnb1r26gq7pwap5kvvaddtrsqcez5tzr5pg58fvq6u	1813.95
bnb1f6mtmaceagkeg3pvfdm8p6w2sx5yp8dv9jhwcd	1812.5
bnb1slxfwsr9ex3tury8qp9lnsvta2cza34hgdtun8	1521.05
bnb1hv4gksf79y2z5znmgyqj8cfxy7qka5cxfls750	1811.05
bnb1ujt90k43llx2gduceeqz2kmr2l7jfl4mv8dtsl	1761.75
bnb1zmyu37nv7cy4dv8u2jevxdsn2kw4m83patqp9k	1747.25
bnb18809ereazz4pn6ep7qww59zymuhvzk8ev3t9l3	1761.75
bnb1vrua95cgfcx8ehdkuq94s6l7atm099jscy3gfc	1809.6
bnb15ppvh5czw698yqkffxel608p5kdfu4wdqzarus	1793.65
bnb1qwzut3t3w2l54tlfdpcqvvff6f87ds53u6x53c	1708.1
bnb15l5yaa0lnvtqjxzd7w3ft4ht8ettz7gjk7rkhx	1755.95
bnb1a0tq66zdxraxcmvj8h037h449pq4wrxn79k8u3	1763.2
bnb1e6nmnnr7ft8sgzrr42h6adeqjql3rn5u8g0jzt	1726.95
bnb14j3qrp0vhkh07xqehzdfnpr0xd5207zjut7vuj	1734.2000000000003
bnb1m0ltn8d0y9eajkh09w5j6hw8r8554wewr0aumm	1686.35
bnb1tjryu0d4typp6j0k7qkvyr96hgalc85ea2sqjw	1699.4
bnb1r04p29xa834hckf4pnvuy22dxezm32tfl43klm	1683.45
bnb1nxfk6u9h887fd8pza9xtwuyxt0mpzmt5pgj7n0	1682
bnb1jgc7ssz8anqmf6dktlmy83kr7ar053qkf8nl6z	1528.2999999999997
bnb1k347q96j05mwy7z687xx2hdl6rnlnp33gy02tn	1442.75
bnb1wz8jf3lwwpdzc4p9cmst8d7wcey6ll5l0d32q7	1638.5
bnb1c0arx8596ccduwtxykhnye2z6c2w8fsjjqj30d	1329.65
bnb1vr9tqw4lg6cpderfgyuqhpwzhpt4l2wl99t9yy	1545.7
bnb1j9vqmqnwa88x7ewfk2g95w709pttk33aqwa55s	1576.15
bnb1tydge2vnr8evq73c55thg76zl320uvsg5efvhj	1564.5499999999997
bnb1l4hflash0xtrdeju4wxn8lameg69fw5heed6y2	1577.6
bnb12qy65a428mnj6lx5gzvcctww6h9symv74vezrs	1583.4
bnb1uhw3vta46y6ymvrg8xsl2tnuqae5d4v6vv8a9s	1294.85
bnb1mvfg0n0437zgyyvhxlvd787s3vrdjzg3hv00ya	1557.3
bnb1qppgwudnres9wv9qfapp07x0qsjq9f3lkxmmrz	1552.9500000000003
bnb1keylqdmehw4g6pj9sjgzg0g5rl09s9dldjgda8	1471.75
bnb1mmxv67a0zmls0cnwpevcqjj7ryrqplrwtyccfx	1448.55
bnb1h4uejj09xmncz27yghjyl46jgf2f5wuefpnvza	1400.7
bnb1r58tdmg7x2ly23pvm7pxvcwn6qmyxata62s6uk	1515.25
bnb1ten9yujz0fxfjdfqdxl340vc2v402sz7mc9c3y	1451.45
bnb1hrtj2496xzplq5p8q6ahjq4gqgyfyh30d5wapn	1450
bnb178yfv4mtshsnect90y9twkt3tnu9wdfz2jj96d	1390.55
bnb1u0zczxfw074fukdhq0422x635vvk7sutt2maxy	1400.7
bnb1xgrfng7metfu72cxkmxga6nzmajevg304h4nsp	1332.55
bnb1eh4t3pdectqku4t9c03e4qsr9amgnyxe3tft9d	1390.55
bnb1gf8sy22prepvvcuev25ycjmkds67zvzg644tr6	1245.55
bnb1ydz8u4zdyd43p6qssxa48eskxarfcyfusdphy5	1386.2
bnb18r9ujzrrwcnvjfy7dvt8kxvv6eh0axxsptajs6	1274.5499999999997
bnb1v6fwju5xgsgknw56u5hfwpyfyl0zgztqjpadk0	1135.35
bnb1e3ss48f3ehvgafnfyqqsu227fxsqv73lqjfzr2	1255.7
bnb12lzpedec5p3325stlpny4feahh54zawywatqze	1065.75
bnb1vp798vrv0ceyycns8kp67l06c5sx8kqxzvs405	1190.4500000000003
bnb1mntpz3h7n7tg092vh8f4230k6j626ymrflwel6	1336.9
bnb1gmkjpg8dyzq5yy3gjcudlfue3nxt4rzp9nfukf	1320.95
bnb1qfw5kj5qq7uk227fu9yvdnskhkc4a25srfq97t	1315.15
bnb1lkfrmylsfynet4f93punqxv63dncy4pcqgzt8k	1313.7
bnb1tead52fnpcql4rv2x4nzplagvph5htd4yqpsp4	1148.4
bnb1ghfz92adlam4e0fm82c5cagpxtsuff6j2srt2j	1260.05
bnb1lv2v2tgcmzhhk55v62gynxryvvvzymzjc95vlr	1262.9500000000003
bnb1m809gp5x9fscj9prqyqnqqh0p9ute4fzjrmw3p	1213.65
bnb1jmwcsnkg68d3dexac4p3czctru324ar226mlg0	1129.55
bnb1c0zpzpsxu57vlv2d99fqwv0f5g9h9yvq8nye3l	1115.05
bnb1wjg7wh6p0uwfupj3xnk97mg66rtpdut4cevxuf	1074.45
bnb1jxv397dhskzhqz2adyxp6guwfy6dh27fmwputv	1133.9
bnb1f9q2k2n39uuv3qa7rkhvavlgnqzq0390ckze54	1116.5
bnb1cecenufq8q9rud5pudzhga9wc2xmw09uu6dlpe	996.15
bnb1gnw6fae0xl6rrp2qzvyttfq7qvwv59almedjya	1042.55
bnb1jut78n804espeeguqg89d9mwy5w2xu5plgzsy2	996.15
bnb1ll2569gdf9j9amjaz8l52dzd2370wlvpuf8xpf	1017.8999999999999
bnb1fpnqvscyecnea2jj5xtrngudtja9r50ehctwx6	1007.75
bnb1t2v32am0wat33jex2fdrsqs9tlhpc7r6w7ge3y	1006.3
bnb1a80hd40jpk9zd6amp2yclt93ssfzvpckpwfuk3	1041.1
bnb1tx8t36avy3h9x3npefn40xhzv56lhmhcywxk7l	993.25
bnb1kpclqufs7cguz4vjmgp8h723gx4fd7k5szsl96	1033.85
bnb18ygr88sgznxwyfkd5lmah6qfnld2434zsym3nd	996.15
bnb12yl0ntezxysmw99hrkme2gn6hy3q8ctgrzd656	1020.8
bnb1te50hcat3pzzkr4hy5thlwzx9hfqv7zc70q3vs	936.7
bnb1vfjryppcg6xfm5xar5xr3fg8s4hmt9atgdwxwt	959.9
bnb16r23qz0u3mfjgl82vrql93j4jm0z9anwksejeh	810.55
bnb1nqmrdhp6f2vae4u3f30s04wd4gfv3u9mj86qrc	996.15
bnb10qeezkrd5n6dmwkhpqc004hll6nac0lm433nhk	822.15
bnb13036t9m592njcguknj6gngj7y8pmhung3uxvvu	896.1
bnb1ppce4hwpedg0ws4t8r8wqpv4zls0mmgh6dd9r7	939.6000000000001
bnb1q7jynusul9zzuktjsqzawfxdkl5460m4q8lahz	877.25
bnb14ux9afeyyy4ug7dyyf6qxwfqs4numj85vu2l9y	906.25
bnb1umayapmu2t3urel86zw80zg0ylnmq6zdf6whm5	917.85
bnb1zrjnml3sxf306p3jaezt23xle5z2cy74wxr369	829.4
bnb19973ue8hemdhrgv2uz8zgqmqmmunqjqlul8u6p	912.05
bnb1s7h0jj0etxxhdxmx0gfgx5jq5yf67xcgqayxre	916.4
bnb15p4lgzx8r0lrvhpnl9cn2fhp5m0yy34y5azc5q	916.4
bnb1wm9wqx50499nlccsm9llx6a0tmjje04dxcxddf	548.1
bnb1nceda4h5lmsj6tgg4xq8p64ahuashetqr6d3vt	877.25
bnb1pj4lhjtapx7ghcrmgay3nf728rq6rq6d8ag4u7	854.05
bnb1mmu3jnt702ax8s8tnstyz22k5v2zuvsa8ns9vf	877.25
bnb1fv6ekc2acndgvvtp39gyc7gvd4n3cw5hd9naxv	833.75
bnb18q360q63yxc5etu47fhqcvknxkg2vtmrl4tw5d	817.8
bnb1vqsshug7fqu8x233se2qzn0sqjckxqnpuyw75t	794.6000000000001
bnb1n8n9r66he6ju6dxhqnd5glwd9vdluj56njee42	783
bnb1zw5c0vg4nl9pfgg9h0dhfytpzc8mmncd5lar09	784.45
bnb17gewc2uhr6gnkzaawp7efuvs2mzd8lflkn80sq	730.8
bnb1raquzyk9xhq295em6mg5yx4h304vcxe47wsejs	752.55
bnb1f95r29xcwnhnym7mn2axnk5ycv4rl03d5qhpl0	667
bnb1h44jgrjtw76h5ezyjqgsa2kve4mx6s5rfx9jpj	743.85
bnb1dhhxrpy5ayvh548uh2eveasptjv50dk5ujcyma	717.75
bnb1cahpulkpdufuxxlfmxg69nuk8dmjlgagm58rkd	697.45
bnb1765ugxkdy7rqgtpcy0sj9l78ckcmqqnr8xxuvr	711.95
bnb1q0rgvhwclmc2y6t78zkmkgg4umamtw4ahkz2nj	722.1000000000001
bnb1a2zgjdpefqyuwwjx0n4n8sx6l3fmg3yc7w4ppz	717.75
bnb1qveevplpu4ndyrs67x0hlder4tw5w6amcrlwus	533.6
bnb19wh0dusjzvwxze7pg8dcxw4x4yg5fvtssssaez	684.4
bnb1c0m4dhn9p7ca8l9ct8zce6vkumj72gtxvy4j7a	696
bnb17kwk6esla0rk0yzxk80gmpg4xgk3rek796s59p	546.65
bnb1r6xxc9ufzze5n2hlt2vq5j52wtamysj2ax35qh	671.35
bnb16xwd37e32uljducdtf20ue44cgmllfywrw80lc	572.75
bnb1p8rg24v0m62h49qu2c5mzkqce0rkmjnaevtg5g	643.8
bnb1mfdxey3h5ehy4wtyawck439j86kl4w7wlhuqxl	639.45
bnb120mx7xv06zf6mg53jj5d4xx6haa58688kmujwr	639.45
bnb1ktc3j0j4eg7k8j7yenndk8aj8tvsqhyjae5qav	632.2
bnb1xeujq9nl3jtxxtv9xefx2r76f3dt63hggef92l	623.5
bnb1rve8xzp032x9l08ej402jxakcjymf572klzrnt	609
bnb1azqt6thww0d2prnpl9dexm08kfc8skkx6f6jvd	603.2
bnb16gnwqqkhjfca7kwtx6fgzdyk7vvnznm86gde5c	566.95
bnb14gdkzdnx2ysg26zvgffxzjumydkx3vp36rdfql	597.4
bnb14fvn93n4dsquymm7mvnp8wq0a8snp8ylaf375y	587.25
bnb1wz0uv538c7lsewll7f85ggyk8rm6j3zqsgjqwh	603.2
bnb1798s60dxzyhj75pzfa7ms0ntzw2e2xa5dmcfkz	600.3
bnb1xl0x8faat7atrl2q2nxxjp57tvjctcldgmx809	597.4
bnb1pmdffgyjxgnmcfn0a8pq7mf8scys842l39sksr	582.8999999999999
bnb18r5z09yngwrvkm39x9ms536u36lenatmk58cr9	587.25
bnb1dq2ms3k6497fgvrafusecugj7x25v4dgvwaqmm	464
bnb1hcpst9s56pgz63tesys7qvcgftgqsz254sxwwd	498.8
bnb1jjzgrvlmwcas03vkca90t2sf03qp5582kmwyxv	527.8
bnb1ztpft6wcm5cc8vflku5ftlu4xhlfq69cysu2fg	487.2
bnb1zkyv6qf2h5yfe3pvwrlzuaq4x9stxmaasrln4s	498.8
bnb1vevk963k4cxgctcqcf33tl6whyqrn5ywqmyx6l	498.8
bnb1vcls2wewc2c7cnhtqhxuapwu7rjkt7u69yy938	500.25
bnb1wrjd9ncps5d2t7gntn3te7e2greaqrgtpjhvy6	498.8
bnb137kruuk3x6ux9wt60wcd2eyv6zw7fnrwze5wn5	468.35
bnb1r2j5l9qe82npfxh5d5fuky38265k6zt7h6lf7l	469.80000000000007
bnb1rzdp2skq3xnsf8s0ejjngdsdkgf6r9x7qjvkkw	472.69999999999993
bnb182k4kawt8alsvnch39kg6js39allttlqwspgk3	458.2
bnb1nk84xeyyyt35qjczdwfnjw7v6vd92crzrcww47	387.15
bnb1r0zfwlr835awjnccenywaq7hwz3jgegmtqja6l	450.95
bnb13cs99gj80zdk9fge56atx7zsdltz47p035yuuf	432.1
bnb140vcsnztmy6c90tsawnerctu2tjhy760aqwecz	423.4
bnb16avgwhqa5mw8zvleehtf3p635zn8tflhtngylx	429.2
bnb1mrdlc3kvqvu7875z5jtcjzcp7tpqvfg7vh4s0v	440.8
bnb15fvnf4tyzl42jecggzvw0nkkv350xh86cwvjuu	398.75
bnb1ul3tth6pe4mfmle8edvjfswqpg0wc7uqztsy60	433.55000000000007
bnb1k0ahjsk0dl2u4rpjdsamlyysvtu8aqfw9wurkx	392.95
bnb162j04v5tuhhr30ynlfgnyv3z3k59ena6qwndzq	416.15
bnb1nty8e20424gxes2wnvmeevzwclj4mfjqlzxc0u	398.75
bnb1vreuwlmyknwrzle6320cmfu82kp2zzptstlsjz	398.75
bnb1faf7wd7lf87uw9qtcvjeklcewm9da2p455ucry	408.9
bnb1syf0ue5sdaqvz8pnynmnnpvhj7n57dufnkgd9t	385.7
bnb1uehrre7sdha2j2d3z6hmt89ph9dj6rvm30pnug	392.95
bnb1g9v6tdyv3gz7jdp0qx9qrmkw7jcp0ym7q9q7af	365.4
bnb1qqm4wjp5e2ksz5neuxtgpy8crr9xj6wylf5crf	298.7
bnb14xwfgsd85v4ld95qj5v5hcrl28se6xfv8ywyxe	342.2
bnb166jj4anhx7ggd2s4l6spqepgpan23vrh9x6kzw	368.3
bnb1957ec68e8x9jlwe4dmjna4qm3wmsm39nx77f7x	324.80000000000007
bnb12yey4zvhzd072q6ds7h8md7nh5c6xdhz0amvqh	304.5
bnb1djj3hdapedydrp5wamvctc6myp65nt87zmnkf6	355.25
bnb1trrhtlrqhjzmn6hj39crmm36357tldtkmsamnc	361.05000000000007
bnb1v9r6kxwcg32r6mcmkte2p6ps6c9ka8fpdga6am	346.55
bnb167g0lwryhq788eg7u2yrqkmfst7gpkzyktqz5l	298.7
bnb1z03jwx76gsagq3wks97n89s0gs6fz2p2zm3npw	287.1
bnb1pdzdgcxezqmxj0wj3092pnpppz96j2zqlh78z8	333.5
bnb1xruphelacaj3gykh3fnm0y6gvxxyy6enh3q0p9	308.85
bnb1llljhk7u02fl4ztzvga87zagt89qrzght4ypv9	313.2
bnb17hjv35kklw7wd2tna9hu62eg9jc4gz9egal0el	300.15
bnb18mhrwap8jpdjxpg4ck77mmk5f560msh9t80afx	311.75
bnb1vypf0eu778wtzwn4t2sgwr6sdm5h925dfcwqep	298.7
bnb1mvexxgh993n20m6jd8x8zxy7ltzytcfupyc7jm	274.05
bnb1s5l3l6h6xf6waay6qfcds3wxchyr68ctnm5rqt	262.45
bnb1y9d25q7jl6pld3v7h6scerp0fm0wgvgew7lf70	249.4
bnb1g5drx6skah0rm4ejefdfahlsyfkrneuudjtr3z	247.95
bnb1xdtz9n75zddm40xr84h7g2zds67qd2wkpfaqwx	232
bnb1rucnahf3yvj52l5ljah2gh945pze2qxz7h254j	252.3
bnb1rm77gyygyz7j8dfgv47ffd3ccep3exfga7qp3g	240.7
bnb19rnmr90wxjsmazwgupau88avm6zly5p9370qqw	224.75
bnb1ja6m05v7ccejcwqdys6cz2vfu2q37pj92zrx4x	245.05
bnb1tycq26ase2h9zwuefd8uxjnkd9sn0ejev38txc	198.65000000000003
bnb1smahg0rn35ga6ql3dxuk7uwns6u6ec4sdsxc7v	233.45
bnb1cs4aq78atxxl9jl0ws4a6zk0m8mycan5s6rwjr	230.55
bnb1fxyrxzx2dp7m7z3fwa5n708y9gh836kj3c9y77	230.55
bnb1tnnhrt9hphzqmn7xc3ts2azekvtmm693tjvglu	230.55
bnb1r7dja45296xgxuw70rwcs83kdrhkg2qndmwuet	221.85
bnb1u29z2cc5jyx3je85tjsquyvafyz9l367frtjvu	192.85
bnb1spn4d4ktjamqxl9atww8sre7rjehpr4x4ezh4x	208.8
bnb1jvulqla3m60duttrkcq4yv8l7zfm8aly5ddlka	208.8
bnb1n4yptlvz8przxrmg55vmg3pxfsts8ckuscvtt0	198.65000000000003
bnb1lk46udh425kukqvrchmsyqeyvah4lq0phds9s8	192.85
bnb17cjygxq28a9urf5y32tz2d2jsy90dz5yvt0fel	172.55
bnb1y35ywtj4w6jkpllyp2gqqgy3r2uj9qsh8mxyug	181.25
bnb1ww0krud4txhvxxug7s4ele32pjhpdjgu8zc0tt	172.55
bnb199fuk8rpmgf9c0xf82cajlxn9rx7vguxvc937r	176.9
bnb173pgpamlmlhph4mhwcnmk76mzycft889w8kj5j	176.9
bnb153xwlgl34sc2tnn0gfx4r32hwh4up3xc8v07jl	174
bnb1pjx8dck3g87q549xw8n8qdsynruazdayhxy8z9	165.3
bnb1z4xmpsrquttjlzvz5ahkmertxl9lu3nztym9nx	159.5
bnb1sj6vzk3vrvdnwwhmldxxtn0t8mzg0h5ll4cqgm	150.8
bnb10yruxsxw2hy2unwrz6upre8snyq9dstz3h8ugr	147.9
