[
    {
        "week": 1,
        "tokenID": 1,
        "members": 33,
        "memberArray": [
            "0x5fb4a0983daD1A0fae31ED67F1aaffeA3F3E8eC2",
            "0x0B7dc67a6eCF6Bc0388409DDde919aaFcF0E0ff7",
            "0x0551b8c8b1C7Fa0B066fdBb854188702d01bC64F",
            "0x8C55615279E0CFAb39944fb7Ad6626dA3b98fed3",
            "0x38586444200e0DC6938c8d258fb15FD14EB619b8",
            "0x145309F6779bfD24533082Ab5ca1111A00016815",
            "0xA57c1Af56140A195F876310414C34fE9FE399D87",
            "0x76a95d549Ca36d955Df2c72F693690d8e51a94d0",
            "0x76a95d549Ca36d955Df2c72F693690d8e51a94d0",
            "0x1E0b16d340eD938A71467998e997e995110eD596",
            "0x11C8D4C8d0FF92bE67eFD2dBd860654BeB102687",
            "0x2F1373cd12926996A0440D09AdF5453174bB4441",
            "0x1E0b16d340eD938A71467998e997e995110eD596",
            "0x02CA4101eA84f400c62b3BeB87Fb5450a8702941",
            "0xE77652a153b6Aa41b6D6ac2cDbd4d9DAcB72306E",
            "0xF31171daC6C88C227feFAF0CE6C5003edA1A87E0",
            "0xE77652a153b6Aa41b6D6ac2cDbd4d9DAcB72306E",
            "0x3558f346fECf745365fc2944d8F9ae970aE21759",
            "0xCF96021f1ebEdc4b772347583323b194c7d55dA0",
            "0x9FCAE73fbf4fC6283B636f707c17529c2ba7b684",
            "0x4A11a811e05FdDa19A17E34ce1C9C8efD2018cc4",
            "0xCF96021f1ebEdc4b772347583323b194c7d55dA0",
            "0xb00E81207bcDA63c9E290E0b748252418818c869",
            "0x4A11a811e05FdDa19A17E34ce1C9C8efD2018cc4",
            "0x9008676d9EcC75c506aAd7C70eBD55523fcb725d",
            "0x76a95d549Ca36d955Df2c72F693690d8e51a94d0",
            "0xbef32030aA223A3031e3b4C5b24fad66d992413C",
            "0x76a95d549Ca36d955Df2c72F693690d8e51a94d0",
            "0x064523542F3114bcAE8b1eFc69D945788eFBe492",
            "0x38586444200e0DC6938c8d258fb15FD14EB619b8",
            "0x0BaBd8774f4FB8904184b0965204e5A9Db43aCfe",
            "0x4a5BB1c9347A0d4F7e06a29239162f03647d9232",
            "0x3558f346fECf745365fc2944d8F9ae970aE21759"
        ]
    },
    {
        "week": 2,
        "tokenID": 2,
        "members": 33,
        "memberArray": [
            "0x5fb4a0983daD1A0fae31ED67F1aaffeA3F3E8eC2",
            "0x76985F8bD32dE258dFc8ae497ED5F0112322D078",
            "0xcE5cDF7D5072673aF0062E5A7241E69B6618b649",
            "0x2F1373cd12926996A0440D09AdF5453174bB4441",
            "0xB8c1f1ed17DA6FC4AC2ED6e8EdBb9b7724Ce44e4",
            "0x0551b8c8b1C7Fa0B066fdBb854188702d01bC64F",
            "0x980C8D51202532d34647aAb766993a6ECC9d0a59",
            "0xBab49827EA9f5459B43FE239cEE9e2457351D2D7",
            "0x4a5BB1c9347A0d4F7e06a29239162f03647d9232",
            "0x1AC49508F7C1ce2A796517269deFEFC535050Fd8",
            "0x393e0f1dABF3Bc25f7747068Ab9Afb9bbAf82970",
            "0xFCC8ed5bCDdc5002804b0a0f48ECDA71eD094aF6",
            "0x69F329EE79C98A94765e4105aDFd5a87458d919C",
            "0xd470b1ac529a2bc704b6e7467485d52569daf2c1",
            "0x1AC49508F7C1ce2A796517269deFEFC535050Fd8",
            "0xCF07D97889f1b2c2BdD8c2C91B0a639F867B00A2",
            "0x378bde8b897D64F4047189C3F8b689008A560bad",
            "0x0551b8c8b1C7Fa0B066fdBb854188702d01bC64F",
            "0x980C8D51202532d34647aAb766993a6ECC9d0a59",
            "0x612112d107743FDb4c64F7990A76B01046bFB812",
            "0x2F6102a60813aF809C8dA5f46Ceb1D022dd718f2",
            "0xB677F5e503cc02B7A0d358Cf6EaB2196b3932709",
            "0x38586444200e0DC6938c8d258fb15FD14EB619b8",
            "0x4A11a811e05FdDa19A17E34ce1C9C8efD2018cc4",
            "0xfa6eE7Af7BaA1B174500d1A8275995EEA829453A",
            "0x9FCAE73fbf4fC6283B636f707c17529c2ba7b684",
            "0x6253e5478d686E943c3751a392B523072DD97676",
            "0xDeDd3D2a2219458eaD3afF1C006a759489b94106",
            "0xB677F5e503cc02B7A0d358Cf6EaB2196b3932709",
            "0xB48C08B5ccA1636b859B9a691Ec45C207Eb0708d",
            "0xb00E81207bcDA63c9E290E0b748252418818c869",
            "0x145309F6779bfD24533082Ab5ca1111A00016815",
            "0x8C55615279E0CFAb39944fb7Ad6626dA3b98fed3"
        ]
    },
    {
        "week": 3,
        "tokenID": 3,
        "members": 32,
        "memberArray": [
            "0x5fb4a0983daD1A0fae31ED67F1aaffeA3F3E8eC2",
            "0x4BeE0d0d6C437a9Ac4a24088824a8660bb18431C",
            "0xBab49827EA9f5459B43FE239cEE9e2457351D2D7",
            "0xC501A1F534b9c219BDB407bE12fCb01ddF9A3694",
            "0xfa6eE7Af7BaA1B174500d1A8275995EEA829453A",
            "0x378bde8b897D64F4047189C3F8b689008A560bad",
            "0xF31171daC6C88C227feFAF0CE6C5003edA1A87E0",
            "0x818a86f6db284A7E45ed98Cc1Ba88D534d07C74D",
            "0xB8c1f1ed17DA6FC4AC2ED6e8EdBb9b7724Ce44e4",
            "0xb00E81207bcDA63c9E290E0b748252418818c869",
            "0x6d6d75D544CB628ED5C4e4ebb619aec0274b8855",
            "0xbef32030aA223A3031e3b4C5b24fad66d992413C",
            "0x76a95d549Ca36d955Df2c72F693690d8e51a94d0",
            "0xcE5cDF7D5072673aF0062E5A7241E69B6618b649",
            "0x21748446955F1efC75bC9C843fBd3a8E6546d21f",
            "0x98B15A3D3D14a575f001f576ea11Ca91341D41b8",
            "0x76985F8bD32dE258dFc8ae497ED5F0112322D078",
            "0xFCC8ed5bCDdc5002804b0a0f48ECDA71eD094aF6",
            "0x9FCAE73fbf4fC6283B636f707c17529c2ba7b684",
            "0x45ec7AaF83AB1B57556951E9840456111467F800",
            "0x4A11a811e05FdDa19A17E34ce1C9C8efD2018cc4",
            "0x69996feBef47bEb378514BAc1A2Dacc88D947698",
            "0x5c6d2ac4A20A1f5812Dc7229B9812d10d798F17a",
            "0xFCC8ed5bCDdc5002804b0a0f48ECDA71eD094aF6",
            "0xE77652a153b6Aa41b6D6ac2cDbd4d9DAcB72306E",
            "0xCF07D97889f1b2c2BdD8c2C91B0a639F867B00A2",
            "0xA57c1Af56140A195F876310414C34fE9FE399D87",
            "0x064523542F3114bcAE8b1eFc69D945788eFBe492",
            "0xF9F02eb35cc9F22A69DAA26bE2B1A57e3Ab4bD53",
            "0x1699c95e4300BB24C7159EBebE15230Ac096979C",
            "0xB8c1f1ed17DA6FC4AC2ED6e8EdBb9b7724Ce44e4",
            "0x5bEED0516Cbf1857183c9Fe25179Eb3B3c2FdF43"
        ]
    },
    {
        "week": 4,
        "tokenID": 4,
        "members": 33,
        "memberArray": [
            "0x5fb4a0983daD1A0fae31ED67F1aaffeA3F3E8eC2",
            "0x76985F8bD32dE258dFc8ae497ED5F0112322D078",
            "0xac35452f3deB273d37bC1Ee84B60723CDbCCAeda",
            "0x0B7dc67a6eCF6Bc0388409DDde919aaFcF0E0ff7",
            "0xDeDd3D2a2219458eaD3afF1C006a759489b94106",
            "0x45B115bf21872c798b8f131EEE9AFA30b96A249F",
            "0x378bde8b897D64F4047189C3F8b689008A560bad",
            "0xfa6eE7Af7BaA1B174500d1A8275995EEA829453A",
            "0xF31171daC6C88C227feFAF0CE6C5003edA1A87E0",
            "0x3558f346fECf745365fc2944d8F9ae970aE21759",
            "0xb00E81207bcDA63c9E290E0b748252418818c869",
            "0x1AC49508F7C1ce2A796517269deFEFC535050Fd8",
            "0x2F1373cd12926996A0440D09AdF5453174bB4441",
            "0xB48C08B5ccA1636b859B9a691Ec45C207Eb0708d",
            "0x4a5BB1c9347A0d4F7e06a29239162f03647d9232",
            "0x980C8D51202532d34647aAb766993a6ECC9d0a59",
            "0x0B7dc67a6eCF6Bc0388409DDde919aaFcF0E0ff7",
            "0x45ec7AaF83AB1B57556951E9840456111467F800",
            "0x0551b8c8b1C7Fa0B066fdBb854188702d01bC64F",
            "0x8C55615279E0CFAb39944fb7Ad6626dA3b98fed3",
            "0x0d6B5E7D99D7Ec1228883B304f319e6C76942AcE",
            "0xbd52889A4cB198a0E2cE36b52Cdf75c4e65875A8",
            "0x45B115bf21872c798b8f131EEE9AFA30b96A249F",
            "0x4DbB9427c55F9a1241b24847E67366046422Ee19",
            "0x2bEC1Fb28A18c94B0361D2DF3d01d44fa4bDDA44",
            "0xbef32030aA223A3031e3b4C5b24fad66d992413C",
            "0xFCC8ed5bCDdc5002804b0a0f48ECDA71eD094aF6",
            "0xbB4Cc4392C6ca2c8D5EB8577Ce4fC77865b81E7F",
            "0x90D6Cc871224965b6509F216b3A5119A37C4c5Dc",
            "0xbB4Cc4392C6ca2c8D5EB8577Ce4fC77865b81E7F",
            "0xb00E81207bcDA63c9E290E0b748252418818c869",
            "0x818a86f6db284A7E45ed98Cc1Ba88D534d07C74D",
            "0xfa6eE7Af7BaA1B174500d1A8275995EEA829453A"
        ]
    },
    {
        "week": 5,
        "tokenID": 5,
        "members": 33,
        "memberArray": [
            "0x5fb4a0983daD1A0fae31ED67F1aaffeA3F3E8eC2",
            "0x6253e5478d686E943c3751a392B523072DD97676",
            "0xbB4Cc4392C6ca2c8D5EB8577Ce4fC77865b81E7F",
            "0xcE5cDF7D5072673aF0062E5A7241E69B6618b649",
            "0xB48C08B5ccA1636b859B9a691Ec45C207Eb0708d",
            "0xb00E81207bcDA63c9E290E0b748252418818c869",
            "0x0d6B5E7D99D7Ec1228883B304f319e6C76942AcE",
            "0x818a86f6db284A7E45ed98Cc1Ba88D534d07C74D",
            "0x145309F6779bfD24533082Ab5ca1111A00016815",
            "0xac35452f3deB273d37bC1Ee84B60723CDbCCAeda",
            "0xac35452f3deB273d37bC1Ee84B60723CDbCCAeda",
            "0x0B7dc67a6eCF6Bc0388409DDde919aaFcF0E0ff7",
            "0xB48C08B5ccA1636b859B9a691Ec45C207Eb0708d",
            "0x11C8D4C8d0FF92bE67eFD2dBd860654BeB102687",
            "0x45ec7AaF83AB1B57556951E9840456111467F800",
            "0x980C8D51202532d34647aAb766993a6ECC9d0a59",
            "0x9FCAE73fbf4fC6283B636f707c17529c2ba7b684",
            "0xBab49827EA9f5459B43FE239cEE9e2457351D2D7",
            "0x76985F8bD32dE258dFc8ae497ED5F0112322D078",
            "0x064523542F3114bcAE8b1eFc69D945788eFBe492",
            "0x21748446955F1efC75bC9C843fBd3a8E6546d21f",
            "0xCE11942c34Bb02a889d8049D56a16E30313CbF6f",
            "0x6253e5478d686E943c3751a392B523072DD97676",
            "0x6253e5478d686E943c3751a392B523072DD97676",
            "0xB8c1f1ed17DA6FC4AC2ED6e8EdBb9b7724Ce44e4",
            "0xd470b1ac529a2bc704b6e7467485d52569daf2c1",
            "0x7fD46A537615852A32f01222f22AFbFA124e9223",
            "0x90D6Cc871224965b6509F216b3A5119A37C4c5Dc",
            "0x145309F6779bfD24533082Ab5ca1111A00016815",
            "0x98B15A3D3D14a575f001f576ea11Ca91341D41b8",
            "0x818a86f6db284A7E45ed98Cc1Ba88D534d07C74D",
            "0xB677F5e503cc02B7A0d358Cf6EaB2196b3932709",
            "0x5c6d2ac4A20A1f5812Dc7229B9812d10d798F17a"
        ]
    },
    {
        "week": 6,
        "tokenID": 6,
        "members": 33,
        "memberArray": [
            "0x5fb4a0983daD1A0fae31ED67F1aaffeA3F3E8eC2",
            "0xeE82d15265C15a00197693B361b7735a93b82e55",
            "0x45ec7AaF83AB1B57556951E9840456111467F800",
            "0x0BaBd8774f4FB8904184b0965204e5A9Db43aCfe",
            "bnb1gvnneevr42ree4ylsh5sd2f3cqwrk2kkpy02j0",
            "0x4a5BB1c9347A0d4F7e06a29239162f03647d9232",
            "0x45ec7AaF83AB1B57556951E9840456111467F800",
            "bnb1gvnneevr42ree4ylsh5sd2f3cqwrk2kkpy02j0",
            "0x5bEED0516Cbf1857183c9Fe25179Eb3B3c2FdF43",
            "bnb1xutm7nm9l46c9p5xvx94xuz08r3qadd28teygq",
            "0x76a95d549Ca36d955Df2c72F693690d8e51a94d0",
            "0xDeDd3D2a2219458eaD3afF1C006a759489b94106",
            "0x2bEC1Fb28A18c94B0361D2DF3d01d44fa4bDDA44",
            "0x69996feBef47bEb378514BAc1A2Dacc88D947698",
            "0x4A11a811e05FdDa19A17E34ce1C9C8efD2018cc4",
            "0x11C8D4C8d0FF92bE67eFD2dBd860654BeB102687",
            "0x69F329EE79C98A94765e4105aDFd5a87458d919C",
            "0x72540C9142cd326d2b60a464801D99c04D361dCF",
            "0x6d6d75D544CB628ED5C4e4ebb619aec0274b8855",
            "0x38586444200e0DC6938c8d258fb15FD14EB619b8",
            "0x7fD46A537615852A32f01222f22AFbFA124e9223",
            "0x2F1373cd12926996A0440D09AdF5453174bB4441",
            "0x76985F8bD32dE258dFc8ae497ED5F0112322D078",
            "0x4a5BB1c9347A0d4F7e06a29239162f03647d9232",
            "0xF31171daC6C88C227feFAF0CE6C5003edA1A87E0",
            "0xF31171daC6C88C227feFAF0CE6C5003edA1A87E0",
            "0x3558f346fECf745365fc2944d8F9ae970aE21759",
            "0xeBE6cC6820a76705B6654FdD1254256DcD54F1dF",
            "0x4DbB9427c55F9a1241b24847E67366046422Ee19",
            "0xF31171daC6C88C227feFAF0CE6C5003edA1A87E0",
            "0xB2B25Ac878cdF8d79b9D4679354a0c88c2da7357",
            "0x5c6d2ac4A20A1f5812Dc7229B9812d10d798F17a",
            "0x2F1373cd12926996A0440D09AdF5453174bB4441"
        ]
    },
    {
        "week": 7,
        "tokenID": 10,
        "members": 63,
        "memberArray": [
            "0x5fb4a0983daD1A0fae31ED67F1aaffeA3F3E8eC2",
            "0xA7092b4b09ADA332177A20f509089707910fC4b4",
            "0x02CA4101eA84f400c62b3BeB87Fb5450a8702941",
            "0xB48C08B5ccA1636b859B9a691Ec45C207Eb0708d",
            "0x3558f346fECf745365fc2944d8F9ae970aE21759",
            "0x1E9cb8699106dD3dB13f9307b898017EC79f0C3C",
            "0x90D6Cc871224965b6509F216b3A5119A37C4c5Dc",
            "0x76a95d549Ca36d955Df2c72F693690d8e51a94d0",
            "0xcE5cDF7D5072673aF0062E5A7241E69B6618b649",
            "0x378bde8b897D64F4047189C3F8b689008A560bad",
            "0x45ec7AaF83AB1B57556951E9840456111467F800",
            "0xbB4Cc4392C6ca2c8D5EB8577Ce4fC77865b81E7F",
            "0x0d6B5E7D99D7Ec1228883B304f319e6C76942AcE",
            "0xbd52889A4cB198a0E2cE36b52Cdf75c4e65875A8",
            "0x980C8D51202532d34647aAb766993a6ECC9d0a59",
            "0x8C55615279E0CFAb39944fb7Ad6626dA3b98fed3",
            "0x72540C9142cd326d2b60a464801D99c04D361dCF",
            "0xd470b1ac529a2bc704b6e7467485d52569daf2c1",
            "0xcE5cDF7D5072673aF0062E5A7241E69B6618b649",
            "0xA7092b4b09ADA332177A20f509089707910fC4b4",
            "0xF9F02eb35cc9F22A69DAA26bE2B1A57e3Ab4bD53",
            "0x145309F6779bfD24533082Ab5ca1111A00016815",
            "0xA7092b4b09ADA332177A20f509089707910fC4b4",
            "0xFCC8ed5bCDdc5002804b0a0f48ECDA71eD094aF6",
            "0x6d6d75D544CB628ED5C4e4ebb619aec0274b8855",
            "0x38586444200e0DC6938c8d258fb15FD14EB619b8",
            "0xdDF6470B257C5CC8b2ED142EE88d331d8339D2b4",
            "0xd470b1ac529a2bc704b6e7467485d52569daf2c1",
            "0xA7092b4b09ADA332177A20f509089707910fC4b4",
            "0xCF07D97889f1b2c2BdD8c2C91B0a639F867B00A2",
            "0xbef32030aA223A3031e3b4C5b24fad66d992413C",
            "0x9008676d9EcC75c506aAd7C70eBD55523fcb725d",
            "0xC3130F83BdcF5E84f777d58580Ce99D811aea108",
            "0x9676762325fc3C1e14D251C021185248E8204Fb7",
            "0x76985F8bD32dE258dFc8ae497ED5F0112322D078",
            "0xBf2D4ABfdd66CFA279a527E6adf5C5D28aa308Cb",
            "0xcE5cDF7D5072673aF0062E5A7241E69B6618b649",
            "0xFCC8ed5bCDdc5002804b0a0f48ECDA71eD094aF6",
            "0xE77652a153b6Aa41b6D6ac2cDbd4d9DAcB72306E",
            "0x1699c95e4300BB24C7159EBebE15230Ac096979C",
            "0xC501A1F534b9c219BDB407bE12fCb01ddF9A3694",
            "0xeE82d15265C15a00197693B361b7735a93b82e55",
            "0x0BaBd8774f4FB8904184b0965204e5A9Db43aCfe",
            "0x393e0f1dABF3Bc25f7747068Ab9Afb9bbAf82970",
            "0x9676762325fc3C1e14D251C021185248E8204Fb7",
            "0x0d6B5E7D99D7Ec1228883B304f319e6C76942AcE",
            "0x76a95d549Ca36d955Df2c72F693690d8e51a94d0",
            "0xbd52889A4cB198a0E2cE36b52Cdf75c4e65875A8",
            "0xbB4Cc4392C6ca2c8D5EB8577Ce4fC77865b81E7F",
            "0x5bEED0516Cbf1857183c9Fe25179Eb3B3c2FdF43",
            "0xcc17e6ec4540cb49E871B00A00157DD20375C253",
            "0x45B115bf21872c798b8f131EEE9AFA30b96A249F",
            "0x3558f346fECf745365fc2944d8F9ae970aE21759",
            "0x9FCAE73fbf4fC6283B636f707c17529c2ba7b684",
            "0x9008676d9EcC75c506aAd7C70eBD55523fcb725d",
            "0x72540C9142cd326d2b60a464801D99c04D361dCF",
            "0xcc17e6ec4540cb49E871B00A00157DD20375C253",
            "0x1dE46E70Ec82c237BC14f7e9058C6Cb09a9b34Ea",
            "0x3558f346fECf745365fc2944d8F9ae970aE21759",
            "0xbef32030aA223A3031e3b4C5b24fad66d992413C",
            "0xac35452f3deB273d37bC1Ee84B60723CDbCCAeda",
            "0x45B115bf21872c798b8f131EEE9AFA30b96A249F",
            "0x3558f346fECf745365fc2944d8F9ae970aE21759"
        ]
    },
    {
        "week": 8,
        "tokenID": 13,
        "members": 30,
        "memberArray": [
            "0x5fb4a0983daD1A0fae31ED67F1aaffeA3F3E8eC2",
            "0xC3130F83BdcF5E84f777d58580Ce99D811aea108",
            "0x27cAFf28136DCE030aa4811249297c0962219a33",
            "0x8C55615279E0CFAb39944fb7Ad6626dA3b98fed3",
            "0xDeDd3D2a2219458eaD3afF1C006a759489b94106",
            "0x45ec7AaF83AB1B57556951E9840456111467F800",
            "0x11C8D4C8d0FF92bE67eFD2dBd860654BeB102687",
            "0x9008676d9EcC75c506aAd7C70eBD55523fcb725d",
            "0xdDF6470B257C5CC8b2ED142EE88d331d8339D2b4",
            "0x72540C9142cd326d2b60a464801D99c04D361dCF",
            "0x45ec7AaF83AB1B57556951E9840456111467F800",
            "0x1699c95e4300BB24C7159EBebE15230Ac096979C",
            "0x1E9cb8699106dD3dB13f9307b898017EC79f0C3C",
            "0x6E332BF9dEeAbFCbdbeA05023b48DDB2590eCd4A",
            "0x1699c95e4300BB24C7159EBebE15230Ac096979C",
            "0xB677F5e503cc02B7A0d358Cf6EaB2196b3932709",
            "0xCF07D97889f1b2c2BdD8c2C91B0a639F867B00A2",
            "0xFCC8ed5bCDdc5002804b0a0f48ECDA71eD094aF6",
            "0xeE82d15265C15a00197693B361b7735a93b82e55",
            "0x69F329EE79C98A94765e4105aDFd5a87458d919C",
            "0xCE11942c34Bb02a889d8049D56a16E30313CbF6f",
            "0x27cAFf28136DCE030aa4811249297c0962219a33",
            "0xCE11942c34Bb02a889d8049D56a16E30313CbF6f",
            "0x9676762325fc3C1e14D251C021185248E8204Fb7",
            "0xF9F02eb35cc9F22A69DAA26bE2B1A57e3Ab4bD53",
            "0xE77652a153b6Aa41b6D6ac2cDbd4d9DAcB72306E",
            "0x145309F6779bfD24533082Ab5ca1111A00016815",
            "0x4A11a811e05FdDa19A17E34ce1C9C8efD2018cc4",
            "0x4DbB9427c55F9a1241b24847E67366046422Ee19",
            "0x2051cF81501aFC3620834E8AcFfe9616334eFCF7"
        ]
    },
    {
        "week": 9,
        "tokenID": 14,
        "members": 29,
        "memberArray": [
            "0x5fb4a0983daD1A0fae31ED67F1aaffeA3F3E8eC2",
            "0x69996feBef47bEb378514BAc1A2Dacc88D947698",
            "0xBd095eC1Ce4407de9dEbCf6Ebb90E8829A18F403",
            "0x4DbB9427c55F9a1241b24847E67366046422Ee19",
            "0x0BaBd8774f4FB8904184b0965204e5A9Db43aCfe",
            "0x76985F8bD32dE258dFc8ae497ED5F0112322D078",
            "0xE5484C082938603dFdEB2ECdc28158d7D99241cB",
            "0x552E9b92A0E1aE5039Fd6661DF6610759338c319",
            "0xB2B25Ac878cdF8d79b9D4679354a0c88c2da7357",
            "0xCE11942c34Bb02a889d8049D56a16E30313CbF6f",
            "0x455b1B4D7aA5599bE120aF210e11c7D7Ec8Aadd2",
            "0x2F1373cd12926996A0440D09AdF5453174bB4441",
            "0xd470b1ac529a2bc704b6e7467485d52569daf2c1",
            "0x0d6B5E7D99D7Ec1228883B304f319e6C76942AcE",
            "0xD6ac305F7EFe48B3211ad7632B9Cde1225F25ba3",
            "0x2F1373cd12926996A0440D09AdF5453174bB4441",
            "0x27cAFf28136DCE030aa4811249297c0962219a33",
            "0x0BaBd8774f4FB8904184b0965204e5A9Db43aCfe",
            "0x0BaBd8774f4FB8904184b0965204e5A9Db43aCfe",
            "0x0BaBd8774f4FB8904184b0965204e5A9Db43aCfe",
            "0xBd095eC1Ce4407de9dEbCf6Ebb90E8829A18F403",
            "0x4a5BB1c9347A0d4F7e06a29239162f03647d9232",
            "0xfa6eE7Af7BaA1B174500d1A8275995EEA829453A",
            "0x56E773B0a620205E9f72265b6013b65B84c2c4aF",
            "0x45ec7AaF83AB1B57556951E9840456111467F800",
            "0x1699c95e4300BB24C7159EBebE15230Ac096979C",
            "0xb00E81207bcDA63c9E290E0b748252418818c869",
            "0xF31171daC6C88C227feFAF0CE6C5003edA1A87E0",
            "0x63219DBA946d29DEC79Ff8ebdE58aAd5d9523245"
        ]
    },
    {
        "week": 10,
        "tokenID": 15,
        "members": 30,
        "memberArray": [
            "0x5fb4a0983daD1A0fae31ED67F1aaffeA3F3E8eC2",
            "0x6E332BF9dEeAbFCbdbeA05023b48DDB2590eCd4A",
            "0x1E9cb8699106dD3dB13f9307b898017EC79f0C3C",
            "0xeE82d15265C15a00197693B361b7735a93b82e55",
            "0x612112d107743FDb4c64F7990A76B01046bFB812",
            "0xB2B25Ac878cdF8d79b9D4679354a0c88c2da7357",
            "0x6253e5478d686E943c3751a392B523072DD97676",
            "0x02CA4101eA84f400c62b3BeB87Fb5450a8702941",
            "0xDAe442e757374088bEBad7e24E5A541Dc6C94E54",
            "0xdDF6470B257C5CC8b2ED142EE88d331d8339D2b4",
            "0x72540C9142cd326d2b60a464801D99c04D361dCF",
            "0xD6ac305F7EFe48B3211ad7632B9Cde1225F25ba3",
            "0xdDF6470B257C5CC8b2ED142EE88d331d8339D2b4",
            "0x4A11a811e05FdDa19A17E34ce1C9C8efD2018cc4",
            "0xCF96021f1ebEdc4b772347583323b194c7d55dA0",
            "0x21748446955F1efC75bC9C843fBd3a8E6546d21f",
            "0x72540C9142cd326d2b60a464801D99c04D361dCF",
            "0xb00E81207bcDA63c9E290E0b748252418818c869",
            "0xD6ac305F7EFe48B3211ad7632B9Cde1225F25ba3",
            "0x552E9b92A0E1aE5039Fd6661DF6610759338c319",
            "0x38586444200e0DC6938c8d258fb15FD14EB619b8",
            "0x38586444200e0DC6938c8d258fb15FD14EB619b8",
            "0xDAe442e757374088bEBad7e24E5A541Dc6C94E54",
            "0xbd52889A4cB198a0E2cE36b52Cdf75c4e65875A8",
            "0x90D6Cc871224965b6509F216b3A5119A37C4c5Dc",
            "0x455b1B4D7aA5599bE120aF210e11c7D7Ec8Aadd2",
            "0xeE82d15265C15a00197693B361b7735a93b82e55",
            "0xb00E81207bcDA63c9E290E0b748252418818c869",
            "0x7fD46A537615852A32f01222f22AFbFA124e9223",
            "0x63219DBA946d29DEC79Ff8ebdE58aAd5d9523245"
        ]
    },
    {
        "week": 11,
        "tokenID": 16,
        "members": 30,
        "memberArray": [
            "0x5fb4a0983daD1A0fae31ED67F1aaffeA3F3E8eC2",
            "0x4A11a811e05FdDa19A17E34ce1C9C8efD2018cc4",
            "0xF4F5C8A5F3C7dAEa939802380188e1ACEdFCFBf0",
            "xardin.argent.xyz",
            "0xB677F5e503cc02B7A0d358Cf6EaB2196b3932709",
            "0x0d6B5E7D99D7Ec1228883B304f319e6C76942AcE",
            "0x0D08D3Fe6FCA58E82982Ac4D0eADa1F457F4e929",
            "0x45B115bf21872c798b8f131EEE9AFA30b96A249F",
            "0x45B115bf21872c798b8f131EEE9AFA30b96A249F",
            "0xEe85Ae5daAb560731243403f56C51654dEF8bc6E",
            "0x1AC49508F7C1ce2A796517269deFEFC535050Fd8",
            "0x4A11a811e05FdDa19A17E34ce1C9C8efD2018cc4",
            "0x1E0b16d340eD938A71467998e997e995110eD596",
            "0xCF07D97889f1b2c2BdD8c2C91B0a639F867B00A2",
            "0xcB744534a44083acd8C3B0b0B2D6E06fAA50b9aA",
            "0xDeDd3D2a2219458eaD3afF1C006a759489b94106",
            "0x2051cF81501aFC3620834E8AcFfe9616334eFCF7",
            "0x7Adf5937A1a5c3670AC7C82Fa6A8EC4EA70D6250",
            "0xeE82d15265C15a00197693B361b7735a93b82e55",
            "0x0BaBd8774f4FB8904184b0965204e5A9Db43aCfe",
            "0x5bEED0516Cbf1857183c9Fe25179Eb3B3c2FdF43",
            "0x28faf1599A9c3a9b8463DfeB23d06B6495aE91bC",
            "0xBd095eC1Ce4407de9dEbCf6Ebb90E8829A18F403",
            "0x0BaBd8774f4FB8904184b0965204e5A9Db43aCfe",
            "0x21748446955F1efC75bC9C843fBd3a8E6546d21f",
            "0x8C55615279E0CFAb39944fb7Ad6626dA3b98fed3",
            "0xd0f9899ec83BF1cf915bf101D6E7949361151523",
            "0xeE82d15265C15a00197693B361b7735a93b82e55",
            "0xfa6eE7Af7BaA1B174500d1A8275995EEA829453A",
            "0x76a95d549Ca36d955Df2c72F693690d8e51a94d0"
        ]
    },
    {
        "week": 12,
        "tokenID": 17,
        "members": 30,
        "memberArray": [
            "0x5fb4a0983daD1A0fae31ED67F1aaffeA3F3E8eC2",
            "0x4BeE0d0d6C437a9Ac4a24088824a8660bb18431C",
            "0x90D6Cc871224965b6509F216b3A5119A37C4c5Dc",
            "0x72540C9142cd326d2b60a464801D99c04D361dCF",
            "0xBf2D4ABfdd66CFA279a527E6adf5C5D28aa308Cb",
            "0xfa55508b1c998c5909ac8953a3f0f79a316987d6",
            "0xC8938bf01EeE0e8c376e81214e1dF31593637d71",
            "0xB2c4D35cB20b0D6A7538da5683D03037068B26dD",
            "0x9676762325fc3C1e14D251C021185248E8204Fb7",
            "0xCF07D97889f1b2c2BdD8c2C91B0a639F867B00A2",
            "0x98B15A3D3D14a575f001f576ea11Ca91341D41b8",
            "0xaa5ba45127268b7e4b59058a952ab1e926de2075",
            "0x5c6d2ac4A20A1f5812Dc7229B9812d10d798F17a",
            "0x5FFC32c736Ed221aDD02Af2af6AD6659a6DDBbB5",
            "0x1699c95e4300BB24C7159EBebE15230Ac096979C",
            "0x612112d107743FDb4c64F7990A76B01046bFB812",
            "0x46f9697622228ea60E549620cC2DAa79312eDf75",
            "bnb1gvnneevr42ree4ylsh5sd2f3cqwrk2kkpy02j0",
            "0xD6ac305F7EFe48B3211ad7632B9Cde1225F25ba3",
            "0x76985F8bD32dE258dFc8ae497ED5F0112322D078",
            "0xB677F5e503cc02B7A0d358Cf6EaB2196b3932709",
            "0xC8938bf01EeE0e8c376e81214e1dF31593637d71",
            "0x6d6d75D544CB628ED5C4e4ebb619aec0274b8855",
            "0x0D08D3Fe6FCA58E82982Ac4D0eADa1F457F4e929",
            "0x7fD46A537615852A32f01222f22AFbFA124e9223",
            "0x980C8D51202532d34647aAb766993a6ECC9d0a59",
            "0x4A11a811e05FdDa19A17E34ce1C9C8efD2018cc4",
            "0xFCC8ed5bCDdc5002804b0a0f48ECDA71eD094aF6",
            "0xF9F02eb35cc9F22A69DAA26bE2B1A57e3Ab4bD53",
            "0x4A11a811e05FdDa19A17E34ce1C9C8efD2018cc4"
        ]
    },
    {
        "week": 13,
        "tokenID": 20,
        "members": 54,
        "memberArray": [
            "0x5fb4a0983daD1A0fae31ED67F1aaffeA3F3E8eC2",
            "0x4BeE0d0d6C437a9Ac4a24088824a8660bb18431C",
            "0xb00E81207bcDA63c9E290E0b748252418818c869",
            "0x69996feBef47bEb378514BAc1A2Dacc88D947698",
            "0x2051cF81501aFC3620834E8AcFfe9616334eFCF7",
            "0x6253e5478d686E943c3751a392B523072DD97676",
            "0xd0f9899ec83BF1cf915bf101D6E7949361151523",
            "0x76a95d549Ca36d955Df2c72F693690d8e51a94d0",
            "0x818a86f6db284A7E45ed98Cc1Ba88D534d07C74D",
            "0xbd52889A4cB198a0E2cE36b52Cdf75c4e65875A8",
            "0xcB744534a44083acd8C3B0b0B2D6E06fAA50b9aA",
            "0xEA29a51b283eA6C0d3872a5c3dF4ddE3cba94128",
            "0x2F6102a60813aF809C8dA5f46Ceb1D022dd718f2",
            "0x1E0b16d340eD938A71467998e997e995110eD596",
            "0xbae288e7f99216ed19e84632047be6818abda48c",
            "0xA7092b4b09ADA332177A20f509089707910fC4b4",
            "0x0BaBd8774f4FB8904184b0965204e5A9Db43aCfe",
            "0xBf2D4ABfdd66CFA279a527E6adf5C5D28aa308Cb",
            "0xcB744534a44083acd8C3B0b0B2D6E06fAA50b9aA",
            "0x7eC4583A83686d6e4A4e76D0b04c5be765850d00",
            "0xfa6eE7Af7BaA1B174500d1A8275995EEA829453A",
            "0xbae288e7f99216ed19e84632047be6818abda48c",
            "0xED376BE0003D1C6626DD8C353b84697e315a821C",
            "0x0D3D920914A0fADFcf70E9d21913777472985526",
            "0x552E9b92A0E1aE5039Fd6661DF6610759338c319",
            "0xDeDd3D2a2219458eaD3afF1C006a759489b94106",
            "0xcE5cDF7D5072673aF0062E5A7241E69B6618b649",
            "0x7fD46A537615852A32f01222f22AFbFA124e9223",
            "0xB2c4D35cB20b0D6A7538da5683D03037068B26dD",
            "0x612112d107743FDb4c64F7990A76B01046bFB812",
            "0x27cAFf28136DCE030aa4811249297c0962219a33",
            "0x46f9697622228ea60E549620cC2DAa79312eDf75",
            "0x9FCAE73fbf4fC6283B636f707c17529c2ba7b684",
            "0x455b1B4D7aA5599bE120aF210e11c7D7Ec8Aadd2",
            "0x980C8D51202532d34647aAb766993a6ECC9d0a59",
            "0xED376BE0003D1C6626DD8C353b84697e315a821C",
            "0xCF07D97889f1b2c2BdD8c2C91B0a639F867B00A2",
            "0x0BaBd8774f4FB8904184b0965204e5A9Db43aCfe",
            "0x6E332BF9dEeAbFCbdbeA05023b48DDB2590eCd4A",
            "0x0BaBd8774f4FB8904184b0965204e5A9Db43aCfe",
            "0x28faf1599A9c3a9b8463DfeB23d06B6495aE91bC",
            "0xC501A1F534b9c219BDB407bE12fCb01ddF9A3694",
            "0xd12b2B215e2133e1028b24b1389912EfE06e4531",
            "0xd0f9899ec83BF1cf915bf101D6E7949361151523",
            "0xED376BE0003D1C6626DD8C353b84697e315a821C",
            "0x0551b8c8b1C7Fa0B066fdBb854188702d01bC64F",
            "0x45B115bf21872c798b8f131EEE9AFA30b96A249F",
            "0x3558f346fECf745365fc2944d8F9ae970aE21759",
            "0x818a86f6db284A7E45ed98Cc1Ba88D534d07C74D",
            "0xbd52889A4cB198a0E2cE36b52Cdf75c4e65875A8",
            "0x45B115bf21872c798b8f131EEE9AFA30b96A249F",
            "0x818a86f6db284A7E45ed98Cc1Ba88D534d07C74D",
            "0xbd52889A4cB198a0E2cE36b52Cdf75c4e65875A8",
            "0xBf2D4ABfdd66CFA279a527E6adf5C5D28aa308Cb"
        ]
    },
    {
        "week": 14,
        "tokenID": 22,
        "members": 27,
        "memberArray": [
            "0x5fb4a0983daD1A0fae31ED67F1aaffeA3F3E8eC2",
            "0x455b1B4D7aA5599bE120aF210e11c7D7Ec8Aadd2",
            "0x202b21aC6C28ce40c9DEd882CAbB7428e4F2eE35",
            "0xD6ac305F7EFe48B3211ad7632B9Cde1225F25ba3",
            "0x59F026F6E98736252061c2b3CB8a9b30A779D233",
            "0x02CA4101eA84f400c62b3BeB87Fb5450a8702941",
            "0x89832F6Afe2B8D9cef6b8Cd8717c703D12fcd0A9",
            "0xB2B25Ac878cdF8d79b9D4679354a0c88c2da7357",
            "0x0D3D920914A0fADFcf70E9d21913777472985526",
            "0x1dE46E70Ec82c237BC14f7e9058C6Cb09a9b34Ea",
            "0x8C55615279E0CFAb39944fb7Ad6626dA3b98fed3",
            "0xA7092b4b09ADA332177A20f509089707910fC4b4",
            "0xB48C08B5ccA1636b859B9a691Ec45C207Eb0708d",
            "0xCF07D97889f1b2c2BdD8c2C91B0a639F867B00A2",
            "0x28faf1599A9c3a9b8463DfeB23d06B6495aE91bC",
            "0x90D6Cc871224965b6509F216b3A5119A37C4c5Dc",
            "0xF9F02eb35cc9F22A69DAA26bE2B1A57e3Ab4bD53",
            "0x11C8D4C8d0FF92bE67eFD2dBd860654BeB102687",
            "0x9676762325fc3C1e14D251C021185248E8204Fb7",
            "0x0551b8c8b1C7Fa0B066fdBb854188702d01bC64F",
            "0x59F026F6E98736252061c2b3CB8a9b30A779D233",
            "0xcB744534a44083acd8C3B0b0B2D6E06fAA50b9aA",
            "0xE5484C082938603dFdEB2ECdc28158d7D99241cB",
            "0x0D3D920914A0fADFcf70E9d21913777472985526",
            "0xbB4Cc4392C6ca2c8D5EB8577Ce4fC77865b81E7F",
            "0x507aB768AF4931C923790E219cB9d85781F23506",
            "0xbef32030aA223A3031e3b4C5b24fad66d992413C"
        ]
    },
    {
        "week": 15,
        "tokenID": 23,
        "members": 26,
        "memberArray": [
            "0x5fb4a0983daD1A0fae31ED67F1aaffeA3F3E8eC2",
            "0x4BeE0d0d6C437a9Ac4a24088824a8660bb18431C",
            "0x59F026F6E98736252061c2b3CB8a9b30A779D233",
            "0x89832F6Afe2B8D9cef6b8Cd8717c703D12fcd0A9",
            "0xd0f9899ec83BF1cf915bf101D6E7949361151523",
            "0xdc211A0666bed568D5caFfbf538Ec221FCD1402f",
            "0x11C8D4C8d0FF92bE67eFD2dBd860654BeB102687",
            "0xA7092b4b09ADA332177A20f509089707910fC4b4",
            "0xDAe442e757374088bEBad7e24E5A541Dc6C94E54",
            "0xDAc43E419a6eAB0250D2800B9Ad531605d4254Fd",
            "0x9FCAE73fbf4fC6283B636f707c17529c2ba7b684",
            "0x145309F6779bfD24533082Ab5ca1111A00016815",
            "0xB2c4D35cB20b0D6A7538da5683D03037068B26dD",
            "0xbef32030aA223A3031e3b4C5b24fad66d992413C",
            "0x59F026F6E98736252061c2b3CB8a9b30A779D233",
            "0x27cAFf28136DCE030aa4811249297c0962219a33",
            "0x1AC49508F7C1ce2A796517269deFEFC535050Fd8",
            "0x69996feBef47bEb378514BAc1A2Dacc88D947698",
            "0x59F026F6E98736252061c2b3CB8a9b30A779D233",
            "0x45ec7AaF83AB1B57556951E9840456111467F800",
            "0x7eC4583A83686d6e4A4e76D0b04c5be765850d00",
            "0xd0f9899ec83BF1cf915bf101D6E7949361151523",
            "0xbef32030aA223A3031e3b4C5b24fad66d992413C",
            "0x0D3D920914A0fADFcf70E9d21913777472985526",
            "0x5bEED0516Cbf1857183c9Fe25179Eb3B3c2FdF43",
            "0x69F329EE79C98A94765e4105aDFd5a87458d919C"
        ]
    },
    {
        "week": 16,
        "tokenID": 24,
        "members": 27,
        "memberArray": [
            "0x5fb4a0983daD1A0fae31ED67F1aaffeA3F3E8eC2",
            "bnb1pnrjfsmwqd34xlknp0wx8qd6qn5mvmaha2h86c",
            "0xfa6eE7Af7BaA1B174500d1A8275995EEA829453A",
            "0x3558f346fECf745365fc2944d8F9ae970aE21759",
            "0xd12b2B215e2133e1028b24b1389912EfE06e4531",
            "0x11C8D4C8d0FF92bE67eFD2dBd860654BeB102687",
            "0x818a86f6db284A7E45ed98Cc1Ba88D534d07C74D",
            "0xA7092b4b09ADA332177A20f509089707910fC4b4",
            "0x4A11a811e05FdDa19A17E34ce1C9C8efD2018cc4",
            "0x818a86f6db284A7E45ed98Cc1Ba88D534d07C74D",
            "bnb1ka483sgw3tqfldugds9n9f5jqw848vmk8qn9vn",
            "0xEe85Ae5daAb560731243403f56C51654dEF8bc6E",
            "0x31e0E2f2a3C6E8203B4F61C2CF59d3723dDE9557",
            "0xDeDd3D2a2219458eaD3afF1C006a759489b94106",
            "0x8767c5124E80d6528bd3d46067f0B68Ab8e2dCB3",
            "0x6E332BF9dEeAbFCbdbeA05023b48DDB2590eCd4A",
            "bnb1xutm7nm9l46c9p5xvx94xuz08r3qadd28teygq",
            "0x202b21aC6C28ce40c9DEd882CAbB7428e4F2eE35",
            "0x6e7B9FC055c9a895E3A247CC4816b7A695b7e6F2",
            "0xd12b2B215e2133e1028b24b1389912EfE06e4531",
            "0xF9F02eb35cc9F22A69DAA26bE2B1A57e3Ab4bD53",
            "0xB2c4D35cB20b0D6A7538da5683D03037068B26dD",
            "0x9780bEdcC437782846d60D6C074D18Ed24765bBf",
            "0x35E96644E060d60a9DBF901EFae689D2D7B0f861",
            "0x321d5a4c9f9f0c9607df5464d993bebb0ad25fb1",
            "0x60299070384645339181578946cF1aFaf74179dc",
            "0x8767c5124E80d6528bd3d46067f0B68Ab8e2dCB3"
        ]
    },
    {
        "week": 17,
        "tokenID": 25,
        "members": 27,
        "memberArray": [
            "0x5fb4a0983daD1A0fae31ED67F1aaffeA3F3E8eC2",
            "0x9bfA30d420C340e810BA8438a93969d421bdFf56",
            "0x818a86f6db284A7E45ed98Cc1Ba88D534d07C74D",
            "0x5FFC32c736Ed221aDD02Af2af6AD6659a6DDBbB5",
            "0x69F329EE79C98A94765e4105aDFd5a87458d919C",
            "0x1699c95e4300BB24C7159EBebE15230Ac096979C",
            "0xc5cee9416571752528ACbb4331761C5E2706748c",
            "0x72540C9142cd326d2b60a464801D99c04D361dCF",
            "0x9869bB9e74d8C243D4df886CfC3eDD184D59347B",
            "0x240Fe653Bc3ae1F87aEf10757bc7367F03c7a518",
            "0x732Bb47210fDB676Ee1596d18FEE6F48DE2d37cb",
            "0xBB5f3306e026950e798eB11260dc7d84fa0C7a9f",
            "0xF9Ca61b2C3938D3C5Ec8Fa669622240A7a0cb316",
            "0x818a86f6db284A7E45ed98Cc1Ba88D534d07C74D",
            "0xdc744Aa4d1964E700E9f1A60e37eC18F70851029",
            "0xa9dDc3383Ab709EA54aB5B4f9f89F57E60EB2F4f",
            "0x9008676d9EcC75c506aAd7C70eBD55523fcb725d",
            "0xeBE6cC6820a76705B6654FdD1254256DcD54F1dF",
            "0x22BE9582CDef4eF2e6d4b119547AecD7652D9e28",
            "0xF3e8a7AE6F60bE09Ee463B6278F293f4289e871F",
            "0x11C8D4C8d0FF92bE67eFD2dBd860654BeB102687",
            "0xcB744534a44083acd8C3B0b0B2D6E06fAA50b9aA",
            "0x980C8D51202532d34647aAb766993a6ECC9d0a59",
            "0x0d6B5E7D99D7Ec1228883B304f319e6C76942AcE",
            "xardin.argent.xyz",
            "0x5D7C72C4014ed4008cF574EFF487ca24f345cf14",
            "0xD8aF41080acbC4B0b5C2Cc58A0D414442c8c6Fd9"
        ]
    },
    {
        "week": 18,
        "tokenID": 26,
        "members": 27,
        "memberArray": [
            "0x5fb4a0983daD1A0fae31ED67F1aaffeA3F3E8eC2",
            "0x3A9eA3A8F7916F2637DbA398124019950fD294c6",
            "0x17Ba0C93587BE8dbbCe33EA408760B5Ead8FD059",
            "0x210154d33Ef8297428ad6fbf7e45846305789175",
            "0x2A2c1102cC6F3eF7e3d469e47c70ad8181C1FaED",
            "0xB48C08B5ccA1636b859B9a691Ec45C207Eb0708d",
            "0xf79a4ce9bd79f43257e24986dd35c3dfc5da5460",
            "0x54F2D5Fb13766fcb9224cC4D016FF31D0967F7cf",
            "0x8E41AfAf0182375191bFD437501e4514366ecbb5",
            "0x6accD26626c150a4b485E6c9c541b38FE0AB5915",
            "0x202b21aC6C28ce40c9DEd882CAbB7428e4F2eE35",
            "0x59072920C81E979414A8A11c3ff371ccEb3994c4",
            "0x7601f38fbc12a94a5bb0726eca5e093bbd870d50",
            "xardin.argent.xyz",
            "0x145309F6779bfD24533082Ab5ca1111A00016815",
            "0x4ae901FBdB69eA08d63224964fC5E9696F0Fe6d0",
            "0xEe85Ae5daAb560731243403f56C51654dEF8bc6E",
            "0x08B37C9aB0CE6b1D5Aa73A20Dfea634b78698065",
            "0x5FFC32c736Ed221aDD02Af2af6AD6659a6DDBbB5",
            "0x62a27B6DF055Fe39870A968291FE3bD82F7DCAF6",
            "0xDAc43E419a6eAB0250D2800B9Ad531605d4254Fd",
            "0xdc744Aa4d1964E700E9f1A60e37eC18F70851029",
            "0x3b9416493A00630070D9b55E8D01175271b6F913",
            "0xEe85Ae5daAb560731243403f56C51654dEF8bc6E",
            "0xCDb3B3F161c6c683104ea4E1F8B48C08e266a613",
            "0xE77652a153b6Aa41b6D6ac2cDbd4d9DAcB72306E",
            "0x9FCAE73fbf4fC6283B636f707c17529c2ba7b684"
        ]
    },
    {
        "week": 19,
        "tokenID": 30,
        "members": 45,
        "memberArray": [
            "0x5fb4a0983daD1A0fae31ED67F1aaffeA3F3E8eC2",
            "0x17Ba0C93587BE8dbbCe33EA408760B5Ead8FD059",
            "0xfa55508b1c998c5909ac8953a3f0f79a316987d6",
            "0xf7EE6C2F811b52c72EFD167A1bb3F4AdAa1E0F89",
            " 0x699ebD6bcF3E9De7749eD653bc83Fa69bD8703d8",
            "0x575757e0a0b19bEe7e07887FbBD616b395E32D4b",
            "0x215B67D707cEd250c3803a19348E9C565E42d7A3",
            "0x0d6B5E7D99D7Ec1228883B304f319e6C76942AcE",
            "0xCCa178a04D83Af193330C7927fb9a42212Fb1C25",
            "0x775373E7521EcaC8dE59Ba7aC2129615200D0418",
            "0x980C8D51202532d34647aAb766993a6ECC9d0a59",
            "0x32648075ecd353767dA2faFEF3C56a4283567f12",
            "0x4F1B4a2D5cF60240dF3035688db8CCeB97170301",
            "0xbd52889A4cB198a0E2cE36b52Cdf75c4e65875A8",
            "0xe7087F15a278EE1fE4B4AAefBCdB1D1FDE261d78",
            "0x9869bB9e74d8C243D4df886CfC3eDD184D59347B",
            "0x905700624E1B7cAa33eEc851ea361b3b72783B71",
            "0x7eC4583A83686d6e4A4e76D0b04c5be765850d00",
            "0x7fD46A537615852A32f01222f22AFbFA124e9223",
            "0xD9e536655C2eC225d5A143395814332A179B3f3A",
            "0xFCC8ed5bCDdc5002804b0a0f48ECDA71eD094aF6",
            "0xa362a9EFE31631f2252B85B99eaC0c2139A1A6BF",
            "0x5a62Bc0f7c2Ad6c56456dAabfdDD3c4Bb34df965",
            "0x075AcD1B0E6C91e4b7689d098aad19258C351C79",
            "0x09035b6C00F0aB297778C71e81702DA85d77B6c2",
            "0x58a133632547b6eaDF2998ba2dA5796A49657aEe",
            "0xaccD0314c88FA1cB91f0974Be020d057077D8835",
            "0x957364a5F2EAA084B0124f53eFfe5c443027F2B9",
            "0x04aEE20BE071c84050649cfe0b1A754Cc4555D92",
            "0xefC9C8d5AE4Aa2035AEF9A795A366953bdE98081",
            "0xcdA16A18d3F942571E7ba81B7D2219A6802C45A1",
            "0x2A2c1102cC6F3eF7e3d469e47c70ad8181C1FaED",
            "0x931fB9C9bfB7B723Ccb54CeEeA5F1C670C899B63",
            "0xd0c0f5A2284cc70b8442108FE8ADD8E8499b4828",
            "0x95D903DFD1D65D75a527D50Ddea8d35695bE2D7e",
            "0x4A11a811e05FdDa19A17E34ce1C9C8efD2018cc4",
            "0x3e0cf03f718520F30300266dcF4DB50bA12d3331",
            "0xd3778DC1D8EE4f2D8574F785AB1F8D949b246f00",
            "0xe1690f5153aD0BBc683964aA81645C49b3cF6567",
            "0x4ae901FBdB69eA08d63224964fC5E9696F0Fe6d0",
            "0x7eC4583A83686d6e4A4e76D0b04c5be765850d00",
            "0x5f8Fd99047265Af45071f40042DA15c1BD375B85",
            "0xf79a4ce9bd79f43257e24986dd35c3dfc5da5460",
            "0x6e7B9FC055c9a895E3A247CC4816b7A695b7e6F2",
            "0xbd52889A4cB198a0E2cE36b52Cdf75c4e65875A8"
        ]
    },
    {
        "week": 20,
        "tokenID": 32,
        "members": 24,
        "memberArray": [
            "0x5fb4a0983daD1A0fae31ED67F1aaffeA3F3E8eC2",
            "0x4BeE0d0d6C437a9Ac4a24088824a8660bb18431C",
            "0xBd095eC1Ce4407de9dEbCf6Ebb90E8829A18F403",
            "0xcc17e6ec4540cb49E871B00A00157DD20375C253",
            "0x0B7dc67a6eCF6Bc0388409DDde919aaFcF0E0ff7",
            "0xD8aF41080acbC4B0b5C2Cc58A0D414442c8c6Fd9",
            "0x45B115bf21872c798b8f131EEE9AFA30b96A249F",
            "0x64FA0191Ee9C145B38c43BeBf87A717533caB9b5",
            "0x07206D87ADFB4588ebE0f5a2f30C17edbde7EdC8",
            "0x466822e78F979f6285aa40F978cC55A499965dC0",
            "0xd0c0f5A2284cc70b8442108FE8ADD8E8499b4828",
            "0xba944AbD6Ad261B220dcc8ba6b53410Cb024FCB1",
            "0xf75c6d62BaD71c28DC1a0FF2b47A6eEd66Ef95B9",
            "0x15c1021FC75619e629Fb8FE76Ea2C23d1dbEB130",
            "0xb00E81207bcDA63c9E290E0b748252418818c869",
            "0xe1690f5153aD0BBc683964aA81645C49b3cF6567",
            "0xCB126975031e92B49Cb3FD8A7209519e47FB8929",
            "0xcE8C42230891064f0Dfeef720fE2e60e6BC37a1A",
            "0xF10FE5393f0A3C4a803551b4ee198fD40D2b50b7",
            "0x9008676d9EcC75c506aAd7C70eBD55523fcb725d",
            "0x80E659027343ba9634F96f8d99BCcEa3A08CE2EA",
            "0x58a133632547b6eadf2998ba2da5796a49657aee",
            "0x2A2c1102cC6F3eF7e3d469e47c70ad8181C1FaED",
            "0x378bde8b897D64F4047189C3F8b689008A560bad"
        ]
    },
    {
        "week": 21,
        "tokenID": 33,
        "members": 24,
        "memberArray": [
            "0x5fb4a0983daD1A0fae31ED67F1aaffeA3F3E8eC2",
            "0x6e7B9FC055c9a895E3A247CC4816b7A695b7e6F2",
            "0x978B5720120E9C39a293293619874547614a7fBE",
            "0xa4f026D2799C6E1dC057f20725B3794dB6d68888",
            "0xF9865219A179120bE194Cef843fF3957Bd49ed83",
            "0xC3130F83BdcF5E84f777d58580Ce99D811aea108",
            "0x60C8EeD11cccAb1e6D75a825dd9f36d85d855c53",
            "0x62a27B6DF055Fe39870A968291FE3bD82F7DCAF6",
            "0x6e7B9FC055c9a895E3A247CC4816b7A695b7e6F2",
            "0x9372fE6d14d57988B7EC923815Cc9243B313D532",
            "0xDeDd3D2a2219458eaD3afF1C006a759489b94106",
            "0x1E0b16d340eD938A71467998e997e995110eD596",
            "0xCE11942c34Bb02a889d8049D56a16E30313CbF6f",
            "0x0BaBd8774f4FB8904184b0965204e5A9Db43aCfe",
            "0x01fFCc7285866E5cEE14c8E807cB2E8d5f61079f",
            "0xA7092b4b09ADA332177A20f509089707910fC4b4",
            "0x0151cc37E580002656BD501d6084E6A2131d8B04",
            "0x62a27B6DF055Fe39870A968291FE3bD82F7DCAF6",
            "0x27cAFf28136DCE030aa4811249297c0962219a33",
            "0xdc211A0666bed568D5caFfbf538Ec221FCD1402f",
            "0x6a5D4157C186F87aa053b65cDbdd6a6BA372f64E",
            "0x5bEED0516Cbf1857183c9Fe25179Eb3B3c2FdF43",
            "0xBB20DD02e4b580A6977fDD161858714954b82244",
            "0x0D6E22D88c703FAf1EbF6a00CE31268fA6BBd069"
        ]
    },
    {
        "week": 22,
        "tokenID": 34,
        "members": 24,
        "memberArray": [
            "0x5fb4a0983daD1A0fae31ED67F1aaffeA3F3E8eC2",
            "0x7D7b53A5F64eA47047A94D0F3Bb87B2F2C43e547",
            "0x1699c95e4300BB24C7159EBebE15230Ac096979C",
            "0xCF96021f1ebEdc4b772347583323b194c7d55dA0",
            "0x2A2c1102cC6F3eF7e3d469e47c70ad8181C1FaED",
            "0xFde166416b94C92A98966833c71c3AD3E209f8Bf",
            "bnb1gvnneevr42ree4ylsh5sd2f3cqwrk2kkpy02j0",
            "0x54F2D5Fb13766fcb9224cC4D016FF31D0967F7cf",
            "0xe7087F15a278EE1fE4B4AAefBCdB1D1FDE261d78",
            "0x552E9b92A0E1aE5039Fd6661DF6610759338c319",
            "0xd0f9899ec83BF1cf915bf101D6E7949361151523",
            "0x98B15A3D3D14a575f001f576ea11Ca91341D41b8",
            "0x60299070384645339181578946cF1aFaf74179dc",
            "0x63c410A066d5d12217b713cCac5F600A06ba45e6",
            "0x62a27B6DF055Fe39870A968291FE3bD82F7DCAF6",
            "0xCDb3B3F161c6c683104ea4E1F8B48C08e266a613",
            "0x879a39B2D6Ad777293D7854d992aB65D2a456F80",
            "0x2F6102a60813aF809C8dA5f46Ceb1D022dd718f2",
            "0x0BaBd8774f4FB8904184b0965204e5A9Db43aCfe",
            "0x8767c5124E80d6528bd3d46067f0B68Ab8e2dCB3",
            "0x732Bb47210fDB676Ee1596d18FEE6F48DE2d37cb",
            "bnb134ajamqtcm38z7efqyh24ts9ca6meg0r9aalph",
            "0xA29B2573469E80Debe0AB3BAbf6008e5FB3d8722",
            "0x4A11a811e05FdDa19A17E34ce1C9C8efD2018cc4"
        ]
    },
    {
        "week": 23,
        "tokenID": 35,
        "members": 24,
        "memberArray": [
            "0x5fb4a0983daD1A0fae31ED67F1aaffeA3F3E8eC2",
            "0x98B15A3D3D14a575f001f576ea11Ca91341D41b8",
            "0xF9F02eb35cc9F22A69DAA26bE2B1A57e3Ab4bD53",
            "0x75D7d7972A62B00fF7Ef071741C929F59d185ee6",
            "0x4f83f16daf94C47CF1Af3564f1743dcB9b068a6e",
            "0x9869bB9e74d8C243D4df886CfC3eDD184D59347B",
            "0x75675550EE37B30bbcF84e04322C0974377eee8d",
            "0x0BDA046968c97347C6154f59013f059cA88Bb03A",
            "0x414BcB4dC136F64904f1cF38E7dF088966CA86Dd",
            "0x09035b6C00F0aB297778C71e81702DA85d77B6c2",
            "0xB8c1f1ed17DA6FC4AC2ED6e8EdBb9b7724Ce44e4",
            "0x28faf1599A9c3a9b8463DfeB23d06B6495aE91bC",
            "0xF10FE5393f0A3C4a803551b4ee198fD40D2b50b7",
            "0xbd52889A4cB198a0E2cE36b52Cdf75c4e65875A8",
            "0xC3130F83BdcF5E84f777d58580Ce99D811aea108",
            "0x7fD46A537615852A32f01222f22AFbFA124e9223",
            "0xc1dDd138895f37531e7c59886c9fD8E52f935b3E",
            "0xCF96021f1ebEdc4b772347583323b194c7d55dA0",
            "0x2F1373cd12926996A0440D09AdF5453174bB4441",
            "0x997fb1A5a5c9983A2ffEB9453E719975A2583Dc8",
            "0xc0bbdc46b5661Bad3af778723723dEC410029793",
            "0x6ea9399aEea278901d7F4c980f7B4B9c5b69b8fC",
            "0x4c910b727cbC44799aAa5c8C20Ef049B54CF275F",
            "0xCF96021f1ebEdc4b772347583323b194c7d55dA0"
        ]
    },
    {
        "week": 24,
        "tokenID": 36,
        "members": 24,
        "memberArray": [
            "0x5fb4a0983daD1A0fae31ED67F1aaffeA3F3E8eC2",
            "0xFF124C496D296c13d438c629c8212B5342584282",
            "0x98B15A3D3D14a575f001f576ea11Ca91341D41b8",
            "0x1AC49508F7C1ce2A796517269deFEFC535050Fd8",
            "0xe1690f5153aD0BBc683964aA81645C49b3cF6567",
            "0x32648075ecd353767dA2faFEF3C56a4283567f12",
            "0x9008676d9EcC75c506aAd7C70eBD55523fcb725d",
            "0x775373E7521EcaC8dE59Ba7aC2129615200D0418",
            "0x2b053AE11104925fEe42dB51843875a9712236A0",
            "0xbce4d707e4a8543057541bc4e0f8cec5f8dc9d42",
            "0x868e6cB354D1FDE30e8e7FceBE1afEaed9Ff28cE",
            "0x6D5E3B9B1Da69DFB677F81682CFDec404a207bf0",
            "0xAA1C73B88867DD5Ae89813f2d1b4F715D7D9A134",
            "0x98B15A3D3D14a575f001f576ea11Ca91341D41b8",
            "0xD9e536655C2eC225d5A143395814332A179B3f3A",
            "0xa9dDc3383Ab709EA54aB5B4f9f89F57E60EB2F4f",
            "0xB8c1f1ed17DA6FC4AC2ED6e8EdBb9b7724Ce44e4",
            "0x39DE56518e136d472Ef9645e7D6E1F7c6C8Ed37b",
            "0x5c6d2ac4A20A1f5812Dc7229B9812d10d798F17a",
            "0xA4b7be6F43c325B76CBB95ac1D2110e45D1e9f6d",
            "0x4b3091e88eD72902E9703693C54d1315d852B3cE",
            "0x08B37C9aB0CE6b1D5Aa73A20Dfea634b78698065",
            "0x9869bB9e74d8C243D4df886CfC3eDD184D59347B",
            "0x09035b6C00F0aB297778C71e81702DA85d77B6c2"
        ]
    },
    {
        "week": 25,
        "tokenID": 40,
        "members": 36,
        "memberArray": [
            "0x5fb4a0983daD1A0fae31ED67F1aaffeA3F3E8eC2",
            "0x90D6Cc871224965b6509F216b3A5119A37C4c5Dc",
            "0x9780bEdcC437782846d60D6C074D18Ed24765bBf",
            "0x9008676d9EcC75c506aAd7C70eBD55523fcb725d",
            "0x03Dc54Da70469dc3d53D4aF0AE43236B6ff4F2b7",
            "0xc5cee9416571752528ACbb4331761C5E2706748c",
            "0x58a133632547b6eaDF2998ba2dA5796A49657aEe",
            "0xdE708DEcb61D06eE30a95051DD203f43e0D44c70",
            "0x3c72acAc51924fEd90EE476FCa34178A868fC864",
            "0xC26dCb3301cdB8385aa5b1C0B42496c50fb608f8",
            "0x4F1B4a2D5cF60240dF3035688db8CCeB97170301",
            "0x42FAD4d519223C22C40aCE6DeDE72E56B4d15439",
            "0xC501A1F534b9c219BDB407bE12fCb01ddF9A3694",
            "0x3558f346fECf745365fc2944d8F9ae970aE21759",
            "0x03Dc54Da70469dc3d53D4aF0AE43236B6ff4F2b7",
            "0x9FCAE73fbf4fC6283B636f707c17529c2ba7b684",
            "0x12589b475016f2e6f9e9a3c8097c435Fb990d5D8",
            "0x02CA4101eA84f400c62b3BeB87Fb5450a8702941",
            "0xeBc462355194903ad1AD32fa767B3B74D5acA278",
            "0xFF124C496D296c13d438c629c8212B5342584282",
            "0xbdF5A9E1470a439f8E479E14FF98E471f59CD7E4",
            "bnb134ajamqtcm38z7efqyh24ts9ca6meg0r9aalph",
            "0xac35452f3deB273d37bC1Ee84B60723CDbCCAeda",
            "0x502aAf1A596A0dF4b5C738b08980d8e07562044b",
            "0xFCC8ed5bCDdc5002804b0a0f48ECDA71eD094aF6",
            "0x210154d33Ef8297428ad6fbf7e45846305789175",
            "0x6bB84c48a071E8169aaD9fd94E8B748aC4eA3F05",
            "0x7601f38fbc12a94a5bb0726eca5e093bbd870d50",
            "https://runevault.org/collectibles",
            "0x62a27B6DF055Fe39870A968291FE3bD82F7DCAF6",
            "0x39DE56518e136d472Ef9645e7D6E1F7c6C8Ed37b",
            "0x63219DBA946d29DEC79Ff8ebdE58aAd5d9523245",
            "0x5D7C72C4014ed4008cF574EFF487ca24f345cf14",
            "0x9372fE6d14d57988B7EC923815Cc9243B313D532",
            "0xafcbef644a5c68909fe937691d4829b4355187b9",
            "bnb1xutm7nm9l46c9p5xvx94xuz08r3qadd28teygq"
        ]
    },
    {
        "week": 26,
        "tokenID": 42,
        "members": 21,
        "memberArray": [
            "0x5fb4a0983daD1A0fae31ED67F1aaffeA3F3E8eC2",
            "0x6bB84c48a071E8169aaD9fd94E8B748aC4eA3F05",
            "0x42FAD4d519223C22C40aCE6DeDE72E56B4d15439",
            "0x1AC49508F7C1ce2A796517269deFEFC535050Fd8",
            "0x7F3E7bfe49f81c23Ce102D78a7C01382ec3fCfbF",
            "0xaa5ba45127268b7e4b59058a952ab1e926de2075",
            "0xDAe442e757374088bEBad7e24E5A541Dc6C94E54",
            "0xF867a0AE2ba8cEafDAC18B57a2C6B0E4a7D91bEc",
            "0x3D15Ad752798866025EEA52Dd60Cc687ee27fE4D",
            "0xE5D12B67755d2d68Dd69821fed9d7cC9c92fEf33",
            "0xBB20DD02e4b580A6977fDD161858714954b82244",
            "0x72540C9142cd326d2b60a464801D99c04D361dCF",
            "0xED376BE0003D1C6626DD8C353b84697e315a821C",
            "0x215B67D707cEd250c3803a19348E9C565E42d7A3",
            "0x04aEE20BE071c84050649cfe0b1A754Cc4555D92",
            "0x818a86f6db284A7E45ed98Cc1Ba88D534d07C74D",
            "0x6020CfA3B334879716de1EC88F5C81904f9ea454",
            "0x502aAf1A596A0dF4b5C738b08980d8e07562044b",
            "0xF9865219A179120bE194Cef843fF3957Bd49ed83",
            "0xbdfA4789f3606A95dF9Cb63167dA4592a63007ef",
            "0x6968D0E283225eB6AF7C85c8ea2DBCdDB4B6a246"
        ]
    },
    {
        "week": 27,
        "tokenID": 43,
        "members": 21,
        "memberArray": [
            "0x5fb4a0983daD1A0fae31ED67F1aaffeA3F3E8eC2",
            "0xa21bb86c5ea3e3ed98baa50be086ee0fb931843f",
            "0x1E9cb8699106dD3dB13f9307b898017EC79f0C3C",
            "bnb16k475042gh550qwn5re3j7wfc484c743cdns7s",
            "bnb134ajamqtcm38z7efqyh24ts9ca6meg0r9aalph",
            "0xBcCAf388cfB9eFA233a8C45c7757E02849926916",
            "0x526C7665C5dd9cD7102C6d42D407a0d9DC1e431d",
            "0xA57c1Af56140A195F876310414C34fE9FE399D87",
            "0x3F9517ac3CCC311C84826fB000bc8df1e45C4b72",
            "0x466822e78F979f6285aa40F978cC55A499965dC0",
            "0x0fD84d7cb911728737556684050782B298F70f0f",
            "0xA4b7be6F43c325B76CBB95ac1D2110e45D1e9f6d",
            "0xA12D3c264D56CE0e31a8c1389934F9fb4f99544e",
            "0x526C7665C5dd9cD7102C6d42D407a0d9DC1e431d",
            "0x8c2721600158b3bEB1bC6575EFf57F50dDDF00C6",
            "0xCF96021f1ebEdc4b772347583323b194c7d55dA0",
            "0x2377d9f1a4d88369d0360d3c3921747081ae25c7",
            "0x7675470354a1e34106F4d8c0FBC02E73410e0c32",
            "0xDAc43E419a6eAB0250D2800B9Ad531605d4254Fd",
            "0x60299070384645339181578946cF1aFaf74179dc",
            "0x210154d33Ef8297428ad6fbf7e45846305789175"
        ]
    },
    {
        "week": 28,
        "tokenID": 44,
        "members": 21,
        "memberArray": [
            "0x5fb4a0983daD1A0fae31ED67F1aaffeA3F3E8eC2",
            "bnb1dq2ms3k6497fgvrafusecugj7x25v4dgvwaqmm",
            "0x7F3E7bfe49f81c23Ce102D78a7C01382ec3fCfbF",
            "0xb30217Cb6EAcfd76B302b91d0E5450AA06EC201E",
            "0xdc744Aa4d1964E700E9f1A60e37eC18F70851029",
            "0xCfa69328A74C0eAc388B889c21eB3ddd9d41a025",
            "0x0BEcC5309a325A7089fBAbE0cc0E9743C583F8Fa",
            "0xE5D12B67755d2d68Dd69821fed9d7cC9c92fEf33",
            "0x08B37C9aB0CE6b1D5Aa73A20Dfea634b78698065",
            "0x22BE9582CDef4eF2e6d4b119547AecD7652D9e28",
            "0x5Db16FefCE9e8bA024d064268b041C68ED7F9fbC",
            "0xb1ead214506d0cd73785dd09b3efc2307133bf69",
            "0x1a4021B237f9afE8d402104340Ebdc0accbC4A06",
            "0x1AC49508F7C1ce2A796517269deFEFC535050Fd8",
            "0x68c6a54596Dd8FE889054E99F3212045F4235680",
            "0x67e5ab5b573F01030a1076dDA7A79Ef0f31A1bFa",
            "0xac35452f3deB273d37bC1Ee84B60723CDbCCAeda",
            "0x3D8a77aF5659887d18aEA0854EBaDa7a104FB545",
            "0x145309F6779bfD24533082Ab5ca1111A00016815",
            "0x9Ae061A3E78f3EA59130cE0cfA9cA6C7483D07ef",
            "0x5a7C4e9dF477e29c00911030CFc6111e2DbB62bc"
        ]
    },
    {
        "week": 29,
        "tokenID": 45,
        "members": 21,
        "memberArray": [
            "0x5fb4a0983daD1A0fae31ED67F1aaffeA3F3E8eC2",
            "0x81fF3A04B9bD7602357992792Ef44204376BDf7f",
            "https://runevault.org/collectibles",
            "0x443Da397aa57b7D264B97B9cFCd51dADF5Df4e19",
            "0x75D7d7972A62B00fF7Ef071741C929F59d185ee6",
            "0xd470b1ac529a2bc704b6e7467485d52569daf2c1",
            "0x58a133632547b6eaDF2998ba2dA5796A49657aEe",
            "0xE4F60f6Fe872d5b910E72A11D09cdcf3780d20dB",
            "0x27cAFf28136DCE030aa4811249297c0962219a33",
            "0x7D7b53A5F64eA47047A94D0F3Bb87B2F2C43e547",
            "0x7f9C8843926De4b2eA6cBf9381F9f2FA81C58ed6",
            "0x575757e0a0b19bEe7e07887FbBD616b395E32D4b",
            "0x22BE9582CDef4eF2e6d4b119547AecD7652D9e28",
            "0x7D7b53A5F64eA47047A94D0F3Bb87B2F2C43e547",
            "0xb7626141EF37F183A7A61Dce76304c8b074c0988",
            "0xa362a9EFE31631f2252B85B99eaC0c2139A1A6BF",
            "0x526C7665C5dd9cD7102C6d42D407a0d9DC1e431d",
            "0xFDDeAf7829d20C6CFaDd20893493d9412B6F3f0D",
            "0xd470b1ac529a2bc704b6e7467485d52569daf2c1",
            "0x1e6F6a74e9cBf8d71F4087Da022Edb0680802301",
            "0x1E237976F0D579AD4b3bDC4557be3491EB925d39"
        ]
    },
    {
        "week": 30,
        "tokenID": 46,
        "members": 21,
        "memberArray": [
            "0x5fb4a0983daD1A0fae31ED67F1aaffeA3F3E8eC2",
            "0x0BEcC5309a325A7089fBAbE0cc0E9743C583F8Fa",
            "0xcc17e6ec4540cb49E871B00A00157DD20375C253",
            "bnb1gvnneevr42ree4ylsh5sd2f3cqwrk2kkpy02j0",
            "xardin.argent.xyz",
            "0x08724E55d71B19DF96f56B656aD466c5bCf6c395",
            "0x76a95d549Ca36d955Df2c72F693690d8e51a94d0",
            "0x466822e78F979f6285aa40F978cC55A499965dC0",
            "0x1E237976F0D579AD4b3bDC4557be3491EB925d39",
            "0xffAb2Ab5C1065ECD2a9Df176C27a5095E78D0740",
            "0x47E87173F9dbe2d472a80b8974c05eB273eb3f4B",
            "0xCB126975031e92B49Cb3FD8A7209519e47FB8929",
            "0xA29B2573469E80Debe0AB3BAbf6008e5FB3d8722",
            "0xF3e8a7AE6F60bE09Ee463B6278F293f4289e871F",
            "0xCF07D97889f1b2c2BdD8c2C91B0a639F867B00A2",
            "0x2b053AE11104925fEe42dB51843875a9712236A0",
            "bnb16k475042gh550qwn5re3j7wfc484c743cdns7s",
            "0xe1690f5153aD0BBc683964aA81645C49b3cF6567",
            "xardin.argent.xyz",
            "0x5FFC32c736Ed221aDD02Af2af6AD6659a6DDBbB5",
            "0xB8c1f1ed17DA6FC4AC2ED6e8EdBb9b7724Ce44e4"
        ]
    },
    {
        "week": 31,
        "tokenID": 47,
        "members": 21,
        "memberArray": [
            "0x5fb4a0983daD1A0fae31ED67F1aaffeA3F3E8eC2",
            "0x75D7d7972A62B00fF7Ef071741C929F59d185ee6",
            "0xdc211A0666bed568D5caFfbf538Ec221FCD1402f",
            "0x6893593C695d23f002F9278FA75aE1367Ce78d96",
            "0x612112d107743FDb4c64F7990A76B01046bFB812",
            "0xdd84306537D24D4F1Fc7bB149CdC619Ebea8c344",
            "0x42FAD4d519223C22C40aCE6DeDE72E56B4d15439",
            "0xDAc43E419a6eAB0250D2800B9Ad531605d4254Fd",
            "0x1eB7409641e914888f2fF6d00601d8e03094b98f",
            "0x60299070384645339181578946cF1aFaf74179dc",
            "0x1AC49508F7C1ce2A796517269deFEFC535050Fd8",
            "0x4ae901FBdB69eA08d63224964fC5E9696F0Fe6d0",
            "0xFB99f02A99bc250F691e68D05260be56E2727c99",
            "0x47E87173F9dbe2d472a80b8974c05eB273eb3f4B",
            "0x07206D87ADFB4588ebE0f5a2f30C17edbde7EdC8",
            "0x775373E7521EcaC8dE59Ba7aC2129615200D0418",
            "0x52B9937B339c8E253e4f6ead28cE4d8BF3b52E36",
            "0xdd84306537D24D4F1Fc7bB149CdC619Ebea8c344",
            "0x76985F8bD32dE258dFc8ae497ED5F0112322D078",
            "0x7a164f6DAde07Bcac283391D75E12c0Aeb20B65D",
            "0x68575571E75D2CfA4222e0F8E7053F056EB91d6C"
        ]
    },
    {
        "week": 32,
        "tokenID": 50,
        "members": 27,
        "memberArray": [
            "0x5fb4a0983daD1A0fae31ED67F1aaffeA3F3E8eC2",
            "0x9Ae061A3E78f3EA59130cE0cfA9cA6C7483D07ef",
            "0x8A4Fd76e9547cc32693f054F34C153FF7506A5a1",
            "0xa4f026D2799C6E1dC057f20725B3794dB6d68888",
            "0x08B37C9aB0CE6b1D5Aa73A20Dfea634b78698065",
            "0x4530f9c72A873c6faF81Bc0E41b13DC8De417ac2",
            "0xce2ee46d71Be0e97E0557EF428a7071FBD117C9C",
            "0xc31Bf9A4969a3AD0F2B9823317B329125bD3e923",
            "0xffAb2Ab5C1065ECD2a9Df176C27a5095E78D0740",
            "0x4DbB9427c55F9a1241b24847E67366046422Ee19",
            "0x764Cc3cED132f1A7cf4FB06A49df1b846A585a4D",
            "bnb1xutm7nm9l46c9p5xvx94xuz08r3qadd28teygq",
            "0x31e0E2f2a3C6E8203B4F61C2CF59d3723dDE9557",
            "0xa0936063ef229f5f27C9f2383d98D5483F36524F",
            "0xdE708DEcb61D06eE30a95051DD203f43e0D44c70",
            "0x5dF88ffd3AC292a91C5E2D24abE322B1c7Dbc4D3",
            "0xFCC8ed5bCDdc5002804b0a0f48ECDA71eD094aF6",
            "0x0e78641A5aa08b44c3c33b4Ea085c82749f06cda",
            "0x5E2D8f411d2DBbb537ecd4B72BE68bC5E98573a5",
            "0x6a70fF3914b0939125bcC34957DF20DeEc4871",
            "0xcB744534a44083acd8C3B0b0B2D6E06fAA50b9aA",
            "0xbefa1156Fb87B82c5A1231cB005097CE680cc74D",
            "0x2F6102a60813aF809C8dA5f46Ceb1D022dd718f2",
            "0xD9e536655C2eC225d5A143395814332A179B3f3A",
            "0xce8c42230891064f0dfeef720fe2e60e6bc37a1a",
            "0x210154d33Ef8297428ad6fbf7e45846305789175",
            "0x0BEcC5309a325A7089fBAbE0cc0E9743C583F8Fa"
        ]
    },
    {
        "week": 33,
        "tokenID": 52,
        "members": 18,
        "memberArray": [
            "0x5fb4a0983daD1A0fae31ED67F1aaffeA3F3E8eC2",
            "0x09035b6C00F0aB297778C71e81702DA85d77B6c2",
            "0x35E96644E060d60a9DBF901EFae689D2D7B0f861",
            "0x868e6cB354D1FDE30e8e7FceBE1afEaed9Ff28cE",
            "0xF9Ca61b2C3938D3C5Ec8Fa669622240A7a0cb316",
            "0x9869bB9e74d8C243D4df886CfC3eDD184D59347B",
            "0xbd52889A4cB198a0E2cE36b52Cdf75c4e65875A8",
            "0xe8Dc3cE0bf4a07C7854331E663ff86cFC7BB7839",
            "0xF670fD01a42a80C5098d4785638F7B0a8Ac69010",
            "bnb19w8ac9srzwa3mcne6eh2vkvevgg3fumj55wdyq",
            "0x1e6F6a74e9cBf8d71F4087Da022Edb0680802301",
            "0x321d5a4c9f9f0c9607df5464d993bebb0ad25fb1",
            "0x2F6102a60813aF809C8dA5f46Ceb1D022dd718f2",
            "0x240Fe653Bc3ae1F87aEf10757bc7367F03c7a518",
            "bnb1fvf0qpwl42s2s234umszud03u6md3kd0g8mffn",
            "0xA29B2573469E80Debe0AB3BAbf6008e5FB3d8722",
            "0x4d1925d3539EB9cd802E219F1ca3860dc3AF1dAB",
            "0x240Fe653Bc3ae1F87aEf10757bc7367F03c7a518"
        ]
    },
    {
        "week": 34,
        "tokenID": 53,
        "members": 18,
        "memberArray": [
            "0x5fb4a0983daD1A0fae31ED67F1aaffeA3F3E8eC2",
            "0x01303CE328eE52Eb6f76708b75f55ad19467D450",
            "0x4a5BB1c9347A0d4F7e06a29239162f03647d9232",
            "0x56E773B0a620205E9f72265b6013b65B84c2c4aF",
            "0x287e2c76Aab4720786076c3DEedD7Dd386092050",
            "0x3c834EcaF4Af7ffF616EdBC6e0cB0Cb42825e8F8",
            "0xce2ee46d71Be0e97E0557EF428a7071FBD117C9C",
            "0x7F3E7bfe49f81c23Ce102D78a7C01382ec3fCfbF",
            "0x2bEC1Fb28A18c94B0361D2DF3d01d44fa4bDDA44",
            "0xd12b2B215e2133e1028b24b1389912EfE06e4531",
            "0x612112d107743FDb4c64F7990A76B01046bFB812",
            "0x32349c94082a8cFd9CaC7031f4ec980f8d94cbFD",
            "0xE5484C082938603dFdEB2ECdc28158d7D99241cB",
            "0x4a45e5D876df1614d48Bb1A1791de1D0fdDc4b97",
            "0x877f95ba7ff6ffaab65f6589a404de63c15c1cf4",
            "0x17Ba0C93587BE8dbbCe33EA408760B5Ead8FD059",
            "0x2b053AE11104925fEe42dB51843875a9712236A0",
            "0x5c6d2ac4A20A1f5812Dc7229B9812d10d798F17a"
        ]
    },
    {
        "week": 35,
        "tokenID": 54,
        "members": 18,
        "memberArray": [
            "0x5fb4a0983daD1A0fae31ED67F1aaffeA3F3E8eC2",
            "0x4928B4004c878a5fbb4A81B8406a4807491dAc06",
            "0x45B115bf21872c798b8f131EEE9AFA30b96A249F",
            "0x5C5aBb7047b27c70ABec5a840f3D0C4c7759Ce8F",
            "0x7f9C8843926De4b2eA6cBf9381F9f2FA81C58ed6",
            "0x08B37C9aB0CE6b1D5Aa73A20Dfea634b78698065",
            "0x6253e5478d686E943c3751a392B523072DD97676",
            "0x5d4D290dADDA464a247f1efa91E67D2830f699e9",
            "0xA29B2573469E80Debe0AB3BAbf6008e5FB3d8722",
            "0x3c834EcaF4Af7ffF616EdBC6e0cB0Cb42825e8F8",
            "0xb00E81207bcDA63c9E290E0b748252418818c869",
            "0x20f9ddFA193D0fe2f73d8b7D749B1355eF019887",
            "0xBd095eC1Ce4407de9dEbCf6Ebb90E8829A18F403",
            "0xbdfA4789f3606A95dF9Cb63167dA4592a63007ef",
            "0x72540C9142cd326d2b60a464801D99c04D361dCF",
            "0x71232ead3bec1ac03ecfe2556acd6c7d0bd349c7",
            "0x5C5aBb7047b27c70ABec5a840f3D0C4c7759Ce8F",
            "0xa0936063ef229f5f27C9f2383d98D5483F36524F"
        ]
    },
    {
        "week": 36,
        "tokenID": 55,
        "members": 18,
        "memberArray": [
            "0x5fb4a0983daD1A0fae31ED67F1aaffeA3F3E8eC2",
            "0x60299070384645339181578946cF1aFaf74179dc",
            "0xDdc94bC4F885D9565A0BA6d3e0eB197049e116c5",
            "0x6e7B9FC055c9a895E3A247CC4816b7A695b7e6F2",
            "0xefC9C8d5AE4Aa2035AEF9A795A366953bdE98081",
            "0xBd095eC1Ce4407de9dEbCf6Ebb90E8829A18F403",
            "0xa4f026D2799C6E1dC057f20725B3794dB6d68888",
            "0x229229284c0eA7C2A898765a5652fc03F0e35293",
            "0x53c794B572612a12532168e05A473f097B6f99f5",
            "0xA57c1Af56140A195F876310414C34fE9FE399D87",
            "0x33746372bE88f16974b9Ca8Af4bB0e54C369eE3C",
            "0xDAc43E419a6eAB0250D2800B9Ad531605d4254Fd",
            "0x764Cc3cED132f1A7cf4FB06A49df1b846A585a4D",
            "0xcC0Af74c6a2a14734DadEe5FeaD9741Bb5A1b1Fe",
            "bnb1pnrjfsmwqd34xlknp0wx8qd6qn5mvmaha2h86c",
            "0x81fF3A04B9bD7602357992792Ef44204376BDf7f",
            "0xbae288e7f99216ed19e84632047be6818abda48c",
            "0x17Ba0C93587BE8dbbCe33EA408760B5Ead8FD059"
        ]
    },
    {
        "week": 37,
        "tokenID": 56,
        "members": 18,
        "memberArray": [
            "0x5fb4a0983daD1A0fae31ED67F1aaffeA3F3E8eC2",
            "0x4BeE0d0d6C437a9Ac4a24088824a8660bb18431C",
            "0xe90ac92Bc03542f9D38320bC0Fc9711eEaf4a6bd",
            "0x7F3E7bfe49f81c23Ce102D78a7C01382ec3fCfbF",
            "0x905700624E1B7cAa33eEc851ea361b3b72783B71",
            "0x00B5a19D64280cD5ae9308b4B82b4aa7Ca575494",
            "0x58a133632547b6eaDF2998ba2dA5796A49657aEe",
            "0xB2c4D35cB20b0D6A7538da5683D03037068B26dD",
            "0x3D139AE6E4A2287E9aCb8Db276FB4d6f8123E55F",
            "0x11C8D4C8d0FF92bE67eFD2dBd860654BeB102687",
            "0x92cB619343bb64033445eD073adECeC0d4A4fC47",
            "0x8A4Fd76e9547cc32693f054F34C153FF7506A5a1",
            "0xdDF6470B257C5CC8b2ED142EE88d331d8339D2b4",
            "0x0C5E9D3DD69bBDAC2C66910e3279f12E95800C43",
            "0x862059F71CB59869fEeA3713E412C0761095b065",
            "0x04aEE20BE071c84050649cfe0b1A754Cc4555D92",
            "0x444Cccd929798759996ff594B234ED8Fc5e496A9",
            "0xdc211A0666bed568D5caFfbf538Ec221FCD1402f"
        ]
    },
    {
        "week": 38,
        "tokenID": 57,
        "members": 18,
        "memberArray": [
            "0x5fb4a0983daD1A0fae31ED67F1aaffeA3F3E8eC2",
            "0x60C8EeD11cccAb1e6D75a825dd9f36d85d855c53",
            "0xEA29a51b283eA6C0d3872a5c3dF4ddE3cba94128",
            "0x931fB9C9bfB7B723Ccb54CeEeA5F1C670C899B63",
            "0x6253e5478d686E943c3751a392B523072DD97676",
            "oxE7d5c09b70CD90a4e4cfa145256E7F98cE4265bE",
            "0xEA29a51b283eA6C0d3872a5c3dF4ddE3cba94128",
            "0x403Adb732dca2D06D41Eeb2704497b8294DF3CE8",
            "0xa21bb86c5ea3e3ed98baa50be086ee0fb931843f",
            "0x17Ba0C93587BE8dbbCe33EA408760B5Ead8FD059",
            "0x4b04E13E0FDee2081f05F141dceA715E6d042823",
            "0x17Ba0C93587BE8dbbCe33EA408760B5Ead8FD059",
            "0xD8aF41080acbC4B0b5C2Cc58A0D414442c8c6Fd9",
            "0x82A2f965D95F8476d3F833673b02E92436238d18",
            "0xa881e7264Cfa774545CA0D805EC83E2725A94b22",
            "0x0AF7F73579327Eb0A04abe4364143965CF7FC356",
            "0x33746372bE88f16974b9Ca8Af4bB0e54C369eE3C",
            "0x8123083C03Dd253E593A9DCd62619A223cc4dB22"
        ]
    },
    {
        "week": 39,
        "tokenID": 60,
        "members": 18,
        "memberArray": [
            "0x5fb4a0983daD1A0fae31ED67F1aaffeA3F3E8eC2",
            "0x12589b475016f2e6f9e9a3c8097c435Fb990d5D8",
            "0x8A6A6Dbb42Af38506996A35D8d49c61f8F528cCa",
            "0xa9dDc3383Ab709EA54aB5B4f9f89F57E60EB2F4f",
            "0x3D139AE6E4A2287E9aCb8Db276FB4d6f8123E55F",
            "0xF3e8a7AE6F60bE09Ee463B6278F293f4289e871F",
            "0xCB126975031e92B49Cb3FD8A7209519e47FB8929",
            "0xBB20DD02e4b580A6977fDD161858714954b82244",
            "0x8123083C03Dd253E593A9DCd62619A223cc4dB22",
            "0xe1690f5153aD0BBc683964aA81645C49b3cF6567",
            "0x4b04E13E0FDee2081f05F141dceA715E6d042823",
            "0x3F421f9d5A4fcfA743D17ED1240bA8eC436b71Ab",
            "0x52E7bdE89Fcbd1e1C656Db1C08DdE45D82447e25",
            "0xc376ADe541Fcf465931AA317afde8c77EBE534D8",
            "0x52741646b31925F98394299463a2559Fa33c7335",
            "0x7Adf5937A1a5c3670AC7C82Fa6A8EC4EA70D6250",
            "0x6e7B9FC055c9a895E3A247CC4816b7A695b7e6F2",
            "0xa5749368BDf2CAB8B2ac32937b72E173f80f6840"
        ]
    },
    {
        "week": 40,
        "tokenID": 62,
        "members": 15,
        "memberArray": [
            "0x5fb4a0983daD1A0fae31ED67F1aaffeA3F3E8eC2",
            "0xF31171daC6C88C227feFAF0CE6C5003edA1A87E0",
            "0x4DbB9427c55F9a1241b24847E67366046422Ee19",
            "0x6D5E3B9B1Da69DFB677F81682CFDec404a207bf0",
            "0xCF07D97889f1b2c2BdD8c2C91B0a639F867B00A2",
            "0x03Dc54Da70469dc3d53D4aF0AE43236B6ff4F2b7",
            "0xc5cee9416571752528ACbb4331761C5E2706748c",
            "0xf5b9F3C09DCb5729fe0f2a2d404B73B6CEd6071E",
            "0x98D7b027A2242fF602D17E8E5Cd73e9C05c1b88d",
            "0x12F4B6bdd718326294FA171605B4CAC8554ea38D",
            "0x10079af0350ed9128c7f9fd429dD42eed32729e0",
            "0x202b21aC6C28ce40c9DEd882CAbB7428e4F2eE35",
            "0xb96757cA21E9cE46Aa5D98D5223bAAe5c8476a34",
            "0x60299070384645339181578946cF1aFaf74179dc",
            "0x80E659027343ba9634F96f8d99BCcEa3A08CE2EA"
        ]
    },
    {
        "week": 41,
        "tokenID": 63,
        "members": 15,
        "memberArray": [
            "0x5fb4a0983daD1A0fae31ED67F1aaffeA3F3E8eC2",
            "0x42d4c197036bd9984ca652303e07dd29fa6bdb37",
            "0xB04C9d6D966Bf6BA63318563b67201332945080A",
            "0x7E3F89e746Dd9a2eeb2c55654732d8BD67F3c8ae",
            "0xAc225A899578383bF26c7c5477Aa014C1f2Ba836",
            "0xAA1C73B88867DD5Ae89813f2d1b4F715D7D9A134",
            "0x4a6e297B23B9389380987e901481811d83e945C4",
            "0x27cAFf28136DCE030aa4811249297c0962219a33",
            "0x5637e768e946C2Bbd02Ea6b99FC2120f5A908062",
            "0x0B7dc67a6eCF6Bc0388409DDde919aaFcF0E0ff7",
            "0x82E7EB952433fDe566993670F32956a27424Eb1e",
            "0xaa5ba45127268b7e4b59058a952ab1e926de2075",
            "0x6a5D4157C186F87aa053b65cDbdd6a6BA372f64E",
            "0xCdDAD4fDaa65e7ab74DDA9e024f887A6765CAFbb",
            "0x31e0E2f2a3C6E8203B4F61C2CF59d3723dDE9557"
        ]
    },
    {
        "week": 42,
        "tokenID": 64,
        "members": 15,
        "memberArray": [
            "0x5fb4a0983daD1A0fae31ED67F1aaffeA3F3E8eC2",
            "0x97e57c2C1120e4559083964C69674177b0878FD8",
            "0xF9Ca61b2C3938D3C5Ec8Fa669622240A7a0cb316",
            "0x53c794B572612a12532168e05A473f097B6f99f5",
            "0x414BcB4dC136F64904f1cF38E7dF088966CA86Dd",
            "0xd0c0f5A2284cc70b8442108FE8ADD8E8499b4828",
            "0x75675550EE37B30bbcF84e04322C0974377eee8d",
            "0xCcB5520c2211af9fd7CAE749bB91728D72771E4F",
            "0x8c3De1634251D1e51C28844391FC9c11abB9F5E4",
            "0xf79a4ce9bd79f43257e24986dd35c3dfc5da5460",
            "0x1699c95e4300BB24C7159EBebE15230Ac096979C",
            "0xbae288e7f99216ed19e84632047be6818abda48c",
            "0x3D139AE6E4A2287E9aCb8Db276FB4d6f8123E55F",
            "0x466822e78F979f6285aa40F978cC55A499965dC0",
            "0x8C55615279E0CFAb39944fb7Ad6626dA3b98fed3"
        ]
    },
    {
        "week": 43,
        "tokenID": 65,
        "members": 15,
        "memberArray": [
            "0x5fb4a0983daD1A0fae31ED67F1aaffeA3F3E8eC2",
            "0",
            "0xdc744Aa4d1964E700E9f1A60e37eC18F70851029",
            "0xF3e8a7AE6F60bE09Ee463B6278F293f4289e871F",
            "0x3F2E632594BB94EB6E9D3dE03EDa0Da830390030",
            "0x61d0A005725b5A742d232655a7E22efb7Cad3414",
            "0x0170422c550C4c992AebD9AD848caC9e41507Cf7",
            "0xC1f0432F11C175e29681ff754B061E59394fbC49",
            "0x6ea9399aEea278901d7F4c980f7B4B9c5b69b8fC",
            "0x6b30E020E9517c519C408f51C2593E12D55B55fA",
            "0x9FCAE73fbf4fC6283B636f707c17529c2ba7b684",
            "0x0D6E22D88c703FAf1EbF6a00CE31268fA6BBd069",
            "0x430653fD0587aA16119cD7632b3090A3EcaEFfee",
            "0x11C8D4C8d0FF92bE67eFD2dBd860654BeB102687",
            "0xdB6837ef0829b5Bf1B3cC1dd86b990cE6094E777"
        ]
    },
    {
        "week": 44,
        "tokenID": 66,
        "members": 15,
        "memberArray": [
            "0x5fb4a0983daD1A0fae31ED67F1aaffeA3F3E8eC2",
            "0x1699c95e4300BB24C7159EBebE15230Ac096979C",
            "0x45B115bf21872c798b8f131EEE9AFA30b96A249F",
            "0xDAe442e757374088bEBad7e24E5A541Dc6C94E54",
            "0x502aAf1A596A0dF4b5C738b08980d8e07562044b",
            "0x4F1B4a2D5cF60240dF3035688db8CCeB97170301",
            "0x5c6d2ac4A20A1f5812Dc7229B9812d10d798F17a",
            "0xc780cA472Cd312DE98B4730520C9A60bC0886Fb5",
            "0x145309F6779bfD24533082Ab5ca1111A00016815",
            "5060264114573",
            "0x2F1373cd12926996A0440D09AdF5453174bB4441",
            "0x62a27B6DF055Fe39870A968291FE3bD82F7DCAF6",
            "0x2C2a33D73dF0915207DC8bE4e40e6A935189A7F8",
            "0xC36E75E9afbac4B96F689CB3c1e2a404896be616",
            "0xD056c9aE9c1B6a74E5848396F31069a6509988A5"
        ]
    },
    {
        "week": 45,
        "tokenID": 67,
        "members": 15,
        "memberArray": [
            "0x5fb4a0983daD1A0fae31ED67F1aaffeA3F3E8eC2",
            "0x4BeE0d0d6C437a9Ac4a24088824a8660bb18431C",
            "0x8c2721600158b3bEB1bC6575EFf57F50dDDF00C6",
            "0x1Db7B73Bfa0361479158110CAece0aB5E621Ff37",
            "0x68575571E75D2CfA4222e0F8E7053F056EB91d6C",
            "bnb19y0wrtk5334mqwcrtzqwymkeafl5vdaxywuxea",
            "0xE7bc05989a9f86734AbEF91A26c46dE665D96c1C",
            "0x56E773B0a620205E9f72265b6013b65B84c2c4aF",
            "0xC8938bf01EeE0e8c376e81214e1dF31593637d71",
            "0x4f83f16daf94C47CF1Af3564f1743dcB9b068a6e",
            "0x97e57c2C1120e4559083964C69674177b0878FD8",
            "0xf75c6d62BaD71c28DC1a0FF2b47A6eEd66Ef95B9",
            "0xb00E81207bcDA63c9E290E0b748252418818c869",
            "0x45ec7AaF83AB1B57556951E9840456111467F800",
            "0x3558f346fECf745365fc2944d8F9ae970aE21759"
        ]
    },
    {
        "week": 46,
        "tokenID": 70,
        "members": 9,
        "memberArray": [
            "0x5fb4a0983daD1A0fae31ED67F1aaffeA3F3E8eC2",
            "0x4BeE0d0d6C437a9Ac4a24088824a8660bb18431C",
            "0xb91bBdE050F65b0334aaD44ff05898F30daa3875",
            "0x865973fc3b40Aff4B16FF54BeB5aAefE33dcCf8d",
            "0xE5484C082938603dFdEB2ECdc28158d7D99241cB",
            "0x90D6Cc871224965b6509F216b3A5119A37C4c5Dc",
            "0x31e0E2f2a3C6E8203B4F61C2CF59d3723dDE9557",
            "0xED376BE0003D1C6626DD8C353b84697e315a821C",
            "0x08724E55d71B19DF96f56B656aD466c5bCf6c395"
        ]
    },
    {
        "week": 47,
        "tokenID": 72,
        "members": 12,
        "memberArray": [
            "0x5fb4a0983daD1A0fae31ED67F1aaffeA3F3E8eC2",
            "0x0D08D3Fe6FCA58E82982Ac4D0eADa1F457F4e929",
            "0x8f4eDb5Ac0a0710E9c4c0da4356a4cDe620772e7",
            "0x75D7d7972A62B00fF7Ef071741C929F59d185ee6",
            "0x210154d33Ef8297428ad6fbf7e45846305789175",
            "0x21748446955F1efC75bC9C843fBd3a8E6546d21f",
            "0x6c99b3d1eFe82A96d2D2f6ad511C2928648A61EE",
            "0xC370634a9f3e32b7275591F3e3F537645599f2bc",
            "0xac2E80F93d507ab5ef326B38B8C7363e02Bd2CFD",
            "0x877f95ba7ff6ffaab65f6589a404de63c15c1cf4",
            "0x6accD26626c150a4b485E6c9c541b38FE0AB5915",
            "0x972311dc283c1CC03d71D6f061D177E00Bd32737"
        ]
    },
    {
        "week": 48,
        "tokenID": 73,
        "members": 12,
        "memberArray": [
            "0x5fb4a0983daD1A0fae31ED67F1aaffeA3F3E8eC2",
            "0xf5b9F3C09DCb5729fe0f2a2d404B73B6CEd6071E",
            "0x8b68E6B6fa57F80b960e8a434DCcf8eb1b2739CA",
            "0x63ce102aEB2697A6738fa56Bd9E32764017Fc06f",
            "0x12F4B6bdd718326294FA171605B4CAC8554ea38D",
            "0x3B0f97112962e2256aE5d18647499e1185E746a4",
            "0x4a6e297B23B9389380987e901481811d83e945C4",
            "xardin.argent.xyz",
            "0xd8539FB4E0d594f735EBE10103B7C2c0023BEe38",
            "oxE7d5c09b70CD90a4e4cfa145256E7F98cE4265bE",
            "0xc5cee9416571752528ACbb4331761C5E2706748c",
            "0x732Bb47210fDB676Ee1596d18FEE6F48DE2d37cb"
        ]
    },
    {
        "week": 49,
        "tokenID": 74,
        "members": 12,
        "memberArray": [
            "0x5fb4a0983daD1A0fae31ED67F1aaffeA3F3E8eC2",
            "0x0C5E9D3DD69bBDAC2C66910e3279f12E95800C43",
            "0x4b04E13E0FDee2081f05F141dceA715E6d042823",
            "0x61d0A005725b5A742d232655a7E22efb7Cad3414",
            "0xf5B14828af8A5D2Be1d3865cb9456f4C3430e5EC",
            "bnb19w8ac9srzwa3mcne6eh2vkvevgg3fumj55wdyq",
            "0x7F73D6242d5731E89D0d3A2c3E7Dbd3795b5dA8D",
            "0x0b4F56611DC8D67034cc36cfc6F9C25924FBA852",
            "0x5be28e441F325D8B005839fD69695884f11da063",
            "0xC3db09cd17f9C442AFdD164c11608650362b21C4",
            "0x9372fE6d14d57988B7EC923815Cc9243B313D532",
            "0x58A29f1751ffd967E9e8EAf360c0A65D01B711C0"
        ]
    },
    {
        "week": 50,
        "tokenID": 75,
        "members": 12,
        "memberArray": [
            "0x5fb4a0983daD1A0fae31ED67F1aaffeA3F3E8eC2",
            "0x3e0cf03f718520F30300266dcF4DB50bA12d3331",
            "0x229229284c0eA7C2A898765a5652fc03F0e35293",
            "0x45DaE0a61554Ba33cADB126A795137a224e1D4D1",
            "0x6a5D4157C186F87aa053b65cDbdd6a6BA372f64E",
            "0xfdE089a08e1dF231E25674a18937Aef001Db1fcC",
            "0x7D7b53A5F64eA47047A94D0F3Bb87B2F2C43e547",
            "0xb7626141EF37F183A7A61Dce76304c8b074c0988",
            "0xBab49827EA9f5459B43FE239cEE9e2457351D2D7",
            "0x287e2c76Aab4720786076c3DEedD7Dd386092050",
            "0x82E7EB952433fDe566993670F32956a27424Eb1e",
            "0x09035b6C00F0aB297778C71e81702DA85d77B6c2"
        ]
    },
    {
        "week": 51,
        "tokenID": 76,
        "members": 12,
        "memberArray": [
            "0x5fb4a0983daD1A0fae31ED67F1aaffeA3F3E8eC2",
            "0x5aEFb8B05324D586898bB35F5eDeBE4357449d9b",
            "0x9e67D018488aD636B538e4158E9e7577F2ECac12",
            "0x0167767E7ffabd6e9FE1f958535BF296622D4B21",
            "0x09712Dd5B73e63DE51523C37f67cd9842b7bf553",
            "0xCD40b4f9fFf1251D5A09f892A1aCFced2A97aEC7",
            "0xd1DB2A7C59a1cFad700f0DdB3246e00815B3FAEb",
            "0xCe97824C3fbe74373E90bc2A3a22a841958EeaEE",
            "0xbd3E3D4d28E648068316a89D19c1d08C9db78B33",
            "0x98CC4527C0Cc035d9A0AC74E09281952470FD619",
            "0xCc257fB58f79a66820Ae06AAf8D4daD82Bb18A64",
            "0x3A9eA3A8F7916F2637DbA398124019950fD294c6"
        ]
    },
    {
        "week": 52,
        "tokenID": 77,
        "members": 12,
        "memberArray": [
            "0x5fb4a0983daD1A0fae31ED67F1aaffeA3F3E8eC2",
            "0xc23352C26FE7fA6556E790ED3Ace42eE5582C5F5",
            "0x1B6ae480f83Eb85e4bdc2A97f74525f9e26922c6",
            "0xD90Bfe7f71Af4C71c080A12B7f533B9F57879FB4",
            "0x42d4c197036bd9984ca652303e07dd29fa6bdb37",
            "0x4a6e297B23B9389380987e901481811d83e945C4",
            "yanwen.eth",
            "0x7eC4583A83686d6e4A4e76D0b04c5be765850d00",
            "0xeE0cb8E92646743C3E4ef8e5d4C32d524Ce4d2A6",
            "0x64916cd4b15045fd156Bc2a6460cD3207638e289",
            "0xeE82d15265C15a00197693B361b7735a93b82e55",
            "0x36b829d20B2F2483aCFf512ECb06686dD672575D"
        ]
    },
    {
        "week": 53,
        "tokenID": 78,
        "members": 12,
        "memberArray": [
            "0x5fb4a0983daD1A0fae31ED67F1aaffeA3F3E8eC2",
            "0xE2FD7373feF5E22b321E6B7630de5AbeA14Bd83d",
            "0x3e0cf03f718520F30300266dcF4DB50bA12d3331",
            "0xb13bab10F1F73F55F4FE4Ac15668D5DA39C31a0D",
            "0x818a86f6db284A7E45ed98Cc1Ba88D534d07C74D",
            "0x417A1203943b5147E55a74FdD0B1358F4E055E88",
            "0x8E41AfAf0182375191bFD437501e4514366ecbb5",
            "0xd0f9899ec83BF1cf915bf101D6E7949361151523",
            "0xb36153c53bA74420d21E1947D4b870e8Cb005847",
            "0x6b30E020E9517c519C408f51C2593E12D55B55fA",
            "0x68c6a54596Dd8FE889054E99F3212045F4235680",
            "0xB2c4D35cB20b0D6A7538da5683D03037068B26dD"
        ]
    },
    {
        "week": 54,
        "tokenID": 80,
        "members": 9,
        "memberArray": [
            "0x5fb4a0983daD1A0fae31ED67F1aaffeA3F3E8eC2",
            "0xf79d2E607d783d39D2C4583c27D2Fd5B1075440E",
            "0xa59e113fbef3B4129bAef6b5355dFf683851aFA7",
            "0x57D061D61EAF7882329E0468D7D6F7bDB293CD0C",
            "0x45B115bf21872c798b8f131EEE9AFA30b96A249F",
            "0x28faf1599A9c3a9b8463DfeB23d06B6495aE91bC",
            "0x5be28e441F325D8B005839fD69695884f11da063",
            "0x4a6e297B23B9389380987e901481811d83e945C4",
            "0xdFF311416292066027d3Ada50E9e549aAfa9d754"
        ]
    },
    {
        "week": 55,
        "tokenID": 82,
        "members": 9,
        "memberArray": [
            "0x5fb4a0983daD1A0fae31ED67F1aaffeA3F3E8eC2",
            "0x4BeE0d0d6C437a9Ac4a24088824a8660bb18431C",
            "0x9aE2FEd0225EC01B5DD15a448b7c33dB4b94869D",
            "0x3F9517ac3CCC311C84826fB000bc8df1e45C4b72",
            "0x980C8D51202532d34647aAb766993a6ECC9d0a59",
            "0xF3e8a7AE6F60bE09Ee463B6278F293f4289e871F",
            "0x5333c1d733794e02f34d5f0d88c65d03FD2E4Db1",
            "0x46f9697622228ea60E549620cC2DAa79312eDf75",
            "0xa301d259fDEa577ECe7Bb920f6D2454a6ebeb1b6"
        ]
    },
    {
        "week": 56,
        "tokenID": 83,
        "members": 9,
        "memberArray": [
            "0x5fb4a0983daD1A0fae31ED67F1aaffeA3F3E8eC2",
            "0x76FE8E056230344B65104ca3c96FF062bFAf9cf7",
            "0x42FAD4d519223C22C40aCE6DeDE72E56B4d15439",
            "0x5be28e441F325D8B005839fD69695884f11da063",
            "0xFcCc476578b544e54A1C34AE93E968a66FE6BBc5",
            "0xC7F9987c9CE0f3D4D33b2ed3c819137329607710",
            "0x5F0f11f7c18F0Df90c604a1884fA882cdeF599db",
            "0xFCC8ed5bCDdc5002804b0a0f48ECDA71eD094aF6",
            "0xe4eed67ac48c4d45152c7f5092d6adb6cf69a0f4"
        ]
    },
    {
        "week": 57,
        "tokenID": 84,
        "members": 9,
        "memberArray": [
            "0x5fb4a0983daD1A0fae31ED67F1aaffeA3F3E8eC2",
            "0x6651a69Ff91f2746298fc94d58f7bbFAD84119c1",
            "0x317887f0B88b33aD43fc0edCF587EE78fd88Afb8",
            "0x3E95fEF1176acF5e5d2EF67D9C856E4ECAc73E1F",
            "0x5d4F25b080230976187e9897A4cBb4c284D7C390",
            "0xAF559E33fF7A740AAe88AF47e77f6eD299CF1411",
            "0x1699c95e4300BB24C7159EBebE15230Ac096979C",
            "0xCc2b58201b888F8351466edC4C048AB39125EB31",
            "0xd0c0f5A2284cc70b8442108FE8ADD8E8499b4828"
        ]
    },
    {
        "week": 58,
        "tokenID": 85,
        "members": 9,
        "memberArray": [
            "0x5fb4a0983daD1A0fae31ED67F1aaffeA3F3E8eC2",
            "0x81941E3DeEeA41b6309045ECbAFd919Db5aF6147",
            "0x38e0a92eA3E222B1F4e461671b6DE52663F3AfFc",
            "0x0BEcC5309a325A7089fBAbE0cc0E9743C583F8Fa",
            "0x22BE9582CDef4eF2e6d4b119547AecD7652D9e28",
            "0x5dF88ffd3AC292a91C5E2D24abE322B1c7Dbc4D3",
            "0xdDF6470B257C5CC8b2ED142EE88d331d8339D2b4",
            "0x81C0f38F09c950A2d2CBB9A03B2886001096F648",
            "0x972311dc283c1CC03d71D6f061D177E00Bd32737"
        ]
    },
    {
        "week": 59,
        "tokenID": 86,
        "members": 9,
        "memberArray": [
            "0x5fb4a0983daD1A0fae31ED67F1aaffeA3F3E8eC2",
            "0xF937E5D95F8204c799929587AA864168b92040fb",
            "0x0A8C2eE08760251705f5aaF7bb0E7B490029Bc27",
            "0xD1E6061C3908DAF6810b1190C524F58d965C55C7",
            "0xac2E80F93d507ab5ef326B38B8C7363e02Bd2CFD",
            "0x58a133632547b6eaDF2998ba2dA5796A49657aEe",
            "0x7eC4583A83686d6e4A4e76D0b04c5be765850d00",
            "0xD2Db39ac9456A12e405783d458cEA4d1D6B462F2",
            "0xE335eA94352a4D9280Aef9232B3762c5234380d6"
        ]
    }
]