[
    "xardin.argent.xyz",
    "0x443Da397aa57b7D264B97B9cFCd51dADF5Df4e19",
    "0x69F329EE79C98A94765e4105aDFd5a87458d919C",
    "0xbef32030aA223A3031e3b4C5b24fad66d992413C",
    "0x11C8D4C8d0FF92bE67eFD2dBd860654BeB102687",
    "0xF31171daC6C88C227feFAF0CE6C5003edA1A87E0",
    "0xBab49827EA9f5459B43FE239cEE9e2457351D2D7",
    "0x38586444200e0DC6938c8d258fb15FD14EB619b8",
    "0xdDF6470B257C5CC8b2ED142EE88d331d8339D2b4",
    "0xcc17e6ec4540cb49E871B00A00157DD20375C253",
    "0xc5cee9416571752528ACbb4331761C5E2706748c",
    "0x378bde8b897D64F4047189C3F8b689008A560bad",
    "0xF9F02eb35cc9F22A69DAA26bE2B1A57e3Ab4bD53",
    "0x2F6102a60813aF809C8dA5f46Ceb1D022dd718f2",
    "0x5Db16FefCE9e8bA024d064268b041C68ED7F9fbC",
    "0x5FFC32c736Ed221aDD02Af2af6AD6659a6DDBbB5",
    "0x9676762325fc3C1e14D251C021185248E8204Fb7",
    "0xd1f44b1A4cBE6A3C23ab00976c6bd66aDbbED278",
    "0xC3130F83BdcF5E84f777d58580Ce99D811aea108",
    "0xbd52889A4cB198a0E2cE36b52Cdf75c4e65875A8",
    "0xdc211A0666bed568D5caFfbf538Ec221FCD1402f",
    "0xB677F5e503cc02B7A0d358Cf6EaB2196b3932709",
    "0x45ec7AaF83AB1B57556951E9840456111467F800",
    "0x68c6a54596Dd8FE889054E99F3212045F4235680",
    "0x8123083C03Dd253E593A9DCd62619A223cc4dB22",
    "0xB48C08B5ccA1636b859B9a691Ec45C207Eb0708d",
    "0x0BaBd8774f4FB8904184b0965204e5A9Db43aCfe",
    "0x9FCAE73fbf4fC6283B636f707c17529c2ba7b684",
    "0x1dE46E70Ec82c237BC14f7e9058C6Cb09a9b34Ea",
    "0x21748446955F1efC75bC9C843fBd3a8E6546d21f",
    "0x064523542F3114bcAE8b1eFc69D945788eFBe492",
    "0xeE82d15265C15a00197693B361b7735a93b82e55",
    "0xeBE6cC6820a76705B6654FdD1254256DcD54F1dF",
    "0xEA29a51b283eA6C0d3872a5c3dF4ddE3cba94128",
    "0x9008676d9EcC75c506aAd7C70eBD55523fcb725d",
    "0xA57c1Af56140A195F876310414C34fE9FE399D87",
    "0xac35452f3deB273d37bC1Ee84B60723CDbCCAeda",
    "0xaa5ba45127268b7e4b59058a952ab1e926de2075",
    "0xe8Dc3cE0bf4a07C7854331E663ff86cFC7BB7839",
    "0xED376BE0003D1C6626DD8C353b84697e315a821C",
    "0xb00E81207bcDA63c9E290E0b748252418818c869",
    "0xCF96021f1ebEdc4b772347583323b194c7d55dA0",
    "0x6d6d75D544CB628ED5C4e4ebb619aec0274b8855",
    "0x4a5BB1c9347A0d4F7e06a29239162f03647d9232",
    "0x45B115bf21872c798b8f131EEE9AFA30b96A249F",
    "0xE77652a153b6Aa41b6D6ac2cDbd4d9DAcB72306E",
    "0xF3e8a7AE6F60bE09Ee463B6278F293f4289e871F",
    "0x76985F8bD32dE258dFc8ae497ED5F0112322D078",
    "0x818a86f6db284A7E45ed98Cc1Ba88D534d07C74D",
    "0x980C8D51202532d34647aAb766993a6ECC9d0a59",
    "0x6d16749cEfb3892A101631279A8fe7369A281D0E",
    "0x2ec1490f24ea5403226918344d9aade830264cdc",
    "0x0B7dc67a6eCF6Bc0388409DDde919aaFcF0E0ff7",
    "0xDAe442e757374088bEBad7e24E5A541Dc6C94E54",
    "0x4BeE0d0d6C437a9Ac4a24088824a8660bb18431C",
    "0x5fb4a0983daD1A0fae31ED67F1aaffeA3F3E8eC2"
]