bnb1mkjq25mes24edt35deue93klc0s633yzss95y9	1001060
bnb15khvelp3gyla26zfj850a0wt69lmxw8e5zuk2c	21576
bnb1tuq2xap4t05zzm6d3s7j4pxkj4j37khpwvaf07	2814245
bnb1h7p5l9ft3lu48wexad83hnqc5uk7rgv44yplxl	28532
bnb12tkrm0qhrn3pe3vnrfkt2vj0d3el5h5ncs3gh8	1365108
bnb12f0p2wn8whmykymundfrkua6xrzvxhl5mu8dtv	10000
bnb1kldfyslphmpn70frclgptncfjyf0pyp243fh5x	11974
bnb1859r478lkzxl3y33uht7dw75r5xmr53gh543vh	4281900
bnb1mmhmjqsenyy2xsa3eefqff73u8s3kakp6exfj7	120000
bnb1329q5t8k6qwm3yu736p7rlpcg6qp25rtzyp2d6	150000
bnb13gmnynvlkxkzpnpfttuxsww7kt2jskp6wntqv9	34926
bnb13t2uuxcjelhysamdy0pqw7m6g79zv8ddng5wng	38448
bnb1ylyf0auut2sx3y30kgwd5ss2zm9uqeuwr77y6s	918390
bnb1cmr48486xw3hda63gygx4wkvuvt5yzecastcwe	12590
bnb1q8l5auwwq7flq5vlq08fxxzurznv0v8m6gx0gj	1201892
bnb1t8mua25fp0pfu25z9np08nzn0v3mjgy7fvvl9y	1398363
bnb18te0xhxpqwd3ddsmxq6nlwcghhwtvfm047axqj	234069.99999999997
bnb1zr90fjgxjsjzsj9fjsd0rd7zkm5hqqdd6d5ncq	531888
bnb1nqckk6repqcx32a9suu3dgy2hcml0ws4j4tpan	64873
bnb1xutm7nm9l46c9p5xvx94xuz08r3qadd28teygq	5841709
bnb1c2x0363wtr60quzy483u9xewgesqswpqrvav5e	784926
bnb1v87dy28978et8vsrssrpcfqdn2v59y60nvgkvx	12434
bnb1qyl5m0zh0a9v7zkgm7xlrzx3jhrnx3vn557nv7	12108
bnb1rlhp5uhsysz9qf5gq78kxgvpkfcg0qv0ldu5r8	2809121
bnb1ms6s0juntctw9rl95mv87rkhae5uu0mna9004h	150000
bnb16zj2fthk7yhydekuffxljykv3uugetl3u08tt0	2034
bnb17dgg2uuvqc75lg437r32wzs636fwp6xkmf3396	3800
bnb167r4n7guzm924nhccshhhum004hn8eu3p78a0g	1742927
bnb1dhtyg5jgvw0j9jw37tstznyz0f6kt9epzyq2sp	170600
bnb16tvezd4v32eze76vfpve64s4fka5lfhcuvdy9x	27631
bnb1y0nk7nz4gc4wpgxwq0ld9g488vpuqnzr4t7a3c	50151
bnb1e9avaj624p2m2auhxd44jsqhffxvp8jpcvf8rz	573048
bnb18m42xp89ykqz7gljyjtwers703lj4u33vhytjm	94171
bnb16znr4gq8a89eg40qzkvnp8vr30efxu9mntgykq	22151
bnb1fzu4nnvg5vjthee5j2qsmj9kywxg6mvvg4t884	168074
bnb194pk5f7asjt4hm8ez6hvsvxzgeurf3qzk4cneg	47562
bnb1nt08gyeqpaq23wwt70652q7qxsc7ue6mgphdav	20527
bnb17kwk6esla0rk0yzxk80gmpg4xgk3rek796s59p	549
bnb1ypl77fddyeqrx2h2gpkq63ztnulta6f65utwzw	200891
bnb1unrx9zfqvyqplka7hydzgsydt8p0y5hw7ehk4y	20056
bnb18s0yptz5205ql87jgmc24ud58v8t0z7sdp45sy	139712
bnb1lcsrekgqrt07yl070d22l8q7ajuatc7jmaa4fj	1841
bnb1f040c8he9tswy7qckn6qnttnh239uyw9hg8efe	10856
bnb1qtl978856v9864s6npal57wu08tyn30f9npr5e	3458
bnb15znh3ahlmfhkf4zcmhdyh2zsa6s0xa4rt4hra9	4622
bnb1myst9x9cy57vqf3z9d23du9x0cq4asmkyxez45	61907.00000000001
bnb1446dmc8u7jssynxhmjzay9wcx0vd6mh0v4l07u	433806.00000000006
bnb14sqxu0c0s53g3n8rfh9tk7f3qlhsuph6x65cwv	32467
bnb1gtcvdjs66ayk8ftal7z37qgk863s7wyhzl3u3x	70220
bnb1u22vyjjx6v4yhy70n8e4hyl32wym6dy8tw62zj	15613.999999999998
bnb133sp2s58cjlqlrgh7s6a4fqwg5auua0j4v5rpd	60394.00000000001
bnb1vkw0rsjv4ygjd0cwczay6t23re52e79zu8wj7j	442789.00000000006
bnb1ajrn6uqwp90jtq0eepm3gdjastspt8na8c6agu	135687
bnb16sydpwht9zvvehyajnctggy3dm7yfhkrqfvr55	9533
bnb1sea7shprks76xqwqm4xyyzszuupnsc8w7dmd5l	1784230
bnb1au60fnr53k822h3dt2lurtac8q75eafzr8nl6x	3080
bnb186e4j52vfaec4fyyw2g8csaunwcgjvgphzrh4y	153252
bnb1sj6vzk3vrvdnwwhmldxxtn0t8mzg0h5ll4cqgm	147
bnb1rsxmnwf7lhgrgzr6878kjlatlk08mmysc6wns3	102187
bnb12lzpedec5p3325stlpny4feahh54zawywatqze	1069
bnb17rgya8gw4nnelnlt342y5cm6sylz40upjc8ml4	6912
bnb14lsxfueydec3wm0xmqhemeejzt2nk2t8twkxjk	47149
bnb1vwq2as8p63jvgl64cxs73al04s7n6wp65nv9dl	96773
bnb16zd8p8geutyqwld4u9uwf0fk7u9ps7k3pxp95y	11730
bnb1jfck260nln85qy9lacc5c7dfxppueaa2g976vh	95422
bnb1yyyhpp4q0apn4qeuyqqrx2jueg2c587wf8flf8	3977.0000000000005
bnb1yrzqptqn4ycks4svwt5a7jdfwutndr0q29j7ax	2133516
bnb1rjjx7382fzjw92chx0n5pcs9gvd0c44tltt7qf	22292
bnb124w0yzh5fl82pjkcs6vn8khq90zsexmeng9qn6	31225
bnb15gxjn4hffqkag3vv6djqecr2cg09uldd9ht762	7755
bnb1am5590t7tev9wlp7hlrp2qsjp693p4f8wn699v	853034
bnb1087n7v9vdh2j3semze30tesn7h6zuth6tsxdyt	558101
bnb1637hwjptdrmln46v7vvj3d9mzktrxdlrsnqhj4	310339
bnb1tnrsm5dfwt6yt5ejqyz0hmhpnfsu7w3z22x59a	7895.999999999999
bnb1jrgf2fvkjfwzywrndrnykkc6p36mt3ytfzq95j	108908
bnb1ee26vcmxqpnjj2zkpmaaa4jsdx8dev6m3hzgnr	12501
bnb1fc5dm669l25lznql5jlscnltjxcnk6s8n7sag5	581448
bnb107lpz8zcxrqsl2pfdzm6ajnkmf0dshltuzxpmr	503626
bnb10w94uklqzmf3ed70qw8xt729kvd6jlrw2fkqme	40199
bnb18sj7alq4xjwpm65swjk4a7acnekqymgedfe3lv	23700
bnb1qkmtzr72mpvayl4gq4y9kdyzv7r473q9kryn6w	2250000
bnb12c37jwarlcfl4svxdryqu89dxzjrduejkz6tss	132948
bnb1sums0xu5waxhwd30d965tvp7ayezu5z4dh4gv6	154644
bnb1rkrkr7gjpc5n3lwulqmdrvygup9zyhzy799t3t	10702
bnb17uyy50cg9kkqrv4j26ym2759e4ezs6fyk89zcq	136433
bnb1xdfnxqp9cuzcslkft39ny6rwzeulkx6lfk27az	1934
bnb1r5dh7yvxn8atazt6sjcgu9jvahcgmmm3fffwaz	200001
bnb1azlzyuu27tdxjg874qr494247z6jj97dv3y486	630612
bnb1egx5rqs7yaj5au0npwhjgny0s0gpthsk2snc0t	102341
bnb1646yxaa8qk6w3u8gyprecg9kzfwc8ged67w5pm	27533.999999999996
bnb19dxth5fqfcxyykkftd4yydvdxxejp63ym8yymz	56000
bnb1suk7qa9fyeylx7cx7smyl9rk6qxt9fk49cpy6u	6490.000000000001
bnb1hz8f8ejs6uy3fdyg99fk38pkmm3grxf2n643y4	17810
bnb1h066plzq6xr5v94jft9laqys0afl7fdeg4h3px	25402
bnb1j7ksdx7zkadze7xnuk7n0d96s8esr2ywh9llmw	20614
bnb1jvulqla3m60duttrkcq4yv8l7zfm8aly5ddlka	42742
bnb1z9hhrckwtvgkuylw7audd5w8406xu9q3qnrsf3	46453
bnb1un9e99dlc0zmfajnm8f7gwdd9j97suxr9fxe59	29544
bnb1zcsrdhzfd5vvsx65psww78vvj7y9c6tuh3sk9w	1142368
bnb1t4nac022fxhwpz7gpwt5vvvjncmcwf73gda5ka	1989
bnb1kgfr5468a7vu94mp5jt7qpzfuqcn8ryc82q52w	91232
bnb1nlxa3z3nrgdg8zkv550ua3pllm5sqc66vwc9ca	67247
bnb1qhefqvcfgg7y3m3wvg29g4r50958nwnt776eay	48225
bnb1dhtezx56u362a7609pmtd8jw3ccrpvah3qksg9	51216
bnb1cj72vmdqfkskdfwdglr7duknp7gqrvy24hked7	246927
bnb10hhfeyykqdj9h6le4sd2r4r3pcey5sjj9exj8z	12616
bnb1dqr0qjy7v0srhr9e0g7trcjsdsvu8p09jf5n33	318566
bnb1qx2xkgmz27t0s7f8fc4xlyc7485ytr37rpely7	64977
bnb1uhm7phhcw3a4tn8k4jq50e7lh0z695am0gu2yw	72864
bnb18x9tr8garka4zsrfjq640tlegw3r4a22y43etw	31560.000000000004
bnb1tu4h2yeumjh3dyf26jfcfl4nv54rfh58yyhs42	212304
bnb180hp2ms3a862j4u0wm5l5gl4z9t33fddhfwea6	80973
bnb1x0nz9hjxy4x4k23v6j7f3ts8eznq8gdzp7d04w	22118
bnb1x7dswr6c4u8g02cnd6z5lqk4tvc6v86v6mjxkw	929496.9999999999
bnb1y4m7jrvmvnsxhzghayyy5295gwfcn7uc9r0x4e	1929516
bnb1ju6eehwue87tayz5u7pvuh33eke8l84dumf0mp	3300000
bnb1eyqt550qgf982nd2jyduq9wpmsyaua54d4fevr	12935
bnb1yfyxdqfmwua4wj75wnc30tv0ll0m2jwxyx6xyl	60083.00000000001
bnb16zcr7p6tzfcnhlp2glehge3zm3c06wgfkk3ppd	960673
bnb1refww948ngpzhmc2jfxc8r50cacwmmr7jw2vtt	758247
bnb1f2t5gr99srrv6gr0ldna8xufztdgfhxttgy7kg	76604
bnb19wk4uxv903masjla37qu0epmg06snd6cf6fdre	284167
bnb1f3setp3my3yz9mqu3u2zc7vgcjvas9vd0u3dle	235055.00000000003
bnb16nxntteq8x9qmqle8m60ndadp3cw002q04j9dd	104050
bnb15tcnmznknk9xdza5faqe03pymfj3a8u3tmc8l3	808216
bnb1xunf2r7ssh42qshhhsxtqvhralezgdnjnvk003	23334
bnb1zv93hlu96jeg6k2qxdrwkvu37f4ylgy9cpt6dy	15311.000000000002
bnb1zpn7fyv9kfrvcf7xuc09qmcqgsgwh3hm2mxfsm	2800
bnb1jed0duuua28cnd9f845kdx9e9y0h7hkzcmxypj	12471
bnb16k475042gh550qwn5re3j7wfc484c743cdns7s	20345
bnb17a8cc9wamlj25fgwpvym3e9n3sqsslfe76m5s6	118876
bnb1vclzda3lcy2m05e6vx9h8308e9f948lqqcrj8r	291546
bnb1n7vd2frs2lltn07r333dmgtl7574j6cedgsjkx	7192
bnb1k6dqfm05y5jlx2r4afwyqazsmlqzcdxgu9p54c	2010.0000000000002
bnb1g70pfy6m5f5pvxd5du5aqtdgvxz2z7flln96lz	53554
bnb1w4ktt8uf0gqju50w5v8g3jw5u6gpyvy9z0ke9s	70982
bnb180vu8m9zsw8m9ty4qvjsczh5rlrtmzs6ct8mx3	92867
bnb1xqrsghjjcqcpv0uftth7klwy35h4nta46nexc4	7781
bnb1pj04e3nkkgd3t3xcxwe8z4p25vg5svm7rqjm8j	59379
bnb1zrjnml3sxf306p3jaezt23xle5z2cy74wxr369	720
bnb18yez6ept6x089cukeqcj4lnfpvwl6ca2x67jgu	23810
bnb14gx273k72u9rh9ue4ecfpeu0yg3lglt5cp5z7d	3609.0000000000005
bnb1lgyux9fp3qnff6zkjdjknxdkaw3cwclyx43khp	222001.00000000003
bnb1d0ch3xr8gggdecmvaeklrsmpmcjg6dcm0segsp	181039
bnb1qv3lehm9t705qt0mg9nzzkcymjkv8j7ymk7klm	148158
bnb1nudt74776dequ8lxwwdl49j0j362krqglae662	27570.999999999996
bnb1j7yldl63fxjhsk064dnvywaa9f0g3ka940xd73	15418
bnb1qelv08zkl623u5uv98cwpqrcdrjweyf9ufz09q	66993
bnb13qf7ew7t9qk8jcpqw6n4e79ax9vwp2rmtn3nt6	10538
bnb1se0kwzsmzwepx9pxzrfycpar86xsys93ahp8lu	57691
bnb1dmqq9k5dghc3992q45wsheqq9wvjeumszpldx9	19745
bnb1c8whfhqet3w4v6u3vw3xa8mlxstja82lght2v7	26250
bnb1v80d5274dmxt3h3vhrcp5ny9rygk5m0knkzsxc	408000
bnb1myzyxl9c5hxvk62pvsn57s3w596af998y3lxwa	36237
bnb1gvnneevr42ree4ylsh5sd2f3cqwrk2kkpy02j0	24471
bnb1pjexmh4fx5xdymlpfjtzvl23xnz00e6l2f79aa	39751
bnb1mu4dge3np02qmxwjcvvjcg72czcm3pa5ax79gr	42164
bnb1x4vn6rn6rujsqd2wnmg6exq900jv20rqdfl7jt	14536.000000000002
bnb1ugskclmklwhdl3wqwnk0c88ampcu6luuuqyjcv	158
bnb16ue8aypmp7xteeq7wysw8qtewxytz98dwamrwf	67051
bnb17n204j3qp7n5nrcxve808svfjhyfqr2hacm4k4	30675
bnb1m0p6anm3hrucpdcguk5r7gsfkwan37h6x9dj0w	92783
bnb1tw3rhz2n96c5mdgyf4c0y7zd66gmajjde2aq7x	9672
bnb1gjq5dqkwpxc06x5jcp58rg64kex590t03ucrss	6800
bnb10fg8z9dumqhmfhm5s4ghyh9che07hplvk38k6t	12905.000000000002
bnb1w7hc9rltf8l5st9rrptrmjdrgryk9uqruk65c8	5001
bnb1c0ehe7tlyurqhvrd3zx8fnafekhxe9m0htzquk	53708.00000000001
bnb1vvv3k6kjpqrre8fr3htjhutxwan9vag6jrj9dk	102130
bnb1dgdxwulcepwdjdlmvx2q9cz5td0tdklqyuv0fc	7645.999999999999
bnb16p0sp5nlphcr9y6v02lan7z3739udvwagrg85x	335194
bnb1vt0sy6l4r72ua9gjynky03um3gux8u0s3xfvpm	23835
bnb1hfyj6nqnsge8zjlxneyun6gnl43e3kscgvgk8s	100210
bnb1mn4wl7fn78a08f62ctxnt6kl2jgkrra9mwuzsn	31036
bnb1kqm2ecnxpydr5hpcv7x9rpqzv7zxk2gl6y6454	29552
bnb178yfv4mtshsnect90y9twkt3tnu9wdfz2jj96d	51973
bnb12me6l98g9tc5jmdw5x544f28zn36sktru5akkg	2000000
bnb1devefureacvt9lhwlwshs3j5w78m967clghws2	1527273
bnb1mwchwe6lq4m5f78clp05ermumzv0wwapzv09d4	400000
bnb1nckmzqs3tgaernfllxkw60v0cvj553dwuegz8d	550494
bnb177xy982fqxc6qk9zwfnhhqgd4n55vd5wfsgx7m	438176
bnb1zk22tfw3fyl7z0wdmxl668y5qq70yvz84gf6xw	319800
bnb1qfexvdqmd43lnndy36c2ckd4elahaxd0q9nfg0	310200
bnb1kckre5jptlxwdrwjwruc93nh3tqh3y2m864hp8	242046.99999999997
bnb1fg4zezx3w7k27l3rg03te46m9russws8djz2uq	219437
bnb1y23lz9an6540gw0xfcryjznrstg32ksl024d7r	227029
bnb1ep3nf4mafemfrwlgyl7vksruezngweq3udmxj4	213357.00000000003
bnb1p0mn2sh4p72zqvzjaw8h0nk57s9re506y4j8lt	151293
bnb134fk6ywlrhaxwg9jzuyjhsj2sedrvy0k7upsap	162003
bnb1sj0sedrus7tnnywr0astw7a44809jljrtwx8td	100824
bnb1nlwp6zwg5gk0r6prtl339at5mzun006l0s7a40	102268
bnb1y4q892gh6c0d6qwcntn7elen6xjtfz8gyc44uq	137000
bnb136vyll3taevqahu8l63plc43yqa0ku729g7tdp	82933
bnb166fw6frtj8duaatgsulmy7wkm40484ada7j2pa	79379
bnb1vlkzn7d03n9xtz0f4tuq0nfpplvxeenqdepmv8	68592
bnb1ehdfr4lt60adtwa529gf9va7xscm0vg45up42r	67430
bnb18r3d5qv5w77jz9gap890swqa8mg6fwx883lts9	74918
bnb1xr5e7ep9pfflp4gy4e6md0mk986uw34awg3ktu	60645.00000000001
bnb1t6q635w940ml8az63g0fu4nr6xaa0gdjpq7fur	57694.00000000001
bnb1mw0dse480untejufrkfgchkn4y55uqnpqt2sq5	52634
bnb1sfj05y8gdu0w2mn7w7d9n2dyvm0x4yvq0lfdp0	51100
bnb1vhf53um9ypt36lytwyy84206paz6hgq70sl4cr	49177
bnb1hwhwyhjya400zd55c6l95s82s7g4xdtapaa8v5	44824
bnb1ka5lalveaqafq32a0g0cva5nvs98mm3v35ufcf	36596
bnb1at96vtr6jcllqp4c23z29ch4drwemkfyzgj3th	36596
bnb1prdkexdzkr5mhw0zw8nlysgt7wtum0r2eltgr6	34384
bnb1y8xazlf36kencpsmp5mvwwhj7eepfkf4ztykea	10924
bnb1plgrnrmemjap06lc0fs5gyndwhv3m8dvef76pp	22744
bnb1xnh2uarjk6hlun7a6h8htq86j82x3rpmves08e	22160
bnb1z426hfsc4fq9ssu426vfnsz2eruggynkwnla6g	20760
bnb1whjp9gk9zlpjjve33r0y7w5lfcswtyp4m608wr	20447
bnb18c0qur6s6adayhhfgxgyy07cltrsmw64y38dts	23500
bnb1gymht9ffkxxj2ecdw5epcx6ua5nslr3mnw2u39	20367
bnb1tkfdgcn0ccuyelu3zf98a5p2g3pj70fe8pxrgl	18740
bnb1nw4e57udwj2yykrpa94wftm3vrkwq8zpf53zxz	17992
bnb1favmgkg6f326wsc35r343u3hytzl7g8gcrlc6t	10000
bnb17hacevwe0flmkvzr46uut28j0dmgmv7mmlh82m	16857
bnb12ecnrm7tjxkvzxvrg6udyreh2550tjw55kuxce	14631
bnb1aynjm6jfvk3sc450xqk3tjy20x26ek80cm4uvg	10750
bnb1ktjfj6ze9c6fgq493r5qmd08ar9z5kqp85wu7q	8000
bnb1qk5ugzxcavh2z4l9ayru36xclnjp4g9hnx4twv	10200
bnb1w2f0h0rn0lqj4mpk2un0cvzaxaqh7jctyg32nj	11001
bnb138kf8hffzye3fzr93426dnk8hz3f0v2uy3jws5	10069
bnb1sk70g9c2mm5rcdqqwlrez35ethhxgejjelgrlz	11560
bnb1nlun9rtdcyerg3vqu97mfcx3svdtuset58jrzm	10000
bnb1qruk490p8932q6yrgdu2fq3vky3xc7jyfm6fxf	10000
bnb100cv83e6egqtnav9c08www3y377uwhx3gr8um9	9828
bnb1yhaletwspqzw05agefcsh6ufr94h9g5l8trc62	8984
bnb17h2ws5j6k9y36dq2r2j4ut6alzlqpvslrxer0y	9331
bnb1tdcdcvskw6077qdw0tlvlhpd3hem9ddx3pafwr	8280
bnb1w49eg0lguy9vaq4ke3qxsazd6qe6ex3m6zpag8	8272
bnb1hmwz4e37685j2tzlt8guv5cn4dtwz4vj2zmnu6	8789
bnb1n7tx92khlcrjj6ugpehnat72kmp47umk68gff7	6750
bnb1xsmsnp7gu5gyjlzvzp4gzaxwdavhfpgxznsnlr	7198
bnb1kqv28qez2l0yngwsz0x57h9zmfckv2xtv8wwlk	5370
bnb1ac8yph5pqj2q0h5wmtwqm49d8gm6a7gw5mvpwu	5993
bnb1rs3ddenu00p8p7cpw6vnat9cxz2qc2ayxxx4qz	4015
bnb1em9nsygepjt5zx9h75y05wgjluz8ywgehhc2yr	4960
bnb15kargly2atr90gswqsv2weqcr90l3jrugxqquj	3940
bnb1mmydtak38chkasc2fs9qd80g3kp9uccr9jfmvr	4392
bnb1s0t2zm3ylhfjhzlh60euj6wz4mrm97d5y0r9gm	2330
bnb1mr9rq7x3tjqqp8mgxe2sxak6jkwwc5xla32u3e	2250
bnb1syf0ue5sdaqvz8pnynmnnpvhj7n57dufnkgd9t	1087
bnb1n3klj982pseatz8d5g85g2hg8k24l7d85vrzzv	1056
bnb1dayvu3md66ncgh2vlpzyrl3us05auumn0lrj7k	1000
bnb1xl0x8faat7atrl2q2nxxjp57tvjctcldgmx809	600
bnb1alx80gqa7xt2kqgshj2e383s4ule6lc36h7usp	520
bnb1rve8xzp032x9l08ej402jxakcjymf572klzrnt	451.99999999999994
bnb1ja6m05v7ccejcwqdys6cz2vfu2q37pj92zrx4x	246
bnb1p3rnd40u084jdxx5lx3t9q7zh3n62jv0tdtmc2	100
bnb1qfunnvy4gzqmd5rslarntz2dlq9r7dszq3eulm	96071
bnb1n9uyass9d86dedwxr4daal3vaeegnm0888nkjl	438714.99999999994
bnb1uhvralzp63g4tcmnk5mwjsms30qh3heu8p0ngz	9608
bnb1mmgsjknn7sqxme4vy34mjmlfm0shkyknnhmcyy	2600
bnb17gxece0k4l3nx8e0zqpxqyftay8dvsz5hc5pry	29488
bnb1e6nmnnr7ft8sgzrr42h6adeqjql3rn5u8g0jzt	3009
bnb1ed6rx4nrwffkgssdyppmrfg0dcnfemtzgtu44p	93508
bnb13h88jdmfgu5mrd4yu9q23gtg6lt4nytwyaqdtk	258301.00000000003
bnb1g4mrfmnh9grhh23ev9f29ey90qldx4t53eea5p	50000
bnb13237ejj35shsrpsx4n8f6t7wm7f6msu3muuz7y	3147
bnb19e2l574980xrsj52fj8mvw3xzu95743xg75ml3	11980
bnb16zks743gmwftphaw98f4m4mke2dtshdr2wg8he	3958
bnb12tevktzcu7adzds0qa9lu0mx64mfauwudmxru4	380955
bnb1k03hcqf9ezspw7va8x409a77gsu3w3xuhe2w4q	91145
bnb1qzcwt8vyhmgpxgncf69eah0n7znp0yvfshfhx6	122017
bnb1l3ftnt3s23de9e8hcemvpyrrq3hufsu5t4p8vn	16527
bnb1g5drx6skah0rm4ejefdfahlsyfkrneuudjtr3z	8136
bnb12m8awu57mpxx8jyaf2g20z5ynhsmtr8kjlmr59	1470
bnb1nz3x9f477yn5xw9yq2z7hay55jfkzy4gngcyvv	58102
bnb1yhenddk5w7nl3uuj5msxvl3pa5k3snmkc6044g	479693.99999999994
bnb16flfq4cq4lzpnjq6ung5sra66qse20shhgudwr	1113770
bnb1pj4rnxvkwtpf232kmyvq40lxpcv64nyk69a7p0	211325
bnb12jcyf5dkefyd4p2pe2cvkwf5u3p9tymdwpykgf	84195
bnb1jgk2maa6p5njc296k9m2jrfj3j5w9zguywvrj2	2313
bnb1dqa5xw3ep59q0wd2lwzgvl4fe3auu67vfje7yj	1179
bnb1x0fysej2vw3ghmly4huf693g4w8jgmzdsync05	31111
bnb1r6847va3achrjxxtszpsuf8m2kjrzgyqzg8uk3	7894
bnb1lhu7xgfx9kw8fs8v0aurp6gswmzrr7xlzduqxl	106054
bnb1upuy4dfemc2gechyaplaqsa2qa7gp0g4wa0ae0	7000
bnb1ugrelumjs82qahxx428tfqezyjhxfuf0k9pvh3	28877.999999999996
bnb1hut9uz7kjkfcgm7p4ww0hc2seack3mf8quwy0z	18359
bnb1sv9atel75ackld4djhhzf2jqdu0af9mkx506k8	9690
bnb1xhckvydqs89ws7cpyy7g52e72aucyt5prwq5ms	4470
bnb1pnrjfsmwqd34xlknp0wx8qd6qn5mvmaha2h86c	11950
bnb1gw5u9m4phtmq4q0nckydk5rd5dd8jhxqcsxd6d	24000
bnb14k3m0u3eny55fw828tshk4qg8p8anyfzee5qh7	129400
bnb1jmwzglxzy77v00k4572rr4qehtj0s35uvrf9nd	3700
bnb1nzg556qryclu7a7929sv4khs2gw20eu8re25gg	95352
bnb1jfundmcdsugw490rewkrm0atejrlegnfarw422	408796
bnb1cj6kehr2zn0nukvsmrfmxqp02lsf9j9u830anr	1500
bnb13t833dp6pz56c3ut0adt8a7u7u3j7sjxn7e3x0	37751
bnb1ke2dxg5ngz9a670lvqrgvg3lfga45s038vpxj5	37811
bnb1mmae0cp0f7dtcy34t9jsr37fdwtge66xsrjpux	13000
bnb1z63c9cvdul4ur6gyffh2r5v5vfye9f07gmhhed	7013
bnb1lv2v2tgcmzhhk55v62gynxryvvvzymzjc95vlr	1039
bnb1agw54hev0het64h3q2zm8am3huc0myl8vs0psw	101613
bnb1c3aezsxgh58fq2y2nwywxtg9jfgv2psyayvd7n	36364
bnb18adfq2ka9nn78xezxtcxxj50m6a6st2srm2agk	162257
bnb1plhkl3mgkzn70680ttx9vx4q3ej4n94sqdz9c2	1412100
bnb1zwhwaezlv3mzs9h2dcjuna8vjexw6c2s88yx29	8341
bnb15jfs60nwxquvaj9lwn7n4n2hs7ggnxvtqy4kt5	102734.99999999999
bnb1fhlpun6t8g6tyx00zcdjvl54sl5r6jnc4s3qfs	255016
bnb1s5lvqww40ywqyg3f9awawfrdx6z9qfc6k23rts	4430
bnb1rtjc5r9ufr70u9vv76sy4p64jgavpkhqla05fj	3492
bnb1xd5jhxgkzmz87cyv527pq2x5xw3pg65rrtnnyp	2010.0000000000002
bnb16ajuf64zqpkkw0kg9g5e9pr508egnech4rrl6n	18637
bnb1wdhgtcyxtjwu2whnrv302jejamf4r5xxgs8njh	100
bnb1sdh8a7xahvr4v2tjagt4udm6fqwmrst0cz0mjz	61130.99999999999
bnb1r58tdmg7x2ly23pvm7pxvcwn6qmyxata62s6uk	1109
bnb1zp9yqmqkz69tnrpd53dpjyca2zuj6usanup79j	297647
bnb1da9hxsw93gddhuta30lc3f2936j35y93gdqv6g	138639
bnb1dq2ms3k6497fgvrafusecugj7x25v4dgvwaqmm	466
bnb1xqc0tgsu0a54zrpkmtsmt5dth4gvjmv42xvw78	2460
bnb1mgykcx8ml28mwc9hlt07estqmw33ket5vvx2h7	5920
bnb1xcmayyzgmnxmys60adkyd5uzfentes8u0alx28	2465
bnb1q43h08sc8m9w3c9l53w4ajgxkqdd80eq3azz5y	166108
bnb19y0wrtk5334mqwcrtzqwymkeafl5vdaxywuxea	6834
bnb1p8rg24v0m62h49qu2c5mzkqce0rkmjnaevtg5g	517
bnb1ujvc6tyma948zgnwxhw8c8rw34nhlv625al0ec	23090
bnb1we2rzwn0y82hq7uj9el636khjvmrlng85y7glg	10037
bnb1u4c4dvgwe6krkqg9tx589mxx3scr5ml306rgwv	87061
bnb18s9wcpe0d0tvxc7vp6yz4d2g7dkg7n382p5url	1011375
bnb1k48jj84ey4x97mavahceda2e8l6xnu8z6ydts5	20000
bnb1y47uavx0kzhq067aqankmsakhrq8frdm4huf58	16200
bnb160pjusqjedxmrzcfg8yj8hxryezjknlvfdgue2	28563
bnb1cdgkckwraeuexurw4kszuwk0ra7l8cued5cttt	5279
bnb1envrhm4253rlvme6ymdcp5t9txnp8xa2mqdd3x	85518
bnb1exnnf7lezfy53vf6q6lsaze6lc00ctemaq269k	85559
bnb19wsg2zjt5t2aytjjteur9lnch0ex306dfenlru	2593
bnb1qgkwn7t85cavj9dtyjl54qhztd5sdgzcgwpxh3	126747
bnb1syvmm0t8jner6t9zx6jf2c3lswwm90hutt5e4z	8270
bnb1rggfufywtz6k4e2f9jvl6ustqyqh5uujmjgmc2	2377
bnb1rjk4yfq94y5dc6rs8jkxxqh0hpvldcmwhvk2rz	3571
bnb14jntfdgm4eety8r83nf0g8hsrjydml7ud4gmv2	2422
bnb17e5n6pcvj3vx3zzugz3zka83a4hwaeawtd77yk	178080
bnb1spugpqd0xm98j63kygveq9hw3422xljutttpdh	43889
bnb139cr9zurcygf9u39rvx7a2a4gc2mv4ux64sgg6	2191
bnb1vzv3lemdeym5uqc29an2n4wrquz3alnvejaqdq	330604
bnb1n0nqhy536za2j6szald86x4f2dn6g8fx5dlxcr	6414
bnb1mqm5sn5ydvl7p9qxw9rmrf48lgx92f3cn45zzd	403810
bnb1p65c8nhh38wnexrfvyp8rnd47e7huanwwtzh89	119186.99999999999
bnb1jx0esfkr0vssqr2m048xlrfwav4vsclj326ahj	53960
bnb1ka483sgw3tqfldugds9n9f5jqw848vmk8qn9vn	56062
bnb1mdn44ha6lfamtwfa96sjam65c8fagaw3xhqtg6	21067
bnb1dh3js22qlk30lfc56lx2qx5darutdp0jqnjwex	12664
bnb1xk2049agff679pnah2u9z3mtzx58c750svw6k5	14872.999999999998
bnb17pjul7euxs6egrlu3wdk2nlhyk4mrspdmhh9fk	55000
bnb13j4xwtn0puedu20n9aphmns2ynflmk5g9jtmae	3374
bnb1qx2ugn98cw40ja9hrfh2e47rvnxsc2gl73dfke	124230
bnb1wcqhkzkmp67f5c9qcspmmr7mddktj5xl5t2e62	2134050
bnb1t8jxxt69tpqj2025fxrc3aj4swh0mqu5asydgk	2034
bnb1awx3rfhuxwmne8hxl70pgxzsflht9zrnwt7xze	179088
bnb1h9zxfev58qxjf435crjwc0jp4yhr0x3289j6f3	3141
bnb12g5qm6vt7glnw6hlyzd08zjl3qppksaurd7h6s	14685
bnb1ljfdv5vqldp3wxl6yp8wfxr9vcm0yu6zyeg2p8	4700
bnb1vudr77y9k2s0yzj8aaftcast968zsncq9k8sw3	25000
bnb1qpwpuap3h6sdty960k9kjugne0nggxpwgmuk53	5988
bnb10x2za2thl97wq3cdrlnpw4n9s97qdzjnjjh2vd	36164
bnb12qgmss3937evnelhep6mz6hru9fzpxgvng3cqq	10556
bnb1h0mtvjg4zn4adlhm82suzj79egcnentfmngwzn	108194
bnb1sr8cv6tdf4w0kt0a8auclpjnfeg23cjd7e56xx	138394
bnb134ajamqtcm38z7efqyh24ts9ca6meg0r9aalph	127524
bnb1patrmmvazgp5m09s4j7d3u9syzn6nelf4jc0k3	39407
bnb1grf3guxfrphukjs5gu8pf7e6jtxgq202ur3u2q	799959
bnb1rq5z3k2e42nrsujc7w2sgc3glu46m0e48s2zes	170271
bnb1nxfk6u9h887fd8pza9xtwuyxt0mpzmt5pgj7n0	110.00000000000001
bnb10mtrckhp58pe5uh9qskpmqcq0rtrqhr84saa3h	200000
bnb1kejyh29l2r6ltl3nempfr23lg4ljt95ptkcgaa	41455
bnb160lnja6l0pq6xxcwgar25yesldrx8xsvl52jmy	56464
bnb14j3qrp0vhkh07xqehzdfnpr0xd5207zjut7vuj	1034
bnb195x73dfsdy5hksvwd97mhyjwarsy9jdyysxakc	13121
bnb1z8cxmte8tfw0wr3a076s2vspurk99ads4dzzca	8980
bnb1jut78n804espeeguqg89d9mwy5w2xu5plgzsy2	1400
bnb1ylumlnyv3p5220zquynzrl2qxzvyl8j45r7728	41238
bnb1hwyacmjwc3y3f46jpjclc4tkjuzgg70fs5q5qu	51005
bnb1z8s4c0g3qznfxkv6zwf5x5r4jn3pmsav4tuc4g	426427.00000000006
bnb177hrykeh5zvg0lh00jlxhgnvngveu56xyhxesk	58015
bnb1ux84kgg4ya46zks92psy3nz49mpyek6tjdzgkf	48014
bnb1q63z2xkz5jrnhf639q0pegqs24hsuajjvd8ur2	20007
bnb194a8cndtrxnrpdnqa9yklzz2wh69nrtj49saea	1604
bnb15yt4ymqgawgngvg5r98kr0v3qssqcvhqqpsx5y	2890
bnb1szh6agxu5aqx8lw9em5udezrzm60rwd8c9xtuw	43251
bnb18mh8xs3hk9kfedhg3hhph0l7cx0tl4d7szmzwe	21462
bnb1r8n9cqcd44pkzrslllzanzlvreev40hy7nastg	60000
bnb1wjzuntqc9xrmwewyqvqjzgxy3y8q46g8v73ag5	110329
bnb1cfqzdqcuskrx3dm3g6atnrdh3mzf5zeku3l95c	30000
bnb1ayphwzju9h8yfsdd48srag04nxsyy4uzxrtk76	250552
bnb1vftev5w20zs50vkh6tu99yj5nkz24epm0f703q	10000
bnb1r8lkrtutlc4n0ttz0rzlfmlz2jj033lah5syzq	1870
bnb13xayja7mmwxzznledqsddaclfahdy407m434ux	11650
bnb1td4rgdtmkcrtslwg3qrtgx0898jdhxtsl3ane2	7423.999999999999
bnb1dd5n5a8nlscagl8zzuu4u5kkeeuf7t4mznnv2d	1001
bnb1ggayvcanas6wda9wfgqd2c38w6qxn5nvgcc2dk	17183
bnb1z56ffh0r03u9f95urxs9epsgna2anrfxxd0d8r	9744
bnb1rf8l9hypry6q88mrwf46yff89a8fcluxw50gwg	2624
bnb173sjk9wxz67raqlheusumux4rjem8k96fjqyjp	162742
bnb12wfl47w364tuhc6pe9nvanahvwjukes2jued9w	79910
bnb16hak4p2ja3ays8mgvquk25weahe5s3cfng7qse	18378
bnb1vkhuxdn49ukgxmshsxdcnzcg0mdmw93shrhss2	41042
bnb1zv5yvmw57gszv2wfenruzdagg5928ja9egffye	11364
bnb1xe2jn2w6gefd3vk0zalckm5pz4g95nc3sghva0	7469
bnb1kevf5pam55jqdat5qmp6k8c0eyqp9xwdpqn4mz	166215
bnb14jdt3rxytmk2ul3mgslrpfzefazlw4esljdc6f	6865.000000000001
bnb16eh2flx9l6vfmjx9egh2gdkhtp0g65fxyaf582	6075
bnb16stm6wm5dzy3jhk3m575qvy082hc8vj8htyh00	57494.00000000001
bnb1rnmh3t8k9vefenx3m54pf53xstkesnjsxs40cq	3471
bnb1e2dzpcdaqs9vxmscdk2rc7y8fxxepxv34u47vz	260517
bnb1ke0y99g8p07sjfkpxarq8tnxkwnz2aeq3rgsh4	35801
bnb1u60924l08dq70tven5dlz8n60m6an59ksyf80e	10364
bnb1z2mnh90dl6y7ts55d5t2sn4tz27cx9k3wd9tdm	7869
bnb17jtep28er5jzykatr2tqnd6kufhlakq582tzz7	5164
bnb1c2sltux8hj5vyc9vdwpvsajjqac43veceeazly	67876
bnb1t57fmptcaxc4aag2ax86a7x354p543t3zs8m7c	18020
bnb1vmqc0unyv9ra6sshtuqq0hhqj7k4qwnt46ewhd	20078
bnb1pm9qgxhm6rpzecx9ppczyd0hmye37f8u7gqlc5	53500
bnb1nyme79kd0y3zxgsxldn3pxp7vg0atnvhqkfjjd	23245
bnb1rp8wfndqga3t0xn6m2ysuwzhyq2true888pulf	23240
bnb160308gggrcp50e5vfsdzq2fgjg23pjqs46zwah	206730.00000000003
bnb1xyhmppadjr8v2npk6g6srzw2p3mwnd3ht9p3gd	352138
bnb1eralzf9ku9ksvcdwkd67qf3ywvcz487p9h0frd	150401
bnb18mdluksg8zzjwce5jk73w8s3g2ky2748vdhl4w	68488
bnb1gjh3zw5vaq2lyljzety2gdzj2mpy4u8wsuxv4q	545000
bnb1afs3glmmxqmpq403p0d8xrwyedrqhn6u6gtjwp	3439
bnb1976xg39yru50dqmwnk68ju8745fl97rejyjvc8	5099
bnb1w86r3c8s3h2gg53np4pwjxkkz587ywf2al4vql	5814
bnb10ccet2wmyltj0llkugty0qyjdzmxy3ug02vlvt	1166
bnb16jq8a6h24942j9ffhzcea3ly6s5ys0ur6tkatd	5814
bnb1lq3w6nkjc9suldhw7yzf6kek6uhlemv2h83skk	199990
bnb1fp7ru0nyka3hcxkj9mh8cyf49u63hgykcl7z9m	54366.99999999999
bnb1d4vkzqwutcfahzc3thuvqsh8kjdzguqhjrndpu	1860.0000000000002
bnb1asjaxc4d0udwp6ltmvvlvd0m503t0mjcy2hyae	31394
bnb1rt63zl9ugf4wgax3dv9jndnvzeqpjqrc6kxn6d	2793
bnb1fhks7ldzcafh33e683hu870me95dpnu3kh5f7y	1382
bnb1rnxzvqklz5j0g745gtwswacknmneepdyv7ke3c	5814
bnb1qsea86cyf5crtsrngdfhwk4xm5gvzj5690asjm	7127
bnb1u833delsr9qduepw0vtkmw7a6j5f3wr9zt665h	5814
bnb1uhw3vta46y6ymvrg8xsl2tnuqae5d4v6vv8a9s	1287
bnb1t57mhrm8hkakjr4ug3a7m8lzlmcdj8427cu338	5793
bnb1048mpkna4p40y6gmkcn63akw25x9xym7wkls0d	5814
bnb1c4z6fyfvmmpjk2z0dqfmue2chtfme5mhgqgg75	5812
bnb1ju8z2jt30cmpm6vllkck4lepjs3llh8wc35vjp	4790
bnb1tqetjwr6q40jd7gafu9vxj0k0f2uah4mcjgvfp	779
bnb1kq3x7h4tl6qrtgyvngzyynfl2825c5ejcjkzhg	99526
bnb1upauy2lhuve94ys3ulzjpg5v60plcrapzpxldr	2011
bnb1qz0grtc9qsh2ur43cphl8sm2t2nsya2xa9qtc6	68952
bnb1m5yy49sksmjh7j02vyfdnl7vjcttmk25kcl0vf	23658
bnb1fmjccwaeqrwlx7u4fvp3qldh6gx0hqj7vfsmqk	1530
bnb1dmc3x6uvyksq7ktm67a7r3h0tnnljszjczyx06	26169
bnb12953mal7nwzc54wddzfg9x0w2etmw853pgw5za	2273
bnb17wa65zrv6kzld8nrs6pmfutjth4yvn5j4zm2mq	587
bnb1dszw58zxj2gx69szw3vkms3tj438tu6qdqvzqy	6648.999999999999
bnb1zphcezvnt65tj2jn6hjdxmpd004huqlg7m8jh7	6648.999999999999
bnb1j8zng9ev6rmct3wpwk9zvuxxx2neny3fspggfz	1330
bnb1q088cl283vhx24vquj9uwytuevxrz98dq3yav4	6600
bnb1n6uhwyz949x4zntc5drhsnjgtkyj3rwkxlzwxt	610
bnb10fyvuev2f44hk2tet45vlxrnraf9pm7jankrqf	3682
bnb14t4e82ta8hgmdlua2q8c8dpwrpt6g67fgj88au	51065
bnb1ft0mvnap9q537dga53vuvju86vvdcy0gtcwy9e	3401
bnb1q7jpkp88ruwy0r6s5klsszldj9jxw3n4jmftd7	1092
bnb18vdvqp5h983wd9dzc94p5t9egrvt3acv7jwc5h	4000
bnb1dxjvktecj0cxurc27s5lnena0fk30kunhxv33j	544
bnb1vgk8c7ef9mczcs5wpkg8vqhkzpf47agxng5sl9	1079
bnb1v7p5w0euauelxtqh5w8phlw326wsrdtmt4vcfv	146119
bnb1kus6xe34r2vz5pvs0x8sc4t9gc55h5s764hg83	4000
bnb1uewdxntnk9pgdh84vdth05z5fhcs0gzs05ek5w	8387
bnb1gwdvl7wwdpd0vugfp2yzsw5jk6su4rhg3fmgh6	11000
bnb1p27sdg30e7ls06jddr5xnjhzp9t8cmkld0303l	950
bnb1ppulh3ucal4ers4stg9gfhmjtffltha9rzmmnh	99811
bnb1hpsrt58fqqey6xrlhzfwphdpj2tw5r0mv3vayy	4728
bnb15850e4kl6j94uhlqktv6wj8e7yaydzs9vgql03	15960
bnb1zn6q4yu4kmp7psedf206pl24a36hctcv7dfgc8	6481
bnb1vp5ak37k0735jpscwrs7p9c5z3e4ueed7jugwg	41304
bnb1hmlykpu6t4e839gdskpux2znq0ypr7dfedqraa	63285
bnb1tjnwmg5cqefsetlws7kmxvt2swymy9jvu7w0hg	40366
bnb1t4x3tykyugz9jxhtm93ksamqyh76swpp0hrj22	1000
bnb17awwg8ljtm2nl5r3jrw9zstwy5lc0netf8c7fp	1870
bnb1afp3u6gu6tsc6w4tw9wqzdhhna2np2tzprtzcc	102097
bnb1qcq3rfy9vwqglcg2022zv3v0x7244eyc7j974d	2503
bnb199u6x3k9my0fvnseldyf5tcvz6qvmu0xgwp5fa	59241.99999999999
bnb1ekzvfzjkn8lmufzqmrkxkhtweyyl084ulj39p8	4930
bnb17cv2vkkx9pp3r0ewgu8w508njd7j6ss9995r5n	5388
bnb17n7paw3vl5t0jc4pnuwdpf0fu53asxdhfz0tg8	53097
bnb1f9q2k2n39uuv3qa7rkhvavlgnqzq0390ckze54	110.00000000000001
