<?xml version="1.0" encoding="UTF-8"?>
<svg width="42px" height="34px" viewBox="0 0 72 34" version="1.1" xmlns="http://www.w3.org/2000/svg" xmlns:xlink="http://www.w3.org/1999/xlink">
    <!-- Generator: Sketch 54.1 (76490) - https://sketchapp.com -->
    <title>Path 7 Copy</title>
    <desc>Created with Sketch.</desc>
    <g id="Interactive" stroke="none" stroke-width="1" fill="none" fill-rule="evenodd" stroke-dasharray="4" stroke-linecap="round" stroke-linejoin="round">
        <g id="POOL" transform="translate(-789.000000, -495.000000)" stroke="#33CCFF" stroke-width="2">
            <g id="Group" transform="translate(580.000000, 328.000000)">
                <path d="M210,184.5 L280,184.5 L263,167 L280,184.5 L263,201.5" id="Path-7-Copy" transform="translate(245.000000, 184.250000) scale(-1, 1) translate(-245.000000, -184.250000) "></path>
            </g>
        </g>
    </g>
</svg>
