{
  "type": "documents",
  "processes": {
    "index": {
      "type": "ejs",
      "name": "Tests Index",
      "source": {
        "globs": [
          "data/documents/tests/index.json"
        ],
        "options": {}
      },
      "ejs": {
        "template": "documents/layouts/tests/index.ejs",
        "options": {
          "localsName": "data",
          "rmWhitespace": true
        }
      },
      "beautify": {
        "ocd": true,
        "indent_size": 2,
        "type": "html",
        "max_preserve_newlines": 0
      },
      "rename": {
        "filename": "index",
        "extension": ".html",
        "async": true
      },
      "destination": {
        "pathnames": [
          "localhost/tests"
        ],
        "options": {}
      },
      "watch": {
        "paths": [
          "documents/**/*.ejs",
          "data/documents/tests/**/*.json"
        ],
        "options": {}
      }
    },
    "test-1": {
      "type": "ejs",
      "name": "Test 1",
      "source": {
        "globs": [
          "data/documents/tests/test-1/index.json"
        ],
        "options": {}
      },
      "ejs": {
        "template": "documents/layouts/tests/index.ejs",
        "options": {
          "localsName": "data",
          "rmWhitespace": true
        }
      },
      "beautify": {
        "ocd": true,
        "indent_size": 2,
        "type": "html",
        "max_preserve_newlines": 0
      },
      "rename": {
        "filename": "index",
        "extension": ".html",
        "async": true
      },
      "destination": {
        "pathnames": [
          "localhost/tests/test-1"
        ],
        "options": {}
      },
      "watch": {
        "paths": [
          "documents/**/*.ejs",
          "data/documents/tests/test-1/**/*.json"
        ],
        "options": {}
      }
    }
  }
}
