{
    "defaultSeverity": "error",
    "extends": [
        "tslint:recommended"
    ],
    "jsRules": {},
    "rules": {
        "quotemark": [true, "single"],
        "curly": false,
        "member-ordering": false,
        "interface-name": false,
        "no-unused-expression": false,
        "object-literal-sort-keys": false,
        "variable-name":false,
        "only-arrow-functions": false,
        "no-var-requires": false
    },
    "rulesDirectory": []
}