Division,WeightClassKg,Place,Name,Team,BodyweightKg,Best3SquatKg,Best3BenchKg,Best3DeadliftKg,TotalKg,Equipment,Event,Sex
Boys,51.71,1,Dayce Drennan,Winnsboro,51.71,142.88,79.38,147.42,369.68,Single-ply,SBD,M
Boys,51.71,2,Chandler Bush,Elysian Fields,50.62,140.61,61.23,149.69,351.53,Single-ply,SBD,M
Boys,51.71,3,Aaron Butler,Celeste,50.89,120.2,77.11,129.27,326.59,Single-ply,SBD,M
Boys,51.71,4,Chase Paschal,Blooming Grove,51.26,127.01,61.23,124.74,312.98,Single-ply,SBD,M
Boys,51.71,5,Jesus Leon,Wolfe City,51.44,131.54,63.5,113.4,308.44,Single-ply,SBD,M
Boys,51.71,6,Hunter Dew,Redwater,48.53,117.93,61.23,111.13,290.3,Single-ply,SBD,M
Boys,51.71,7,Corbin Strain,Pattonville Prairiland,51.44,106.59,68.04,113.4,288.03,Single-ply,SBD,M
Boys,51.71,8,Jsaul Landaverde,San Augustine,51.35,102.06,68.04,108.86,278.96,Single-ply,SBD,M
Boys,51.71,9,Jakob Jankowski,Dawson,50.71,97.52,47.63,113.4,258.55,Single-ply,SBD,M
Boys,51.71,10,Jackson Usery,Blooming Grove,51.71,102.06,52.16,102.06,256.28,Single-ply,SBD,M
Boys,51.71,DQ,Kasen Haynes,Lone Oak,51.53,120.2,65.77,,,Single-ply,SBD,M
Boys,51.71,DQ,Logan Shaw,Buffalo,51.17,124.74,,,,Single-ply,SBD,M
Boys,51.71,DQ,Jaxon Evans,Beckville,47.45,,,,,Single-ply,SBD,M
Boys,55.79,1,BJ Stidham,Gladewater Sabine,54.79,204.12,102.06,183.7,489.88,Single-ply,SBD,M
Boys,55.79,2,Bob Hernandez,Malakoff Cross Roads,55.79,156.49,83.91,156.49,396.89,Single-ply,SBD,M
Boys,55.79,3,Chandler Prnka,Malakoff,54.07,149.69,83.91,151.95,385.55,Single-ply,SBD,M
Boys,55.79,4,Joe Velasquez,Blooming Grove,55.16,163.29,74.84,147.42,385.55,Single-ply,SBD,M
Boys,55.79,5,Michael Hill,Normangee,54.34,136.08,88.45,156.49,381.02,Single-ply,SBD,M
Boys,55.79,6,Seth Sanders,Shelbyville,55.79,145.15,77.11,156.49,378.75,Single-ply,SBD,M
Boys,55.79,7,Hunter Dudley,Normangee,55.79,136.08,81.65,129.27,347,Single-ply,SBD,M
Boys,55.79,8,Ethan Adair,Lone Oak,55.25,131.54,68.04,136.08,335.66,Single-ply,SBD,M
Boys,55.79,9,Kole Barrentine,Pattonville Prairiland,54.43,108.86,70.31,147.42,326.59,Single-ply,SBD,M
Boys,55.79,10,Ryan Hammack,Elkhart,55.7,108.86,63.5,145.15,317.51,Single-ply,SBD,M
Boys,55.79,DQ,Coleman Hardin,Frankston,55.52,,,,,Single-ply,SBD,M
Boys,55.79,DQ,Noah Vasquez,Palmer,53.16,,,,,Single-ply,SBD,M
Boys,59.87,1,Sergio Watkins,Blooming Grove,58.51,208.65,108.86,190.51,508.02,Single-ply,SBD,M
Boys,59.87,2,Richard Lowrie,Kemp,59.51,206.38,117.93,183.7,508.02,Single-ply,SBD,M
Boys,59.87,3,Aundrea Holmes,Trinity,59.6,204.12,106.59,188.24,498.95,Single-ply,SBD,M
Boys,59.87,4,Cole Hahn,Lone Oak,59.69,163.29,97.52,163.29,424.11,Single-ply,SBD,M
Boys,59.87,5,Corbin Donohoo,Corsicana Mildred,59.06,163.29,90.72,167.83,421.84,Single-ply,SBD,M
Boys,59.87,6,Austin Adams,Eustace,57.79,156.49,95.25,156.49,408.23,Single-ply,SBD,M
Boys,59.87,7,Noble Giles,Frankston,59.42,136.08,88.45,163.29,387.82,Single-ply,SBD,M
Boys,59.87,8,Patrick Dreesen,Linden-Kildare,57.42,165.56,74.84,142.88,383.29,Single-ply,SBD,M
Boys,59.87,DQ,Ben Harris #2,Queen City,57.33,163.29,104.33,,,Single-ply,SBD,M
Boys,59.87,DQ,Bobby Sanchez,Centerville,58.69,149.69,88.45,,,Single-ply,SBD,M
Boys,59.87,DQ,JJ Beckfield,Frankston,59.42,158.76,,,,Single-ply,SBD,M
Boys,59.87,DQ,Kevin Chavez,New London West Rusk,59.87,,,,,Single-ply,SBD,M
Boys,67.13,1,Gage Dollins,Paris Chisum,65.05,201.85,122.47,206.38,530.7,Single-ply,SBD,M
Boys,67.13,2,Caleb Smith #8,Troup,65.77,240.4,102.06,181.44,523.9,Single-ply,SBD,M
Boys,67.13,3,Jason Jackson #5,De Kalb,66.59,201.85,120.2,190.51,512.56,Single-ply,SBD,M
Boys,67.13,4,Harris Sherrod,Jewett Leon,62.41,188.24,95.25,208.65,492.15,Single-ply,SBD,M
Boys,67.13,5,Chadd Cole,Troup,66.22,195.04,102.06,190.51,487.61,Single-ply,SBD,M
Boys,67.13,6,Oscar Molina,Chireno,66.13,163.29,104.33,217.72,485.34,Single-ply,SBD,M
Boys,67.13,7,Colton Danna,Pattonville Prairiland,66.22,181.44,120.2,183.7,485.34,Single-ply,SBD,M
Boys,67.13,8,Desmond Jones,Kemp,66.22,204.12,108.86,170.1,483.08,Single-ply,SBD,M
Boys,67.13,9,Bendan Alexander,Pollok Central,65.77,176.9,99.79,188.24,464.93,Single-ply,SBD,M
Boys,67.13,10,Stone Crisp,Elysian Fields,66.13,154.22,108.86,195.04,458.13,Single-ply,SBD,M
Boys,67.13,DQ,Dedrick Hill,Hughes Springs,62.23,,,,,Single-ply,SBD,M
Boys,67.13,DQ,Zach Morrow #3,Palestine Westwood,67.13,,,,,Single-ply,SBD,M
Boys,74.84,1,Parker Hay,Trinity,72.94,240.4,151.95,226.8,619.15,Single-ply,SBD,M
Boys,74.84,2,Sergio Villareal,Centerville,74.39,242.67,136.08,226.8,605.55,Single-ply,SBD,M
Boys,74.84,3,John Wims,Detroit,74.39,233.6,147.42,213.19,594.21,Single-ply,SBD,M
Boys,74.84,4,Isaac Canales,Rice,73.57,231.33,136.08,206.38,573.79,Single-ply,SBD,M
Boys,74.84,5,Michael Zuniga,Troup,73.84,226.8,122.47,190.51,539.77,Single-ply,SBD,M
Boys,74.84,6,La-Jathan Allen,Omaha Pewitt,74.12,201.85,115.67,215.46,532.97,Single-ply,SBD,M
Boys,74.84,7,Roberto Netro,Mount Pleasant Chapel Hill,73.84,204.12,115.67,210.92,530.7,Single-ply,SBD,M
Boys,74.84,8,Bryce Attaway,Troup,74.12,217.72,122.47,188.24,528.44,Single-ply,SBD,M
Boys,74.84,9,Billy Long,Ore City,72.67,204.12,120.2,199.58,523.9,Single-ply,SBD,M
Boys,74.84,10,Joe McCallum,Lone Oak,74.48,213.19,108.86,195.04,517.1,Single-ply,SBD,M
Boys,74.84,11,Trace Smith,Pattonville Prairiland,74.75,174.63,131.54,204.12,510.29,Single-ply,SBD,M
Boys,74.84,DQ,Nathan Smith #3,Mount Vernon,72.94,183.7,,,,Single-ply,SBD,M
Boys,82.1,1,Ramiro Martinez,Troup,80.2,272.16,151.95,276.69,700.8,Single-ply,SBD,M
Boys,82.1,2,Ryan Lindsay,Elkhart,78.56,285.76,136.08,244.94,666.78,Single-ply,SBD,M
Boys,82.1,3,Alan Quezada,Kemp,81.19,276.69,156.49,213.19,646.37,Single-ply,SBD,M
Boys,82.1,4,Hector Dominguez,Buffalo,80.83,265.35,127.01,235.87,628.23,Single-ply,SBD,M
Boys,82.1,5,Tristan Clark,Troup,81.92,249.48,124.74,238.14,612.35,Single-ply,SBD,M
Boys,82.1,6,Jordan Helms,Redwater,79.92,226.8,149.69,208.65,585.13,Single-ply,SBD,M
Boys,82.1,7,Dakota Grant,Simms Bowie,81.37,206.38,122.47,231.33,560.19,Single-ply,SBD,M
Boys,82.1,8,Cameron Woods,Mount Vernon,79.29,215.46,108.86,215.46,539.77,Single-ply,SBD,M
Boys,82.1,9,Jonathan Mendez,Kemp,78.56,222.26,122.47,192.78,537.51,Single-ply,SBD,M
Boys,82.1,10,Eli Morris,Gladewater Sabine,78.02,201.85,129.27,188.24,519.36,Single-ply,SBD,M
Boys,82.1,DQ,Tyler Garrett,Kemp,81.28,,,,,Single-ply,SBD,M
Boys,82.1,DQ,Azaya Patrick,Teague,82.1,235.87,124.74,,,Single-ply,SBD,M
Boys,89.81,1,Morgan Landreth,Pattonville Prairiland,87.82,297.1,161.03,226.8,684.92,Single-ply,SBD,M
Boys,89.81,2,Aron Jahr,Diana New Diana,88.45,251.74,147.42,247.21,646.37,Single-ply,SBD,M
Boys,89.81,3,Da'Michael Harvey,Kerens,86.36,242.67,151.95,249.48,644.1,Single-ply,SBD,M
Boys,89.81,4,Elder Arellano,Rice,86.64,231.33,161.03,242.67,635.03,Single-ply,SBD,M
Boys,89.81,5,Treyvaun Crawford,Trinity,89.27,233.6,161.03,240.4,635.03,Single-ply,SBD,M
Boys,89.81,6,Patrick Martinez,White Oak,88.54,226.8,131.54,260.82,619.15,Single-ply,SBD,M
Boys,89.81,7,Brian Black,Palmer,89.72,240.4,154.22,215.46,610.08,Single-ply,SBD,M
Boys,89.81,8,Dylan Martin,Wortham,88.09,254.01,115.67,231.33,601.01,Single-ply,SBD,M
Boys,89.81,9,Isaiah Askew,Commerce,85.28,231.33,113.4,226.8,571.53,Single-ply,SBD,M
Boys,89.81,10,Harley Manders,Kemp,87.63,226.8,129.27,181.44,537.51,Single-ply,SBD,M
Boys,89.81,11,Dylan Roberts,Redwater,85.28,204.12,113.4,190.51,508.02,Single-ply,SBD,M
Boys,99.79,1,Trent Allen,Troup,93.62,324.32,149.69,235.87,709.87,Single-ply,SBD,M
Boys,99.79,2,Alton Harris,Rice,96.25,272.16,129.27,244.94,646.37,Single-ply,SBD,M
Boys,99.79,3,Jonas Rickman,Palmer,98.16,258.55,156.49,229.06,644.1,Single-ply,SBD,M
Boys,99.79,4,Trent Croke,Detroit,97.7,244.94,140.61,254.01,639.57,Single-ply,SBD,M
Boys,99.79,5,Charlie Flores,Blooming Grove,98.88,265.35,142.88,219.99,628.23,Single-ply,SBD,M
Boys,99.79,6,Justin Horn #1,Corsicana Mildred,98.88,249.48,149.69,226.8,625.96,Single-ply,SBD,M
Boys,99.79,7,Garrett King,Trinity,98.16,244.94,136.08,229.06,610.08,Single-ply,SBD,M
Boys,99.79,8,Brandon Phillips,Trinity,98.43,235.87,161.03,197.31,594.21,Single-ply,SBD,M
Boys,99.79,9,River Drohn,Eustace,94.17,235.87,145.15,208.65,589.67,Single-ply,SBD,M
Boys,99.79,10,Garrison McKinnie,De Kalb,98.88,226.8,147.42,213.19,587.4,Single-ply,SBD,M
Boys,99.79,11,Garrett Harp,Redwater,96.62,226.8,136.08,199.58,562.45,Single-ply,SBD,M
Boys,99.79,DQ,Caleb Adams,Malakoff,94.62,263.08,,,,Single-ply,SBD,M
Boys,109.77,1,TJ Jones,Elkhart,106.5,288.03,154.22,251.74,694,Single-ply,SBD,M
Boys,109.77,2,Tyler Watts,Simms Bowie,105.87,276.69,156.49,247.21,680.39,Single-ply,SBD,M
Boys,109.77,3,Stancio Battles,New Boston,106.96,263.08,149.69,267.62,680.39,Single-ply,SBD,M
Boys,109.77,4,Logan Salles,White Oak,106.23,249.48,170.1,244.94,664.51,Single-ply,SBD,M
Boys,109.77,5,Hunter Brabham,Hughes Springs,106.14,256.28,147.42,235.87,639.57,Single-ply,SBD,M
Boys,109.77,6,Logan Salisbury,Wortham,107.59,238.14,151.95,226.8,616.89,Single-ply,SBD,M
Boys,109.77,7,Aaron Hill,New Boston,106.59,235.87,117.93,254.01,607.81,Single-ply,SBD,M
Boys,109.77,8,Dalton Howell,Queen City,108.32,238.14,131.54,226.8,596.47,Single-ply,SBD,M
Boys,109.77,9,Brendan McClintock,Malakoff,100.97,231.33,129.27,219.99,580.6,Single-ply,SBD,M
Boys,109.77,DQ,Jesse Owen,Frankston,108.68,244.94,,,,Single-ply,SBD,M
Boys,109.77,DQ,Zane Guerra,Dawson,102.33,210.92,,,,Single-ply,SBD,M
Boys,109.77,DQ,Shamar Richardson,Dawson,109.23,226.8,138.35,,,Single-ply,SBD,M
Boys,124.74,1,Josh Porter,Frankston,119.39,312.98,163.29,276.69,752.96,Single-ply,SBD,M
Boys,124.74,2,Kawon McCowin,Shelbyville,124.47,294.84,188.24,260.82,743.89,Single-ply,SBD,M
Boys,124.74,3,Chris Chamness,Mount Vernon,117.57,294.84,151.95,265.35,712.14,Single-ply,SBD,M
Boys,124.74,4,Christian Little,Queen City,119.57,274.42,167.83,260.82,703.07,Single-ply,SBD,M
Boys,124.74,5,Eli Crawford,Kerens,115.76,274.42,140.61,272.16,687.19,Single-ply,SBD,M
Boys,124.74,6,Troie Lane,Lone Oak,116.48,294.84,154.22,215.46,664.51,Single-ply,SBD,M
Boys,124.74,7,Garrett Carpenter,Lone Oak,115.12,267.62,133.81,240.4,641.83,Single-ply,SBD,M
Boys,124.74,8,Matt Brunson,Diana New Diana,118.21,254.01,142.88,226.8,623.69,Single-ply,SBD,M
Boys,124.74,9,Kellan Anderson,Wolfe City,123.74,249.48,145.15,226.8,621.42,Single-ply,SBD,M
Boys,124.74,10,Marcus Staggs,Eustace,123.1,240.4,147.42,219.99,607.81,Single-ply,SBD,M
Boys,124.74,11,Dylan Hicks,Celeste,121.56,251.74,136.08,206.38,594.21,Single-ply,SBD,M
Boys,124.74,12,Travis Lemons,Teague,117.57,240.4,142.88,208.65,591.94,Single-ply,SBD,M
Boys,124.74+,1,Morgan Clark #1,Gladewater Union Grove,131.54,328.85,154.22,272.16,755.23,Single-ply,SBD,M
Boys,124.74+,2,Zach Bell,Joaquin,150.77,317.51,188.24,238.14,743.89,Single-ply,SBD,M
Boys,124.74+,3,Malik Gilliam,Troup,162.48,331.12,161.03,233.6,725.75,Single-ply,SBD,M
Boys,124.74+,4,Alex Sultz,Maud,129.82,294.84,147.42,242.67,684.92,Single-ply,SBD,M
Boys,124.74+,5,Gus Pinner,Pollok Central,133.9,303.91,138.35,238.14,680.39,Single-ply,SBD,M
Boys,124.74+,6,Jesus Garcia #7,Buffalo,137.8,258.55,183.7,226.8,669.05,Single-ply,SBD,M
Boys,124.74+,7,Cade Jones,Elkhart,130.09,249.48,163.29,240.4,653.17,Single-ply,SBD,M
Boys,124.74+,8,Benito Rivas,Buffalo,127.19,240.4,181.44,204.12,625.96,Single-ply,SBD,M
Boys,124.74+,9,Jacob Thompson,New Boston,127.1,231.33,147.42,226.8,605.55,Single-ply,SBD,M
Boys,124.74+,10,Braeden Perry,Gladewater Sabine,138.62,226.8,158.76,208.65,594.21,Single-ply,SBD,M
Boys,124.74+,DQ,Lucas Stephenson,Simms Bowie,129.82,310.71,133.81,,,Single-ply,SBD,M
Boys,124.74+,DQ,John McCurdy,Winnsboro,134.08,,,,,Single-ply,SBD,M
Boys,,NS,Chris Kortes,Trinidad,,,,,,Single-ply,SBD,M
Boys,,NS,Andy Garcia,Trinity,,,,,,Single-ply,SBD,M
Boys,,NS,Langdon Bautista,Quitman,,,,,,Single-ply,SBD,M
Boys,,NS,Mauro Gallegos,Gladewater Sabine,,,,,,Single-ply,SBD,M
Boys,,NS,Christian Perez,Beckville,,,,,,Single-ply,SBD,M
Boys,,NS,Michael Agan,Elkhart,,,,,,Single-ply,SBD,M
