<?xml version="1.0" encoding="UTF-8" standalone="no"?>
<svg
   xmlns:dc="http://purl.org/dc/elements/1.1/"
   xmlns:cc="http://creativecommons.org/ns#"
   xmlns:rdf="http://www.w3.org/1999/02/22-rdf-syntax-ns#"
   xmlns:svg="http://www.w3.org/2000/svg"
   xmlns="http://www.w3.org/2000/svg"
   xmlns:sodipodi="http://sodipodi.sourceforge.net/DTD/sodipodi-0.dtd"
   xmlns:inkscape="http://www.inkscape.org/namespaces/inkscape"
   inkscape:version="1.0 (5b275a35d9, 2020-05-03)"
   sodipodi:docname="3.svg"
   id="svg204"
   version="1.1"
   viewBox="0 0 32 16"
   height="16"
   width="32">
  <metadata
     id="metadata210">
    <rdf:RDF>
      <cc:Work
         rdf:about="">
        <dc:format>image/svg+xml</dc:format>
        <dc:type
           rdf:resource="http://purl.org/dc/dcmitype/StillImage" />
        <dc:title></dc:title>
      </cc:Work>
    </rdf:RDF>
  </metadata>
  <defs
     id="defs208" />
  <sodipodi:namedview
     inkscape:current-layer="g202"
     inkscape:window-maximized="1"
     inkscape:window-y="27"
     inkscape:window-x="70"
     inkscape:cy="8"
     inkscape:cx="16"
     inkscape:zoom="38.5"
     showgrid="false"
     id="namedview206"
     inkscape:window-height="1016"
     inkscape:window-width="1850"
     inkscape:pageshadow="2"
     inkscape:pageopacity="0"
     guidetolerance="10"
     gridtolerance="10"
     objecttolerance="10"
     borderopacity="1"
     bordercolor="#666666"
     pagecolor="#ffffff" />
  <g
     id="g202"
     fill="none">
    <path
       id="path196"
       d="M6 13.644L9.708 16 8.724 11.56 12 8.573 7.686 8.187 6 4 4.314 8.187 0 8.573 3.276 11.56 2.292 16z"
       fill="#EF7711" />
    <path
       fill="#ef7711"
       d="M 16,9.6439996 19.708,12 18.724,7.5599996 22,4.573 17.686,4.187 16,0 14.314,4.187 10,4.573 13.276,7.5599996 12.292,12 Z"
       id="path196-7" />
    <path
       id="path196-7-5"
       d="M 26,13.643999 29.708,16 28.724,11.559999 32,8.573 27.686,8.187 26,4 24.314,8.187 20,8.573 23.276,11.559999 22.292,16 Z"
       fill="#ef7711" />
  </g>
</svg>
