{
    "name": "fire",
    "maps": [
        {
            "name": "fire",
            "id": "f63b0e2c-9b90-4d0d-aed8-5a7b376811af",
            "actions": [
                {
                    "name": "New action",
                    "type": "Button",
                    "id": "93a3cc72-dd80-4a35-b71f-f16692d56eeb",
                    "expectedControlType": "Button",
                    "processors": "",
                    "interactions": "",
                    "initialStateCheck": false
                }
            ],
            "bindings": [
                {
                    "name": "",
                    "id": "f20e8520-7548-440a-9494-b6da09434a12",
                    "path": "<Mouse>/leftButton",
                    "interactions": "",
                    "processors": "",
                    "groups": "",
                    "action": "New action",
                    "isComposite": false,
                    "isPartOfComposite": false
                }
            ]
        }
    ],
    "controlSchemes": []
}