{
  "store.home": {
    "blocks": [
      "list-context.image-list#demo",
      /* You can make references to blocks defined in other files.
       * For example, `flex-layout.row#deals` is defined in the `deals.json` file. */
      "flex-layout.row#deals",
      "__fold__",
      "rich-text#shelf-title",
      "flex-layout.row#shelf",
      "info-card#button-left",
      "info-card#button-right",
      "newsletter",
      "hello-world-wrapper"
    ]
  },

  "list-context.image-list#demo": {
    "children": ["slider-layout#demo-images"],
    "props": {
      "height": 770,
      "preload": true,
      "images": [
        {
          "image": "https://user-agency.com/images/home/banner_cover.png",
          "mobileImage": "https://user-agency.com/images/home/banner_cover.png"
        },
        {
          "image": "https://user-agency.com/images/services/audit_cover_tablet.png",
          "mobileImage": "https://user-agency.com/images/services/audit_cover_tablet.png"
        }
      ]
    }
  },
  "slider-layout#demo-images": {
    "props": {
      "itemsPerPage": {
        "desktop": 1,
        "tablet": 1,
        "phone": 1
      },
      "infinite": true,
      "showNavigationArrows": "desktopOnly",
      "blockClass": "carousel"
    }
  },

  "rich-text#shelf-title": {
    "props": {
      "text": "",
      "blockClass": "shelfTitle"
    }
  },
  "flex-layout.row#shelf": {
    "children": ["list-context.product-list#demo1"]
  },
  "list-context.product-list#demo1": {
    "blocks": ["product-summary.shelf"],
    "children": ["slider-layout#demo-products"],
    "props": {
      "orderBy": "OrderByTopSaleDESC"
    }
  },
  "slider-layout#demo-products": {
    "props": {
      "itemsPerPage": {
        "desktop": 4,
        "tablet": 3,
        "phone": 1
      },
      "infinite": true,
      "fullWidth": false,
      "blockClass": "shelf"
    }
  },

  "info-card#button-left": {
    "props": {
      "id": "info-card-home",
      "isFullModeStyle": false,
      "textPosition": "left",
      "imageUrl": "https://user-agency.com/images/services/development_cover_desktop.png",
      "callToActionText": "Prendre rendez-vous",
      "callToActionUrl": "/rdv",
      "textAlignment": "center",
      "blockClass": "info-card-home",
      "headline": "Audit & Conseil",
      "subhead": "Nous définissons avec vous les indicateurs clés de performance, qui permettront de prendre les meilleures décisions ergonomiques et techniques."
    }
  },
  "info-card#button-right": {
    "props": {
      "id": "info-card-home2",
      "isFullModeStyle": false,
      "textPosition": "right",
      "callToActionText": "Formations",
      "callToActionUrl": "/formations",
      "blockClass": "info-card-home",
      "textAlignment": "center",
      "imageUrl": "https://user-agency.com/images/services/design_cover_desktop.png",
      "headline": "Formez vos équipes",
      "subhead": "Nous formons vos équipes sur les technologies que nous maîtrisons dans nos locaux, à distance ou directement dans votre structure."
    }
  }
}
