Division,WeightClassKg,Place,Name,Team,BodyweightKg,Best3SquatKg,Best3BenchKg,Best3DeadliftKg,TotalKg,Equipment,Event,Sex
Girls,44.23,1,Hope Brekel,Nederland,44.18,117.93,47.63,108.86,274.42,Single-ply,SBD,F
Girls,44.23,2,Venu Phan,Dickinson,43.09,108.86,40.82,113.4,263.08,Single-ply,SBD,F
Girls,44.23,3,Mikayla Mewa,Beaumont West Brook,42.82,88.45,43.09,122.47,254.01,Single-ply,SBD,F
Girls,44.23,4,Hannah Alexander #1,Lumberton,44.18,97.52,63.5,90.72,251.74,Single-ply,SBD,F
Girls,44.23,5,Taylor Killgo,Vidor,44.18,88.45,47.63,106.59,242.67,Single-ply,SBD,F
Girls,44.23,6,Tracejah Hypolite,Port Arthur Memorial,43.82,81.65,31.75,99.79,213.19,Single-ply,SBD,F
Girls,44.23,7,Christina Varela,Alvin,43.27,79.38,43.09,81.65,204.12,Single-ply,SBD,F
Girls,44.23,8,Caitlyn Blackwell,Nederland,44.18,86.18,29.48,86.18,201.85,Single-ply,SBD,F
Girls,44.23,9,Leanne Le,Alvin Shadow Creek,42.64,74.84,31.75,92.99,199.58,Single-ply,SBD,F
Girls,44.23,10,Erin Blazek,Splendora,40.1,70.31,43.09,74.84,188.24,Single-ply,SBD,F
Girls,47.85,1,Hayley Kinard,Vidor,46.81,127.01,52.16,106.59,285.76,Single-ply,SBD,F
Girls,47.85,2,Hailey Alexander,Lumberton,47.08,102.06,61.23,120.2,283.5,Single-ply,SBD,F
Girls,47.85,3,Kennedy Freeman,Beaumont West Brook,47.63,90.72,45.36,113.4,249.48,Single-ply,SBD,F
Girls,47.85,4,Hallie Cappel,Nederland,46.9,92.99,40.82,102.06,235.87,Single-ply,SBD,F
Girls,47.85,5,Adile Leal,Clute Brazoswood,46.99,102.06,38.56,92.99,233.6,Single-ply,SBD,F
Girls,47.85,6,Scarlett Knight,Manvel,47.81,83.91,40.82,79.38,204.12,Single-ply,SBD,F
Girls,47.85,7,Paloma Garcia,Alvin,46.9,83.91,36.29,81.65,201.85,Single-ply,SBD,F
Girls,47.85,DQ,Alaina Stewart,Splendora,47.17,,,,,Single-ply,SBD,F
Girls,47.85,DQ,Karli Brewer,Nederland,47.85,115.67,54.43,,,Single-ply,SBD,F
Girls,51.94,1,Catarina Tran,Nederland,50.35,133.81,52.16,127.01,312.98,Single-ply,SBD,F
Girls,51.94,2,Miranda Housman,New Caney Porter,51.94,113.4,65.77,122.47,301.64,Single-ply,SBD,F
Girls,51.94,3,Christine Estrada,Alvin,51.35,122.47,56.7,113.4,292.57,Single-ply,SBD,F
Girls,51.94,4,Alexia Billingsley,Splendora,50.53,106.59,52.16,115.67,274.42,Single-ply,SBD,F
Girls,51.94,5,Kennadie Cochran,Montgomery,51.44,106.59,49.9,113.4,269.89,Single-ply,SBD,F
Girls,51.94,6,McKailia Murray,Beaumont West Brook,51.94,99.79,47.63,122.47,269.89,Single-ply,SBD,F
Girls,51.94,7,Haley Zigal,Splendora,50.08,95.25,43.09,108.86,247.21,Single-ply,SBD,F
Girls,51.94,DQ,Ava Higginbotham,Splendora,49.08,111.13,,,,Single-ply,SBD,F
Girls,51.94,DQ,Chalanna Harris,Port Arthur Memorial,51.71,,,,,Single-ply,SBD,F
Girls,51.94,DQ,Elana Boudreaux,Santa Fe,50.98,,,,,Single-ply,SBD,F
Girls,56.02,1,Nayely Ortiz,Waller,55.97,113.4,58.97,136.08,308.44,Single-ply,SBD,F
Girls,56.02,2,Jordan Alford,Splendora,54.98,115.67,68.04,120.2,303.91,Single-ply,SBD,F
Girls,56.02,3,Jennifer Sanchez,Alvin,55.7,117.93,63.5,115.67,297.1,Single-ply,SBD,F
Girls,56.02,4,Hope Pridgen,Vidor,55.16,117.93,49.9,117.93,285.76,Single-ply,SBD,F
Girls,56.02,5,Isabella Barragan,Nederland,55.79,97.52,52.16,124.74,274.42,Single-ply,SBD,F
Girls,56.02,6,Joselin Lara,Channelview,56.02,111.13,43.09,120.2,274.42,Single-ply,SBD,F
Girls,56.02,7,Meadow Housman,New Caney Porter,55.34,99.79,49.9,108.86,258.55,Single-ply,SBD,F
Girls,56.02,8,Megan Wilkinson,Lumberton,55.25,90.72,52.16,104.33,247.21,Single-ply,SBD,F
Girls,56.02,DQ,Joslyn Hall,Beaumont West Brook,53.8,,,,,Single-ply,SBD,F
Girls,56.02,DQ,Caitllyn Reviere,Beaumont West Brook,56.02,,,,,Single-ply,SBD,F
Girls,56.02,DQ,Hannah Blanchard,Splendora,53.89,,,,,Single-ply,SBD,F
Girls,60.1,1,Jenna Hoffman #2,Vidor,57.7,142.88,70.31,142.88,356.07,Single-ply,SBD,F
Girls,60.1,2,Jaycee Graham,Splendora,57.88,149.69,70.31,131.54,351.53,Single-ply,SBD,F
Girls,60.1,3,Maggie Zavala,Alvin,59.06,147.42,47.63,140.61,335.66,Single-ply,SBD,F
Girls,60.1,4,Kitana Simpson,Beaumont West Brook,60.06,129.27,63.5,131.54,324.32,Single-ply,SBD,F
Girls,60.1,5,Selena Goodman,Manvel,58.42,115.67,49.9,131.54,297.1,Single-ply,SBD,F
Girls,60.1,6,Sarah Shakelford,Montgomery,60.1,120.2,49.9,127.01,297.1,Single-ply,SBD,F
Girls,60.1,7,Shelbie Swinhoe,New Caney Porter,59.42,115.67,56.7,117.93,290.3,Single-ply,SBD,F
Girls,60.1,8,Yasmin Trejo,Dickinson,59.24,117.93,61.23,102.06,281.23,Single-ply,SBD,F
Girls,60.1,9,Shelby Freudensprung,Santa Fe,59.69,113.4,56.7,111.13,281.23,Single-ply,SBD,F
Girls,60.1,DQ,Meredith Kaspar,Manvel,58.69,131.54,61.23,,,Single-ply,SBD,F
Girls,67.36,1,Bre Haesche,Conroe Caney Creek,65.05,161.03,70.31,163.29,394.63,Single-ply,SBD,F
Girls,67.36,2,Paige Manzella,Splendora,65.86,147.42,81.65,161.03,390.09,Single-ply,SBD,F
Girls,67.36,3,Keioveon Sullivan,Beaumont West Brook,64.14,133.81,68.04,161.03,362.87,Single-ply,SBD,F
Girls,67.36,4,Chasity Carter,Houston Westbury,66.77,138.35,77.11,147.42,362.87,Single-ply,SBD,F
Girls,67.36,5,Sydney Brown,Dayton,64.86,136.08,47.63,156.49,340.19,Single-ply,SBD,F
Girls,67.36,6,Maci Cauley,Beaumont West Brook,63.59,131.54,58.97,138.35,328.85,Single-ply,SBD,F
Girls,67.36,7,Jillian Lamm,Alvin,63.41,136.08,58.97,129.27,324.32,Single-ply,SBD,F
Girls,67.36,8,Victoria Pena,Splendora,62.6,129.27,52.16,138.35,319.78,Single-ply,SBD,F
Girls,67.36,9,Luna Wev,Texas City,65.77,140.61,54.43,124.74,319.78,Single-ply,SBD,F
Girls,67.36,DQ,Madison Chapman,New Caney Porter,66.59,,,,,Single-ply,SBD,F
Girls,67.36,DQ,Skyler Thames,Willis,66.5,,,,,Single-ply,SBD,F
Girls,67.36,DQ,Peyton Dumas,Beaumont West Brook,66.27,156.49,72.57,,,Single-ply,SBD,F
Girls,75.07,1,Hailey Pollard,Alvin Shadow Creek,73.57,129.27,65.77,179.17,374.21,Single-ply,SBD,F
Girls,75.07,2,Morgan Boody,Santa Fe,73.84,151.95,74.84,145.15,371.95,Single-ply,SBD,F
Girls,75.07,3,Tierra Turner,Beaumont West Brook,74.57,136.08,72.57,154.22,362.87,Single-ply,SBD,F
Girls,75.07,4,Ariana Home,Pearland,67.49,151.95,65.77,142.88,360.61,Single-ply,SBD,F
Girls,75.07,5,Avery Luck,Splendora,71.21,142.88,79.38,138.35,360.61,Single-ply,SBD,F
Girls,75.07,6,Kassie Riley,Beaumont West Brook,67.86,142.88,72.57,138.35,353.8,Single-ply,SBD,F
Girls,75.07,7,Jennifer Sierra,Channelview,69.13,136.08,58.97,154.22,349.27,Single-ply,SBD,F
Girls,75.07,8,Pam Corona,New Caney Porter,73.39,142.88,56.7,142.88,342.46,Single-ply,SBD,F
Girls,75.07,9,Baylee Dunn,Splendora,68.95,129.27,79.38,129.27,337.93,Single-ply,SBD,F
Girls,75.07,10,Aiyana Holloman,New Caney Porter,72.03,127.01,63.5,136.08,326.59,Single-ply,SBD,F
Girls,75.07,11,Samantha Raines,Clute Brazoswood,69.13,117.93,70.31,136.08,324.32,Single-ply,SBD,F
Girls,75.07,DQ,Darby Kaminski,Conroe Caney Creek,73.3,127.01,,,,Single-ply,SBD,F
Girls,82.33,1,Millyons McMillian,Beaumont West Brook,78.56,142.88,65.77,170.1,378.75,Single-ply,SBD,F
Girls,82.33,2,Ashley Gonzalez,Lumberton,75.93,158.76,79.38,133.81,371.95,Single-ply,SBD,F
Girls,82.33,3,Winter Rice,Splendora,75.3,138.35,83.91,142.88,365.14,Single-ply,SBD,F
Girls,82.33,4,Morgan Eason,Splendora,80.29,142.88,72.57,147.42,362.87,Single-ply,SBD,F
Girls,82.33,5,Gissel Perez,Channelview,77.29,147.42,58.97,154.22,360.61,Single-ply,SBD,F
Girls,82.33,6,Chiamaka Njeako,Manvel,81.37,142.88,61.23,149.69,353.8,Single-ply,SBD,F
Girls,82.33,7,Nina Hernandez,Clute Brazoswood,77.56,145.15,54.43,149.69,349.27,Single-ply,SBD,F
Girls,82.33,8,Na'quinn McCall,New Caney,75.57,136.08,61.23,149.69,347,Single-ply,SBD,F
Girls,82.33,9,Julissa Recendez,Alvin,75.21,127.01,58.97,147.42,333.39,Single-ply,SBD,F
Girls,82.33,DQ,Adara Land,Conroe Oak Ridge,81.19,142.88,63.5,,,Single-ply,SBD,F
Girls,90.04,1,Victoria Jenkins,Beaumont West Brook,86.64,156.49,68.04,165.56,390.09,Single-ply,SBD,F
Girls,90.04,2,Sierra Gordon,Conroe,89.27,165.56,70.31,145.15,381.02,Single-ply,SBD,F
Girls,90.04,3,Carly Burns,Beaumont West Brook,87.18,156.49,63.5,151.95,371.95,Single-ply,SBD,F
Girls,90.04,4,Yesenia Salinas,Splendora,83.37,161.03,68.04,136.08,365.14,Single-ply,SBD,F
Girls,90.04,5,Alyssa Daniels,Splendora,87.63,138.35,81.65,129.27,349.27,Single-ply,SBD,F
Girls,90.04,6,Hannah Havard,Willis,88.99,136.08,63.5,142.88,342.46,Single-ply,SBD,F
Girls,90.04,7,Doneasha Brown,Beaumont Ozen,87.36,113.4,68.04,151.95,333.39,Single-ply,SBD,F
Girls,90.04,8,Carolina Escamilla,New Caney,86.55,127.01,68.04,117.93,312.98,Single-ply,SBD,F
Girls,90.04,9,Karen Foreman,Texas City,85.18,136.08,52.16,102.06,290.3,Single-ply,SBD,F
Girls,90.04,DQ,Tory Rogers,Conroe Caney Creek,89.4,,,,,Single-ply,SBD,F
Girls,90.04,DQ,Zabrina Kimberlin,Livingston,88.54,142.88,63.5,,,Single-ply,SBD,F
Girls,100.02,1,LaDazeja Charles,Channelview,96.16,195.04,90.72,192.78,478.54,Single-ply,SBD,F
Girls,100.02,2,Lauren Taylor,Conroe Oak Ridge,94.44,174.63,97.52,165.56,437.72,Single-ply,SBD,F
Girls,100.02,3,Jasmine Gowdie,Beaumont West Brook,91.99,176.9,74.84,172.37,424.11,Single-ply,SBD,F
Girls,100.02,4,Marlene Zumaya,Splendora,94.62,174.63,92.99,149.69,417.3,Single-ply,SBD,F
Girls,100.02,5,Madeline Genaurdi,Beaumont West Brook,97.25,136.08,72.57,136.08,344.73,Single-ply,SBD,F
Girls,100.02,6,Blanca Palma,Conroe Woodlands College Park,95.25,138.35,56.7,142.88,337.93,Single-ply,SBD,F
Girls,100.02,7,Celia Rosas,Conroe Oak Ridge,96.62,147.42,65.77,124.74,337.93,Single-ply,SBD,F
Girls,100.02,8,Jasmine O'Bryant,New Caney,94.89,136.08,58.97,131.54,326.59,Single-ply,SBD,F
Girls,100.02,9,Anna Walton,Willis,96.98,124.74,54.43,124.74,303.91,Single-ply,SBD,F
Girls,100.02,10,Olivia Banuelos,Conroe Woodlands College Park,92.53,106.59,43.09,106.59,256.28,Single-ply,SBD,F
Girls,100.02,DQ,Christa Swartz,Santa Fe,98.61,115.67,47.63,,,Single-ply,SBD,F
Girls,100.02,DQ,Garilon Ellas,Port Neches-Groves,91.99,106.59,,,,Single-ply,SBD,F
Girls,117.71,1,Krystal Gonzalez,Manvel,110.31,195.04,68.04,149.69,412.77,Single-ply,SBD,F
Girls,117.71,2,Dariah Jennings,Alvin Shadow Creek,105.69,145.15,58.97,167.83,371.95,Single-ply,SBD,F
Girls,117.71,3,Kia Wells,Texas City,114.58,158.76,56.7,136.08,351.53,Single-ply,SBD,F
Girls,117.71,4,Brooke Beckham,Clute Brazoswood,105.96,147.42,65.77,122.47,335.66,Single-ply,SBD,F
Girls,117.71,5,Kealani Moore,Conroe,102.15,140.61,49.9,142.88,333.39,Single-ply,SBD,F
Girls,117.71,6,LaNaysha Boudreaux,Nederland,100.79,115.67,79.38,131.54,326.59,Single-ply,SBD,F
Girls,117.71,7,Kylie Matticks,Waller,109.86,127.01,61.23,136.08,324.32,Single-ply,SBD,F
Girls,117.71,8,Madison Hall #1,Channelview,108.59,138.35,61.23,120.2,319.78,Single-ply,SBD,F
Girls,117.71,9,Lavender Bill,Beaumont West Brook,100.52,120.2,77.11,113.4,310.71,Single-ply,SBD,F
Girls,117.71,10,Hayli Pennington,Alvin,102.51,138.35,52.16,104.33,294.84,Single-ply,SBD,F
Girls,117.71,11,Cameron Hargroder,Port Neches-Groves,103.69,104.33,49.9,113.4,267.62,Single-ply,SBD,F
Girls,117.71,DQ,Alyssa Millan,Clute Brazoswood,106.41,,,,,Single-ply,SBD,F
Girls,117.71+,1,Melanie McVay,Willis,126.28,195.04,90.72,154.22,439.98,Single-ply,SBD,F
Girls,117.71+,2,Kennedi Henderson,Channelview,140.8,154.22,77.11,145.15,376.48,Single-ply,SBD,F
Girls,117.71+,3,Elisa Neder,Montgomery,134.81,149.69,72.57,140.61,362.87,Single-ply,SBD,F
Girls,117.71+,4,Jadyn Walden,Conroe,119.84,154.22,63.5,136.08,353.8,Single-ply,SBD,F
Girls,117.71+,5,Shadai Sheriff,Beaumont Central,125.83,142.88,72.57,115.67,331.12,Single-ply,SBD,F
Girls,117.71+,6,Dejah Carr,Channelview,123.1,117.93,68.04,142.88,328.85,Single-ply,SBD,F
Girls,117.71+,DQ,Ja'Kayla Smith,Livingston,125.28,,,,,Single-ply,SBD,F
Girls,117.71+,DQ,Laura Hartman,Montgomery,118.3,115.67,58.97,,,Single-ply,SBD,F
