Division,WeightClassKg,Place,Name,Team,BodyweightKg,Best3SquatKg,Best3BenchKg,Best3DeadliftKg,TotalKg,Equipment,Event,Sex,BirthDate
Girls,44.23,1,Anabel Martinez,Edcouch-Elsa,44.09,108.86,49.9,113.4,272.16,Single-ply,SBD,F,
Girls,44.23,2,Alexa Prado,Hidalgo Early College,43,102.06,49.9,97.52,249.48,Single-ply,SBD,F,
Girls,44.23,3,Navaeh Moreno,Rio Hondo,43.27,81.65,34.02,81.65,197.31,Single-ply,SBD,F,
Girls,47.85,1,Bianca Guiterrez,Brownsville Hanna,47.08,102.06,61.23,108.86,272.16,Single-ply,SBD,F,
Girls,47.85,2,Sindy Aguilera,Los Fresnos,47.26,102.06,38.56,124.74,265.35,Single-ply,SBD,F,
Girls,47.85,3,Charley Moreno,Rio Hondo,45.54,113.4,47.63,102.06,263.08,Single-ply,SBD,F,
Girls,47.85,4,Evelyn Montezuma,Los Fresnos,46.99,106.59,45.36,97.52,249.48,Single-ply,SBD,F,
Girls,47.85,5,Sofia Olivarez,Mission Veterans Memorial,47.08,88.45,40.82,117.93,247.21,Single-ply,SBD,F,
Girls,47.85,6,Alex Bermudez,Los Fresnos,47.63,97.52,45.36,102.06,244.94,Single-ply,SBD,F,
Girls,47.85,7,Adamari Guevara,Los Fresnos,46.54,81.65,38.56,102.06,222.26,Single-ply,SBD,F,
Girls,47.85,DQ,Kaitlyn Bryan,Mission Veterans Memorial,46.72,88.45,,,,Single-ply,SBD,F,
Girls,47.85,DQ,Nicole Salinas,Mission Veterans Memorial,46.72,56.7,24.95,,,Single-ply,SBD,F,
Girls,51.94,1,Viviana Lopez,Port Isabel,51.8,145.15,58.97,138.35,342.46,Single-ply,SBD,F,
Girls,51.94,2,Misty Garza,Rio Hondo,49.62,124.74,68.04,147.42,340.19,Single-ply,SBD,F,
Girls,51.94,3,Jackie Perez,Port Isabel,51.8,106.59,47.63,115.67,269.89,Single-ply,SBD,F,
Girls,51.94,4,Kimberly Esparza,Edcouch-Elsa,50.62,115.67,49.9,102.06,267.62,Single-ply,SBD,F,
Girls,51.94,5,Clarissa Rivera #1,La Feria,49.26,108.86,40.82,102.06,251.74,Single-ply,SBD,F,
Girls,51.94,6,Maya Perez,Los Fresnos,50.08,102.06,43.09,106.59,251.74,Single-ply,SBD,F,
Girls,51.94,7,Monica Martinez,Brownsville Veterans Memorial,48.17,102.06,45.36,102.06,249.48,Single-ply,SBD,F,
Girls,51.94,8,Yamin Garcia,Edinburg North,50.44,72.57,45.36,86.18,204.12,Single-ply,SBD,F,
Girls,51.94,9,Nadia Maldonado,Edinburg North,50.8,68.04,47.63,88.45,204.12,Single-ply,SBD,F,
Girls,51.94,10,Valeria Abrego,Edinburg North,48.9,61.23,24.95,52.16,138.35,Single-ply,SBD,F,
Girls,51.94,11,Ashley Hernandez,Edinburg North,50.08,58.97,24.95,52.16,136.08,Single-ply,SBD,F,
Girls,51.94,DQ,Deandra Ramirez,Mercedes,50.08,79.38,,,,Single-ply,SBD,F,
Girls,56.02,1,Alexis Garcia #1,Los Fresnos,55.79,133.81,61.23,127.01,322.05,Single-ply,SBD,F,
Girls,56.02,2,Crystal Jimenez,Mercedes,55.88,124.74,61.23,124.74,310.71,Single-ply,SBD,F,
Girls,56.02,3,Klarissa Jaramillo,Weslaco East,55.47,113.4,56.7,131.54,301.64,Single-ply,SBD,F,
Girls,56.02,4,Iris Puente,Edcouch-Elsa,55.97,111.13,52.16,111.13,274.42,Single-ply,SBD,F,
Girls,56.02,5,Galilea Rodriguez,La Feria,54.43,90.72,58.97,113.4,263.08,Single-ply,SBD,F,
Girls,56.02,6,Daniela De La Torre,Brownsville Pace,55.52,90.72,43.09,117.93,251.74,Single-ply,SBD,F,
Girls,56.02,DQ,Julie del Bosque,Rio Hondo,55.07,,,,,Single-ply,SBD,F,
Girls,60.1,1,Asia De Leon,Brownsville Pace,59.6,131.54,63.5,145.15,340.19,Single-ply,SBD,F,
Girls,60.1,2,Brianna Garcia,Brownsville Pace,60.06,140.61,70.31,129.27,340.19,Single-ply,SBD,F,
Girls,60.1,3,Victoria Escalante,Los Fresnos,59.51,138.35,70.31,127.01,335.66,Single-ply,SBD,F,
Girls,60.1,4,Heidy Perez,PSJA Memorial,58.6,133.81,56.7,142.88,333.39,Single-ply,SBD,F,
Girls,60.1,5,Mikayla Rodriguez,Rio Hondo,60.1,124.74,63.5,138.35,326.59,Single-ply,SBD,F,
Girls,60.1,6,Ariana Hernández,Brownsville Hanna,60.06,120.2,61.23,131.54,312.98,Single-ply,SBD,F,
Girls,60.1,7,Alondra Gonzalez,Brownsville Pace,60.06,127.01,56.7,124.74,308.44,Single-ply,SBD,F,
Girls,60.1,8,Alexandria Martinez,Weslaco East,59.01,124.74,49.9,131.54,306.17,Single-ply,SBD,F,
Girls,60.1,9,Ashley Cardenas,Brownsville Hanna,59.87,117.93,70.31,115.67,303.91,Single-ply,SBD,F,
Girls,60.1,10,Alexandra Davila,Brownsville Pace,58.51,122.47,56.7,120.2,299.37,Single-ply,SBD,F,
Girls,60.1,11,Emily Flores,Rio Hondo,56.34,127.01,54.43,104.33,285.76,Single-ply,SBD,F,
Girls,60.1,12,Ingrid Vargas,La Feria,59.42,124.74,49.9,97.52,272.16,Single-ply,SBD,F,
Girls,60.1,13,Geraldine Campos,Edcouch-Elsa,57.97,111.13,52.16,106.59,269.89,Single-ply,SBD,F,
Girls,60.1,14,Janyssa Espinoza,Mission Veterans Memorial,59.42,95.25,52.16,108.86,256.28,Single-ply,SBD,F,
Girls,60.1,15,Clarissa Flores,Los Fresnos,60.06,113.4,45.36,95.25,254.01,Single-ply,SBD,F,
Girls,60.1,16,Litzy Venegas,Brownsville Veterans Memorial,59.51,102.06,47.63,97.52,247.21,Single-ply,SBD,F,
Girls,60.1,17,Nicole Rivera,Brownsville Pace,57.7,90.72,49.9,102.06,242.67,Single-ply,SBD,F,
Girls,60.1,18,Emily Flores,Brownsville Veterans Memorial,58.42,97.52,31.75,99.79,229.06,Single-ply,SBD,F,
Girls,60.1,19,America Bernal,Brownsville Pace,56.43,54.43,38.56,97.52,190.51,Single-ply,SBD,F,
Girls,60.1,DQ,Mya Martinez,Edinburg North,56.61,74.84,,,,Single-ply,SBD,F,
Girls,67.36,1,Natalie Maldonado,PSJA Memorial,67.31,163.29,81.65,149.69,394.63,Single-ply,SBD,F,
Girls,67.36,2,Rebecka Flores,PSJA Memorial,65.68,138.35,72.57,147.42,358.34,Single-ply,SBD,F,
Girls,67.36,3,Andrea Rizo,Brownsville Pace,65.86,149.69,63.5,138.35,351.53,Single-ply,SBD,F,
Girls,67.36,4,Yocelin Chavez,Hidalgo Early College,65.14,142.88,61.23,136.08,340.19,Single-ply,SBD,F,
Girls,67.36,5,Abby Atkinson,Los Fresnos,66.86,136.08,77.11,127.01,340.19,Single-ply,SBD,F,
Girls,67.36,6,Chantal Macias,Brownsville Hanna,66.86,129.27,83.91,120.2,333.39,Single-ply,SBD,F,
Girls,67.36,7,Irene Lopez,Weslaco East,65.86,124.74,63.5,136.08,324.32,Single-ply,SBD,F,
Girls,67.36,8,Laisha Rivas,Mission Veterans Memorial,60.78,117.93,61.23,133.81,312.98,Single-ply,SBD,F,
Girls,67.36,9,Italie Gonzalez,Los Fresnos,64.32,138.35,56.7,115.67,310.71,Single-ply,SBD,F,
Girls,67.36,10,Jackie Zuniga,PSJA Memorial,63.96,120.2,68.04,113.4,301.64,Single-ply,SBD,F,
Girls,67.36,11,Samantha Perez,Brownsville Hanna,67.22,124.74,61.23,113.4,299.37,Single-ply,SBD,F,
Girls,67.36,12,Emma Soliz,Edinburg North,63.5,111.13,52.16,99.79,263.08,Single-ply,SBD,F,
Girls,67.36,13,Vianey Cantu,Edinburg North,64.23,88.45,45.36,95.25,229.06,Single-ply,SBD,F,
Girls,67.36,14,Emma Martinez,Rio Hondo,66.68,86.18,45.36,95.25,226.8,Single-ply,SBD,F,
Girls,67.36,15,Evelyn Rodriguez,Brownsville Veterans Memorial,67.22,79.38,45.36,83.91,208.65,Single-ply,SBD,F,
Girls,67.36,16,Dailyn Ricalday,La Feria,64.23,70.31,43.09,92.99,206.38,Single-ply,SBD,F,
Girls,67.36,DQ,Jozclynn Rodriguez,Brownsville Hanna,67.36,,,,,Single-ply,SBD,F,
Girls,75.07,1,Victoria Alejandre,La Feria,73.12,170.1,61.23,131.54,362.87,Single-ply,SBD,F,
Girls,75.07,2,Madelyn Galvan,Port Isabel,68.76,140.61,68.04,136.08,344.73,Single-ply,SBD,F,
Girls,75.07,3,Zeena Flores,La Feria,72.21,145.15,65.77,131.54,342.46,Single-ply,SBD,F,
Girls,75.07,4,Hailey Hernandez,Rio Hondo,74.48,136.08,70.31,127.01,333.39,Single-ply,SBD,F,
Girls,75.07,5,Cassandra Martinez,Mercedes,73.12,149.69,58.97,115.67,324.32,Single-ply,SBD,F,
Girls,75.07,6,Elizabeth Solis,Mission Veterans Memorial,75.02,129.27,68.04,122.47,319.78,Single-ply,SBD,F,
Girls,75.07,7,Soila Moreno,Edcouch-Elsa,72.48,127.01,58.97,122.47,308.44,Single-ply,SBD,F,
Girls,75.07,8,Alexis Flores #1,Brownsville Hanna,71.76,124.74,61.23,111.13,297.1,Single-ply,SBD,F,
Girls,75.07,9,Valerie Garza,Mission Veterans Memorial,72.03,113.4,65.77,106.59,285.76,Single-ply,SBD,F,
Girls,75.07,10,Elizabeth Castellanos,Rio Hondo,73.75,120.2,54.43,108.86,283.5,Single-ply,SBD,F,
Girls,75.07,11,Matally Flores,Mission Veterans Memorial,73.75,102.06,65.77,113.4,281.23,Single-ply,SBD,F,
Girls,75.07,12,Amanda Cabrera,Weslaco East,72.8,90.72,52.16,122.47,265.35,Single-ply,SBD,F,
Girls,75.07,13,Lindsey Reyes,Hidalgo Early College,71.12,99.79,43.09,102.06,244.94,Single-ply,SBD,F,
Girls,75.07,14,Angela Chavez,Hidalgo Early College,69.22,97.52,36.29,104.33,238.14,Single-ply,SBD,F,
Girls,75.07,DQ,Isabella Alvarez,La Feria,72.12,81.65,,,,Single-ply,SBD,F,
Girls,75.07,DQ,Valeria Estrada,Edinburg North,72.57,124.74,,,,Single-ply,SBD,F,
Girls,82.33,1,Eylen Ruiz,Brownsville Pace,79.29,188.24,95.25,154.22,437.72,Single-ply,SBD,F,
Girls,82.33,2,Natalie Rivera,Brownsville Pace,79.47,167.83,81.65,140.61,390.09,Single-ply,SBD,F,
Girls,82.33,3,Gabriella Alejandre,La Feria,79.2,163.29,63.5,154.22,381.02,Single-ply,SBD,F,
Girls,82.33,4,Amy Aguirre,Edcouch-Elsa,76.57,140.61,74.84,136.08,351.53,Single-ply,SBD,F,
Girls,82.33,5,Micaela Flores,Mission Veterans Memorial,80.1,145.15,77.11,129.27,351.53,Single-ply,SBD,F,
Girls,82.33,6,Adriana Cancino,Brownsville Hanna,80.92,142.88,68.04,136.08,347,Single-ply,SBD,F,
Girls,82.33,7,Sydney Frausto,La Feria,75.39,136.08,65.77,131.54,333.39,Single-ply,SBD,F,
Girls,82.33,8,Angelina Lopez,La Feria,82.28,129.27,70.31,124.74,324.32,Single-ply,SBD,F,
Girls,82.33,9,Mildred Lugo,Edcouch-Elsa,81.83,127.01,68.04,124.74,319.78,Single-ply,SBD,F,
Girls,82.33,10,Mary Jo Moreno,Edinburg North,82.19,120.2,81.65,117.93,319.78,Single-ply,SBD,F,
Girls,82.33,11,Tyler Wilson #9,Edcouch-Elsa,82.28,113.4,58.97,122.47,294.84,Single-ply,SBD,F,
Girls,82.33,12,Zayda Sanchez,Mission Veterans Memorial,76.38,92.99,65.77,127.01,285.76,Single-ply,SBD,F,
Girls,82.33,13,Galilea Leal,Edinburg North,79.11,97.52,47.63,95.25,240.4,Single-ply,SBD,F,
Girls,82.33,14,Aileen Duran,Mission Veterans Memorial,76.29,77.11,38.56,81.65,197.31,Single-ply,SBD,F,
Girls,82.33,15,Julie Torres,Rio Hondo,79.74,117.93,,,117.93,Single-ply,S,F,
Girls,82.33,DQ,Ashlee Zuniga,Weslaco East,80.83,,,,,Single-ply,SBD,F,
Girls,90.04,1,Alyssa Ramirez,La Feria,84.37,206.38,88.45,201.85,496.68,Single-ply,SBD,F,
Girls,90.04,2,Nayeli Lopez,Brownsville Veterans Memorial,88,158.76,81.65,142.88,383.29,Single-ply,SBD,F,
Girls,90.04,3,Maria Cuellar,PSJA Memorial,87.82,165.56,83.91,129.27,378.75,Single-ply,SBD,F,
Girls,90.04,4,Abigail Martinez,PSJA Memorial,83.01,154.22,83.91,133.81,371.95,Single-ply,SBD,F,
Girls,90.04,5,Kiahra Barron,Los Fresnos,89.36,138.35,77.11,133.81,349.27,Single-ply,SBD,F,
Girls,90.04,6,Marissa Peacock,Edinburg North,89.72,124.74,83.91,122.47,331.12,Single-ply,SBD,F,
Girls,90.04,7,Ammy Trevino,Brownsville Hanna,89.99,142.88,77.11,106.59,326.59,Single-ply,SBD,F,
Girls,90.04,8,Destiny Hernandez,Edinburg North,84.91,122.47,68.04,122.47,312.98,Single-ply,SBD,F,
Girls,90.04,9,Isabela Garcia,Mercedes,85.37,127.01,56.7,97.52,281.23,Single-ply,SBD,F,
Girls,90.04,10,Mia Peacock,Edcouch-Elsa,85.82,102.06,52.16,95.25,249.48,Single-ply,SBD,F,
Girls,90.04,DQ,Emily Gonzalez,Brownsville Pace,86.91,,,,,Single-ply,SBD,F,
Girls,100.02,1,Britney Ibarra,Hidalgo Early College,93.98,190.51,83.91,170.1,444.52,Single-ply,SBD,F,
Girls,100.02,2,Alejandra Garcia,Los Fresnos,93.98,183.7,102.06,151.95,437.72,Single-ply,SBD,F,
Girls,100.02,3,Alicia Gomez,PSJA Memorial,100.02,172.37,90.72,154.22,417.3,Single-ply,SBD,F,
Girls,100.02,4,Irlanda Moreno,Brownsville Veterans Memorial,94.98,170.1,79.38,163.29,412.77,Single-ply,SBD,F,
Girls,100.02,5,Karina Medina,Rio Hondo,99.79,158.76,81.65,158.76,399.16,Single-ply,SBD,F,
Girls,100.02,6,Emily Solis,Brownsville Hanna,97.79,147.42,61.23,136.08,344.73,Single-ply,SBD,F,
Girls,117.71,1,Kaylen Flores,PSJA Memorial,115.58,170.1,92.99,140.61,403.7,Single-ply,SBD,F,
Girls,117.71,2,Viviana Diaz,Brownsville Hanna,103.87,154.22,65.77,138.35,358.34,Single-ply,SBD,F,
Girls,117.71,3,Brianna Seifert,Edcouch-Elsa,109.77,136.08,70.31,142.88,349.27,Single-ply,SBD,F,
Girls,117.71,4,Sarah Longoria,Mercedes,107.23,136.08,47.63,102.06,285.76,Single-ply,SBD,F,
Girls,117.71,5,Azeneth Ibarra,Hidalgo Early College,100.61,106.59,49.9,111.13,267.62,Single-ply,SBD,F,
Girls,117.71,DQ,Ashley Gonzalez,Brownsville Pace,109.86,,,,,Single-ply,SBD,F,
Girls,,NS,Deena Flores,Edcouch-Elsa,,,,,,Single-ply,SBD,F,
Girls,,NS,Cristine Pacheco,Hidalgo Early College,,,,,,Single-ply,SBD,F,
Girls,,NS,Yvonne De La Fuente,Brownsville Veterans Memorial,,,,,,Single-ply,SBD,F,
Girls,,NS,Lexy Garza,Mission Veterans Memorial,,,,,,Single-ply,SBD,F,
Girls,,NS,April Puente,Port Isabel,,,,,,Single-ply,SBD,F,
Girls,,NS,Cassity Villarreal,Rio Hondo,,,,,,Single-ply,SBD,F,
