Name,WeightClassKg,Division,Sex,Best3SquatKg,Best3BenchKg,Best3DeadliftKg,TotalKg,Event,Equipment,Place
Robin Werfel,44,Open,F,88.45,47.63,92.99,229.06,SBD,Single-ply,1
James Edwards #4,52,Open,M,120.2,104.33,172.37,396.89,SBD,Single-ply,1
Todd Antinaro,52,Open,M,133.81,79.38,142.88,356.07,SBD,Single-ply,2
Greg Ciola,52,Open,M,90.72,47.63,104.33,242.67,SBD,Single-ply,3
Michael Fosmire,56,Open,M,113.4,56.7,136.08,306.18,SBD,Single-ply,1
Brenda Fewster,56,Open,F,97.52,45.36,120.2,263.08,SBD,Single-ply,2
Nelson Sleno,60,Open,M,195.04,124.74,199.58,519.36,SBD,Single-ply,1
Matthew Kunze,60,Open,M,170.1,88.45,181.44,439.99,SBD,Single-ply,2
Richard Edwards,60,Open,M,124.74,129.27,181.44,435.45,SBD,Single-ply,3
Ronald Daly,60,Open,M,149.69,106.59,176.9,433.18,SBD,Single-ply,4
Fred Wagner,60,Open,M,151.95,88.45,181.44,421.84,SBD,Single-ply,5
Rondall Zehr,60,Open,M,136.08,99.79,181.44,417.31,SBD,Single-ply,6
Mario Forte,60,Open,M,120.2,77.11,154.22,351.53,SBD,Single-ply,7
Paul Ciola,60,Open,M,122.47,70.31,154.22,347,SBD,Single-ply,8
Kathy Ray,60,Open,F,92.99,49.9,106.59,249.48,SBD,Single-ply,9
Sylvia Matlot,60,Open,F,74.84,54.43,86.18,215.46,SBD,Single-ply,10
Dave LaPlant,67.5,Open,M,219.99,124.74,222.26,566.99,SBD,Single-ply,1
George Fosmire,67.5,Open,M,199.58,113.4,233.6,546.58,SBD,Single-ply,2
Jay Fortino,67.5,Open,M,192.78,122.47,213.19,528.44,SBD,Single-ply,3
John Misiaczek,67.5,Open,M,190.51,133.81,204.12,528.44,SBD,Single-ply,4
Mike Gabak,67.5,Open,M,201.85,102.06,217.72,521.63,SBD,Single-ply,5
Jay Halprin,67.5,Open,M,192.78,102.06,204.12,498.95,SBD,Single-ply,6
Willie Wong,67.5,Open,M,174.63,106.59,183.71,464.93,SBD,Single-ply,7
Douglas Schader,67.5,Open,M,145.15,117.93,172.37,435.45,SBD,Single-ply,8
Timothy Morin,67.5,Open,M,147.42,74.84,151.95,374.21,SBD,Single-ply,9
James van Allen,75,Open,M,249.48,158.76,226.8,635.03,SBD,Single-ply,1
Howard Krieger,75,Open,M,219.99,145.15,238.14,603.28,SBD,Single-ply,2
Manuel Turgeon,75,Open,M,222.26,124.74,231.33,578.33,SBD,Single-ply,3
Mike Casatelli,75,Open,M,226.8,120.2,229.06,576.06,SBD,Single-ply,4
Anthony Funaro,75,Open,M,195.04,145.15,229.06,569.26,SBD,Single-ply,5
Fred Kenyon,75,Open,M,210.92,117.93,224.53,553.38,SBD,Single-ply,6
C. Robitaille,75,Open,M,213.19,117.93,217.72,548.85,SBD,Single-ply,7
S. Carpenter,75,Open,M,204.12,127.01,208.65,539.78,SBD,Single-ply,8
Joseph Dundon,75,Open,M,195.04,127.01,208.65,530.7,SBD,Single-ply,9
Joseph Gardner,75,Open,M,199.58,122.47,204.12,526.17,SBD,Single-ply,10
Louis Leno,75,Open,M,174.63,120.2,215.46,510.29,SBD,Single-ply,11
William Grieco,75,Open,M,208.65,102.06,195.04,505.76,SBD,Single-ply,12
Ray Bigrow,75,Open,M,181.44,113.4,210.92,505.76,SBD,Single-ply,13
Eric Guby,75,Open,M,176.9,108.86,215.46,501.22,SBD,Single-ply,14
Will Marchetti,75,Open,M,172.37,127.01,199.58,498.95,SBD,Single-ply,15
Gerald Griffin,75,Open,M,163.29,108.86,215.46,487.61,SBD,Single-ply,16
Donald Chew,75,Open,M,158.76,113.4,206.38,478.54,SBD,Single-ply,17
Ralph Cirelli,75,Open,M,158.76,113.4,181.44,453.59,SBD,Single-ply,18
Tom Piazza,75,Open,M,238.14,,,,SBD,Single-ply,DQ
Brian Sullivan #3,82.5,Open,M,292.57,170.1,249.48,712.14,SBD,Single-ply,1
Jerry Szigethy,82.5,Open,M,238.14,145.15,288.03,671.32,SBD,Single-ply,2
Mike Makofsky,82.5,Open,M,251.74,156.49,254.01,662.25,SBD,Single-ply,3
John LaFay,82.5,Open,M,235.87,149.69,238.14,623.69,SBD,Single-ply,4
John Drapper,82.5,Open,M,219.99,127.01,256.28,603.28,SBD,Single-ply,5
Jimmy Low,82.5,Open,M,226.8,142.88,231.33,601.01,SBD,Single-ply,6
Charles Russo,82.5,Open,M,204.12,133.81,229.06,566.99,SBD,Single-ply,9
Fred Brescia,82.5,Open,M,229.06,133.81,217.72,580.6,SBD,Single-ply,7
Tony Cardillo,82.5,Open,M,208.65,145.15,219.99,573.8,SBD,Single-ply,8
Karl Reome,82.5,Open,M,206.38,113.4,244.94,564.72,SBD,Single-ply,10
Scott Cooney,82.5,Open,M,188.24,129.27,244.94,562.46,SBD,Single-ply,11
Philip Gwyn,82.5,Open,M,192.78,120.2,217.72,530.7,SBD,Single-ply,12
Gene White,82.5,Open,M,204.12,120.2,199.58,523.9,SBD,Single-ply,13
Vern Pitman,82.5,Open,M,181.44,113.4,215.46,510.29,SBD,Single-ply,14
Jeff Maloney,82.5,Open,M,192.78,104.33,188.24,485.34,SBD,Single-ply,15
Tony Coratti,90,Open,M,285.76,167.83,285.76,739.36,SBD,Single-ply,1
Gary Massaroni,90,Open,M,265.35,170.1,272.16,707.6,SBD,Single-ply,2
Jimmie King,90,Open,M,249.48,156.49,299.37,705.34,SBD,Single-ply,3
Neil Confessore,90,Open,M,254.01,176.9,267.62,698.53,SBD,Single-ply,4
Bruce Churchwell,90,Open,M,242.67,142.88,272.16,657.71,SBD,Single-ply,5
Bill Clute,90,Open,M,263.08,154.22,240.4,657.71,SBD,Single-ply,6
Neil Shovan,90,Open,M,217.72,140.61,235.87,594.21,SBD,Single-ply,7
Harold Gelchinsky,90,Open,M,210.92,140.61,229.06,580.6,SBD,Single-ply,8
Mark Kodya,90,Open,M,147.42,124.74,185.97,458.13,SBD,Single-ply,9
Tom Palmer,100,Open,M,290.3,176.9,292.57,759.77,SBD,Single-ply,1
Chuck Hanis,100,Open,M,263.08,190.51,292.57,746.16,SBD,Single-ply,2
Ed Ruquet,100,Open,M,297.1,161.03,272.16,730.28,SBD,Single-ply,3
Frank Massa,100,Open,M,249.48,197.31,219.99,666.78,SBD,Single-ply,4
Wayne Shepard,100,Open,M,249.48,163.29,226.8,639.57,SBD,Single-ply,5
Dave Drapalski,100,Open,M,229.06,142.88,249.48,621.42,SBD,Single-ply,6
W. Drummond,100,Open,M,240.4,136.08,240.4,616.89,SBD,Single-ply,7
James Nichols,100,Open,M,229.06,165.56,222.26,616.89,SBD,Single-ply,8
Steve Walsh,100,Open,M,217.72,133.81,249.48,601.01,SBD,Single-ply,9
John Novine,100,Open,M,215.46,127.01,249.48,591.94,SBD,Single-ply,10
John Luppy,100,Open,M,195.04,136.08,215.46,546.58,SBD,Single-ply,11
Bob Hunt,110,Open,M,342.46,181.44,317.52,841.41,SBD,Single-ply,1
Mark Grogan,110,Open,M,292.57,185.97,267.62,746.16,SBD,Single-ply,2
Bob Welch,110,Open,M,269.89,161.03,272.16,703.07,SBD,Single-ply,3
James Martin #9,110,Open,M,249.48,181.44,217.72,648.64,SBD,Single-ply,4
John Martin #11,125,Open,M,317.52,240.4,294.84,852.75,SBD,Single-ply,1
Jeffrey Kristel,125,Open,M,283.5,138.35,258.55,680.39,SBD,Single-ply,2
Mike Benevento,125,Open,M,217.72,158.76,272.16,648.64,SBD,Single-ply,3
Charles Schroeder,125,Open,M,233.6,147.42,249.48,630.49,SBD,Single-ply,4
Jim Tomaski,125+,Open,M,283.5,176.9,272.16,732.55,SBD,Single-ply,1
