Division,WeightClassKg,Place,Name,Team,BodyweightKg,Best3SquatKg,Best3BenchKg,Best3DeadliftKg,TotalKg,Equipment,Event,Sex
Boys,51.71,1,Justin Davis,Buda Hays,50.8,129.27,92.99,147.42,369.68,Single-ply,SBD,M
Boys,51.71,2,Tyrus King,Pflugerville Connally,51.71,136.08,81.65,142.88,360.61,Single-ply,SBD,M
Boys,51.71,3,Ray Landry,Del Valle,50.39,122.47,70.31,142.88,335.66,Single-ply,SBD,M
Boys,51.71,4,Jahvier Nivar,Killeen Ellison,51.71,115.67,61.23,142.88,319.78,Single-ply,SBD,M
Boys,51.71,5,Marsalis Carrington,Austin Bowie,47.63,111.13,68.04,133.81,312.98,Single-ply,SBD,M
Boys,51.71,6,Mario Maciel,Lockhart,51.71,111.13,70.31,127.01,308.44,Single-ply,SBD,M
Boys,51.71,7,Brian Villarreal,Geronimo Navarro,45.36,113.4,58.97,127.01,299.37,Single-ply,SBD,M
Boys,51.71,8,Jonathan Bencomo,San Marcos,51.71,97.52,47.63,117.93,263.08,Single-ply,SBD,M
Boys,51.71,9,Matt Poulson,Georgetown East View,48.99,70.31,47.63,70.31,188.24,Single-ply,SBD,M
Boys,51.71,DQ,Austin Hay,Dripping Springs,51.71,,,,,Single-ply,SBD,M
Boys,55.79,1,Joe Lendo,Leander,55.34,133.81,86.18,161.03,381.02,Single-ply,SBD,M
Boys,55.79,2,Celestino Hernandez,Del Valle,54.66,145.15,79.38,136.08,360.61,Single-ply,SBD,M
Boys,55.79,3,Jeremy Fejeran,Killeen Ellison,53.98,113.4,77.11,156.49,347,Single-ply,SBD,M
Boys,59.87,1,Josh Fantauzzi,Buda Hays,58.51,188.24,104.33,199.58,492.15,Single-ply,SBD,M
Boys,59.87,2,Dominic Packer,Austin Lake Travis,59.42,176.9,99.79,213.19,489.88,Single-ply,SBD,M
Boys,59.87,3,Johnathan McCarty,Leander,59.42,151.95,88.45,192.78,433.18,Single-ply,SBD,M
Boys,59.87,4,Miguel Valdez,Georgetown East View,59.87,158.76,90.72,174.63,424.11,Single-ply,SBD,M
Boys,59.87,5,Anthony Holguin,San Marcos,58.97,149.69,88.45,174.63,412.77,Single-ply,SBD,M
Boys,59.87,6,Courtney Anderson #1,San Marcos,59.87,145.15,83.91,165.56,394.63,Single-ply,SBD,M
Boys,59.87,7,Braden Abercrombie,Del Valle,59.19,151.95,83.91,145.15,381.02,Single-ply,SBD,M
Boys,59.87,8,Troy Ogg,La Grange,56.25,149.69,81.65,145.15,376.48,Single-ply,SBD,M
Boys,59.87,9,Justin Lara,Buda Hays,56.25,129.27,70.31,165.56,365.14,Single-ply,SBD,M
Boys,59.87,10,Jessie Rodriguez,Pflugerville Hendrickson,58.97,131.54,79.38,145.15,356.07,Single-ply,SBD,M
Boys,59.87,11,Rycherd Lott,Leander Rouse,58.97,129.27,70.31,136.08,335.66,Single-ply,SBD,M
Boys,59.87,12,Ellis Perry,Lockhart,58.06,124.74,72.57,113.4,310.71,Single-ply,SBD,M
Boys,59.87,DQ,Louis Mena,Del Valle,57.97,,,,,Single-ply,SBD,M
Boys,59.87,DQ,Alvin Martinez,Del Valle,59.24,,,,,Single-ply,SBD,M
Boys,59.87,DQ,Garrett Cain,Columbus,58.97,,,,,Single-ply,SBD,M
Boys,59.87,DQ,Brandon Tijerina,Austin Bowie,58.06,,,,,Single-ply,SBD,M
Boys,59.87,DQ,Will Meng,Liberty Hill,58.06,,,,,Single-ply,SBD,M
Boys,59.87,DQ,Alex Palomo,Luling,56.7,,,,,Single-ply,SBD,M
Boys,59.87,DQ,Jose Martinez-Gonzalez,Taylor,59.87,,,,,Single-ply,SBD,M
Boys,67.13,1,Ryan Arnold,Georgetown,67.04,197.31,97.52,197.31,492.15,Single-ply,SBD,M
Boys,67.13,2,Thomas Abraham,Austin Bowie,65.32,165.56,108.86,199.58,474,Single-ply,SBD,M
Boys,67.13,3,Eduardo Lizardo,Del Valle,66.95,136.08,97.52,165.56,399.16,Single-ply,SBD,M
Boys,67.13,4,Daniel Simpson,Austin Lake Travis,66.68,136.08,90.72,167.83,394.63,Single-ply,SBD,M
Boys,67.13,5,Cody Patterson,Bastrop Cedar Creek,65.32,127.01,90.72,145.15,362.87,Single-ply,SBD,M
Boys,67.13,6,Albian Leyva,San Marcos,62.14,133.81,77.11,145.15,356.07,Single-ply,SBD,M
Boys,67.13,7,Jacob Skidmore,Austin Bowie,66.22,122.47,79.38,142.88,344.73,Single-ply,SBD,M
Boys,67.13,8,Brandon Speir,Leander,61.69,117.93,63.5,136.08,317.51,Single-ply,SBD,M
Boys,67.13,9,David Bushong,Austin Anderson,60.33,92.99,54.43,129.27,276.69,Single-ply,SBD,M
Boys,67.13,DQ,Ever Calderon,Buda Hays,64.41,,,,,Single-ply,SBD,M
Boys,67.13,DQ,Mason Salinas,Buda Hays,65.77,,,,,Single-ply,SBD,M
Boys,67.13,DQ,Malcolm Hollins,Taylor,66.22,,,,,Single-ply,SBD,M
Boys,67.13,DQ,Aaron Bucek,Taylor,66.22,,,,,Single-ply,SBD,M
Boys,67.13,DQ,Daniel Hernandez,Taylor,67.13,,,,,Single-ply,SBD,M
Boys,67.13,DQ,Joseph Marmelejo,Taylor,64.41,136.08,,,,Single-ply,SBD,M
Boys,67.13,DQ,Christian Lopez #5,Taylor,61.69,,,,,Single-ply,SBD,M
Boys,74.84,1,Sigi Martinez,Leander Rouse,73.48,219.99,138.35,204.12,562.45,Single-ply,SBD,M
Boys,74.84,DQ,Conner Cross,Dripping Springs,72.57,,,,,Single-ply,SBD,M
Boys,74.84,3,R J Nava,Georgetown,72.57,206.38,129.27,210.92,546.58,Single-ply,SBD,M
Boys,74.84,4,David Salazar,Taylor,68.95,213.19,113.4,210.92,537.51,Single-ply,SBD,M
Boys,74.84,5,Laravis Blunson,Taylor,73.48,215.46,117.93,204.12,537.51,Single-ply,SBD,M
Boys,74.84,6,Weston Murrary,Dripping Springs,73.94,213.19,83.91,217.72,514.83,Single-ply,SBD,M
Boys,74.84,7,Kole Sneed,Pflugerville Connally,74.84,188.24,111.13,215.46,514.83,Single-ply,SBD,M
Boys,74.84,8,Placid Unebu,Pflugerville Connally,73.94,190.51,111.13,197.31,498.95,Single-ply,SBD,M
Boys,74.84,9,Kevin Spohrer,Austin Lake Travis,73.94,181.44,113.4,188.24,483.08,Single-ply,SBD,M
Boys,74.84,10,Daniel Dehon,Leander Rouse,71.21,167.83,104.33,192.78,464.93,Single-ply,SBD,M
Boys,74.84,11,Blake Lisby,Austin Lake Travis,74.39,176.9,106.59,181.44,464.93,Single-ply,SBD,M
Boys,74.84,12,Nate Pintor,Georgetown East View,72.57,167.83,102.06,181.44,451.32,Single-ply,SBD,M
Boys,74.84,13,Scott Thompson,Georgetown East View,70.76,161.03,88.45,183.7,433.18,Single-ply,SBD,M
Boys,74.84,14,Joel Juarez,Lockhart,73.03,156.49,86.18,176.9,419.57,Single-ply,SBD,M
Boys,74.84,15,Dakota Baker,La Grange,71.21,165.56,74.84,174.63,415.04,Single-ply,SBD,M
Boys,74.84,16,Joel Hinojosa,San Marcos,70.31,140.61,72.57,161.03,374.21,Single-ply,SBD,M
Boys,74.84,17,Robert Holguin,San Marcos,72.57,145.15,77.11,149.69,371.95,Single-ply,SBD,M
Boys,74.84,18,Adrian Contreras,Georgetown East View,70.31,138.35,81.65,142.88,362.87,Single-ply,SBD,M
Boys,74.84,19,Holland Wiler,Austin Anderson,74.84,92.99,56.7,136.08,285.76,Single-ply,SBD,M
Boys,74.84,DQ,Daniel Rangel,Del Valle,72.76,,,,,Single-ply,SBD,M
Boys,82.1,1,Hayden Eskew,Buda Hays,80.29,226.8,154.22,226.8,607.81,Single-ply,SBD,M
Boys,82.1,2,Jay Leal,Geronimo Navarro,80.29,206.38,113.4,233.6,553.38,Single-ply,SBD,M
Boys,82.1,3,Chukie Ojiyi,Pflugerville Hendrickson,77.11,226.8,120.2,201.85,548.85,Single-ply,SBD,M
Boys,82.1,4,Luke Evans,Hutto,81.65,197.31,120.2,226.8,544.31,Single-ply,SBD,M
Boys,82.1,5,Devin Jennings,Buda Hays,79.83,192.78,127.01,222.26,542.04,Single-ply,SBD,M
Boys,82.1,6,Everado Araujo,Taylor,78.02,215.46,115.67,206.38,537.51,Single-ply,SBD,M
Boys,82.1,7,Andrew Ray,Columbus,79.83,199.58,117.93,217.72,535.24,Single-ply,SBD,M
Boys,82.1,8,Simon Castillo,Bastrop Cedar Creek,81.19,204.12,136.08,190.51,530.7,Single-ply,SBD,M
Boys,82.1,9,Jamie Faglie,Cedar Park Vista Ridge,81.65,176.9,136.08,215.46,528.44,Single-ply,SBD,M
Boys,82.1,10,Brendan Cubit,Luling,80.29,206.38,111.13,204.12,521.63,Single-ply,SBD,M
Boys,82.1,11,Matthew Torres,La Grange,79.83,183.7,111.13,188.24,483.08,Single-ply,SBD,M
Boys,82.1,12,Mitch Martinez,Austin Bowie,80.29,181.44,124.74,172.37,478.54,Single-ply,SBD,M
Boys,82.1,13,Nigel Deas,Killeen Ellison,80.74,183.7,111.13,181.44,476.27,Single-ply,SBD,M
Boys,82.1,14,Ryan Buehler,Dripping Springs,82.1,176.9,136.08,163.29,476.27,Single-ply,SBD,M
Boys,82.1,15,Ryan Heinrich,Leander Rouse,80.74,174.63,97.52,170.1,442.25,Single-ply,SBD,M
Boys,82.1,16,Nathaniel Gomez,Cedar Park Vista Ridge,80.74,161.03,104.33,163.29,428.64,Single-ply,SBD,M
Boys,82.1,17,Dave Alfaro,Leander,78.02,170.1,90.72,151.95,412.77,Single-ply,SBD,M
Boys,82.1,18,Caleb Cash,Georgetown East View,76.66,149.69,104.33,136.08,390.09,Single-ply,SBD,M
Boys,82.1,19,Cameron Shewmaker,Leander,79.83,136.08,90.72,156.49,383.29,Single-ply,SBD,M
Boys,82.1,20,Arturo Rodriguez,Georgetown East View,81.19,124.74,79.38,161.03,365.14,Single-ply,SBD,M
Boys,82.1,21,Ben Purcell,Georgetown,78.47,138.35,70.31,149.69,358.34,Single-ply,SBD,M
Boys,82.1,22,Luis Sanchez,Killeen Ellison,81.19,185.97,122.47,,308.44,Single-ply,SB,M
Boys,82.1,DQ,Ian Friedman,Austin Lake Travis,81.65,,,,,Single-ply,SB,M
Boys,82.1,DQ,Z Mahmoud,Leander Rouse,80.74,,,,,Single-ply,SB,M
Boys,89.81,DQ,Jacob Flores,San Marcos,82.55,,,,,Single-ply,SBD,M
Boys,89.81,2,Kelly McBride,Del Valle,88.68,222.26,127.01,222.26,571.53,Single-ply,SBD,M
Boys,89.81,3,Trevor Sellers,Killeen Ellison,86.18,195.04,133.81,215.46,544.31,Single-ply,SBD,M
Boys,89.81,4,Tanner Brown,Lockhart,88,206.38,120.2,215.46,542.04,Single-ply,SBD,M
Boys,89.81,5,Omar Smith,Pflugerville Hendrickson,86.18,208.65,102.06,224.53,535.24,Single-ply,SBD,M
Boys,89.81,6,John Subia,Austin Bowie,89.36,197.31,131.54,204.12,532.97,Single-ply,SBD,M
Boys,89.81,7,Joseph Rodriguez,Bastrop Cedar Creek,84.37,192.78,117.93,210.92,521.63,Single-ply,SBD,M
Boys,89.81,8,Shane Henry,Georgetown East View,85.73,167.83,138.35,213.19,519.36,Single-ply,SBD,M
Boys,89.81,9,Joshua Mercado,San Marcos,89.81,190.51,129.27,199.58,519.36,Single-ply,SBD,M
Boys,89.81,10,William Linder,Buda Hays,88.9,181.44,117.93,213.19,512.56,Single-ply,SBD,M
Boys,89.81,11,Josh Bermudez,Austin Lake Travis,85.73,183.7,129.27,183.7,496.68,Single-ply,SBD,M
Boys,89.81,12,Levi Reeves,Georgetown East View,88,204.12,90.72,181.44,476.27,Single-ply,SBD,M
Boys,89.81,13,Fabian Trujullo,Killeen Ellison,83.46,161.03,117.93,188.24,467.2,Single-ply,SBD,M
Boys,89.81,14,Brandon Willrich,Pflugerville Connally,85.28,174.63,102.06,188.24,464.93,Single-ply,SBD,M
Boys,89.81,15,Robert Dalphonse,Leander,88.45,165.56,97.52,163.29,426.38,Single-ply,SBD,M
Boys,89.81,16,Joseph Weise,Dripping Springs,84.82,136.08,115.67,158.76,410.5,Single-ply,SBD,M
Boys,89.81,17,Caleb Hansen,Pflugerville Connally,88,151.95,92.99,158.76,403.7,Single-ply,SBD,M
Boys,89.81,18,Keland Moore,Georgetown,85.28,158.76,90.72,,249.48,Single-ply,SB,M
Boys,89.81,DQ,Colton Miori,La Grange,83.46,,,,,Single-ply,SB,M
Boys,89.81,DQ,Chris Hoad,Leander Rouse,88,,,,,Single-ply,SB,M
Boys,99.79,1,Drew Peterson,Dripping Springs,97.07,260.82,170.1,272.16,703.07,Single-ply,SBD,M
Boys,99.79,2,Elijah Tienda,Lockhart,98.88,233.6,140.61,238.14,612.35,Single-ply,SBD,M
Boys,99.79,3,Conner Roe,Geronimo Navarro,97.98,217.72,145.15,201.85,564.72,Single-ply,SBD,M
Boys,99.79,4,Elias Villalobos,San Marcos,93.89,204.12,120.2,238.14,562.45,Single-ply,SBD,M
Boys,99.79,5,Brandon Smith,Killeen Ellison,91.17,195.04,145.15,213.19,553.38,Single-ply,SBD,M
Boys,99.79,6,Curtis Hawkins,Lockhart,94.8,222.26,127.01,204.12,553.38,Single-ply,SBD,M
Boys,99.79,7,Grant Shewmaker,Leander,94.35,204.12,127.01,215.46,546.58,Single-ply,SBD,M
Boys,99.79,8,Marvin Harris,Cedar Park Vista Ridge,97.52,183.7,122.47,208.65,514.83,Single-ply,SBD,M
Boys,99.79,9,Hagen Patterson,Austin Lake Travis,98.88,188.24,117.93,208.65,514.83,Single-ply,SBD,M
Boys,99.79,10,Fidel Estrada,Cedar Park Vista Ridge,98.88,204.12,124.74,172.37,501.22,Single-ply,SBD,M
Boys,99.79,11,Sebastian Rodriguez,Killeen Ellison,97.98,174.63,131.54,185.97,492.15,Single-ply,SBD,M
Boys,99.79,12,Hunter Rhodes,Austin Lake Travis,99.79,188.24,136.08,163.29,487.61,Single-ply,SBD,M
Boys,99.79,13,Paul Crawford,Georgetown East View,97.98,181.44,127.01,167.83,476.27,Single-ply,SBD,M
Boys,99.79,14,Cameron Horton,Georgetown,96.62,170.1,79.38,188.24,437.72,Single-ply,SBD,M
Boys,99.79,15,Brandon Quinterro,Austin Lake Travis,99.79,217.72,158.76,,376.48,Single-ply,SB,M
Boys,99.79,DQ,Jason Disney,Austin Bowie,96.16,195.04,,,,Single-ply,SB,M
Boys,99.79,DQ,Eddie Guzman,Leander Rouse,94.62,,,,,Single-ply,SB,M
Boys,99.79,DQ,Abel Ramirez,Bastrop Cedar Creek,93.89,,,,,Single-ply,SB,M
Boys,99.79,DQ,Kegan Bledsoe,Smithville,95.71,,,,,Single-ply,SB,M
Boys,109.77,1,Lorenzo Martinez,Georgetown,105.23,263.08,145.15,226.8,635.03,Single-ply,SBD,M
Boys,109.77,2,Levi Mair,Lockhart,107.5,242.67,154.22,229.06,625.96,Single-ply,SBD,M
Boys,109.77,3,Will Smith #2,Liberty Hill,104.33,233.6,145.15,208.65,587.4,Single-ply,SBD,M
Boys,109.77,4,Darrell Nix,Pflugerville Connally,105.69,199.58,154.22,217.72,571.53,Single-ply,SBD,M
Boys,109.77,5,Ian Willis,Austin Lake Travis,106.59,213.19,117.93,215.46,546.58,Single-ply,SBD,M
Boys,109.77,6,Grant Schlaht,Lockhart,104.78,226.8,117.93,188.24,532.97,Single-ply,SBD,M
Boys,109.77,7,Cody Ullestad,Georgetown,109.77,197.31,124.74,192.78,514.83,Single-ply,SBD,M
Boys,109.77,8,Andrew Alvarado,Austin Bowie,107.05,183.7,120.2,204.12,508.02,Single-ply,SBD,M
Boys,109.77,9,Cristian Coronado,Austin Bowie,108.41,170.1,127.01,163.29,460.4,Single-ply,SBD,M
Boys,109.77,10,Aaron Johnson,Georgetown,108.86,204.12,104.33,151.95,460.4,Single-ply,SBD,M
Boys,109.77,11,Drake Bartz,Buda Hays,104.78,156.49,97.52,174.63,428.64,Single-ply,SBD,M
Boys,109.77,12,Andrew Flores,Pflugerville Hendrickson,105.69,278.96,145.15,,424.11,Single-ply,SB,M
Boys,109.77,13,Cody Suffield,Georgetown,108.86,167.83,102.06,149.69,419.57,Single-ply,SBD,M
Boys,109.77,14,Christopher Ruiz,Leander,106.59,161.03,86.18,163.29,410.5,Single-ply,SBD,M
Boys,109.77,15,Bailey Rhodes,Buda Hays,101.15,233.6,124.74,,358.34,Single-ply,SB,M
Boys,109.77,16,AJ Bosquez,San Marcos,103.42,120.2,65.77,120.2,306.17,Single-ply,SBD,M
Boys,109.77,DQ,Cody Schindler,La Grange,108.41,183.7,,,,Single-ply,SBD,M
Boys,124.74,1,Cameron Kenney,San Marcos,121.11,263.08,183.7,208.65,655.44,Single-ply,SBD,M
Boys,124.74,2,Rolando Ruiz,Hutto,111.58,251.74,138.35,258.55,648.64,Single-ply,SBD,M
Boys,124.74,3,Chance Williamson,Del Valle,114.67,265.35,158.76,204.12,628.23,Single-ply,SBD,M
Boys,124.74,4,Marin Biletic,Killeen Ellison,119.75,222.26,170.1,235.87,628.23,Single-ply,SBD,M
Boys,124.74,5,Jesse Benavide,San Marcos,112.49,256.28,136.08,215.46,607.81,Single-ply,SBD,M
Boys,124.74,6,Zach Ledwick,La Grange,119.29,231.33,161.03,199.58,591.94,Single-ply,SBD,M
Boys,124.74,7,Garrett Stotts,Austin Lake Travis,114.31,226.8,124.74,217.72,569.26,Single-ply,SBD,M
Boys,124.74,8,Ray Castillo,Bastrop Cedar Creek,114.31,206.38,133.81,213.19,553.38,Single-ply,SBD,M
Boys,124.74,9,Jeremy Rodriguez #1,Bastrop Cedar Creek,114.76,213.19,129.27,204.12,546.58,Single-ply,SBD,M
Boys,124.74,10,Sebastan Garcia,Dripping Springs,122.47,235.87,113.4,192.78,542.04,Single-ply,SBD,M
Boys,124.74,11,Michael White,Austin Bowie,120.2,158.76,142.88,213.19,514.83,Single-ply,SBD,M
Boys,124.74,12,David Lopez,Leander,115.21,183.7,133.81,185.97,503.49,Single-ply,SBD,M
Boys,124.74,13,Josh Hulburt,Georgetown East View,112.94,170.1,92.99,136.08,399.16,Single-ply,SBD,M
Boys,124.74,DQ,Dominic Brown,Georgetown East View,121.11,,,,,Single-ply,SBD,M
Boys,124.74,DQ,D'Andre Clinton,La Grange,112.04,,,,,Single-ply,SBD,M
Boys,124.74,DQ,London Bean,Cedar Park Vista Ridge,120.66,,,,,Single-ply,SBD,M
Boys,124.74+,1,Ray Sedwick,Lockhart,128.37,317.51,197.31,272.16,786.98,Single-ply,SBD,M
Boys,124.74+,2,Ryne Lehman,Lockhart,149.23,251.74,199.58,247.21,698.53,Single-ply,SBD,M
Boys,124.74+,3,Tre Thomas,Pflugerville Hendrickson,162.84,317.51,138.35,242.67,698.53,Single-ply,SBD,M
Boys,124.74+,4,Hayden Washington,Pflugerville Connally,128.37,249.48,120.2,204.12,573.79,Single-ply,SBD,M
Boys,124.74+,5,Eric Cabrera,Pflugerville Connally,126.1,199.58,106.59,204.12,510.29,Single-ply,SBD,M
Boys,124.74+,6,Brice Otto,Luling,130.18,217.72,117.93,174.63,510.29,Single-ply,SBD,M
Boys,124.74+,7,Thomas Stephens,Killeen Ellison,137.89,192.78,124.74,174.63,492.15,Single-ply,SBD,M
Boys,124.74+,8,Anthony Herrera,Del Valle,128.55,176.9,102.06,170.1,449.06,Single-ply,SBD,M
Boys,124.74+,9,Joel Sanchez #1,Luling,138.8,199.58,92.99,149.69,442.25,Single-ply,SBD,M
Boys,124.74+,10,Alen Pinjic,Pflugerville Connally,133.36,145.15,147.42,145.15,437.72,Single-ply,SBD,M
Boys,124.74+,11,Jose Reyes,Georgetown,133.36,217.72,131.54,,349.27,Single-ply,SB,M
Boys,124.74+,DQ,Brian Swift,Luling,126.55,,,,,Single-ply,SB,M
Boys,,NS,Aaron Werlein,Luling,,,,,,Single-ply,SB,M
Boys,,NS,Tyler Gibson,Luling,,,,,,Single-ply,SB,M
Boys,,NS,Christian Rivera,Pflugerville Connally,,,,,,Single-ply,SB,M
Boys,,NS,Isa Colwell,Pflugerville Connally,,,,,,Single-ply,SB,M
Boys,,NS,Jordan Lawrence,Pflugerville Connally,,,,,,Single-ply,SB,M
Boys,,NS,Mitchell Grimm,Liberty Hill,,,,,,Single-ply,SB,M
Boys,,NS,Marcos Johnson,Lockhart,,,,,,Single-ply,SB,M
Boys,,NS,Victor Moya,Jarrell,,,,,,Single-ply,SB,M
Boys,,NS,Geryl McAllister,Killeen Ellison,,,,,,Single-ply,SB,M
Boys,,NS,Cesar Juarez,Geronimo Navarro,,,,,,Single-ply,SB,M
Boys,,NS,Jacob Rodriguez #1,Geronimo Navarro,,,,,,Single-ply,SB,M
Boys,,NS,Seth Kercheville,Liberty Hill,,,,,,Single-ply,SB,M
Boys,,NS,Garrison Mueller,La Grange,,,,,,Single-ply,SB,M
Boys,,NS,Alex Glasier,La Grange,,,,,,Single-ply,SB,M
Boys,,NS,Bralon Hutchinso,La Grange,,,,,,Single-ply,SB,M
Boys,,NS,Tye Hill,Georgetown,,,,,,Single-ply,SB,M
Boys,,NS,Gage Parker,Georgetown,,,,,,Single-ply,SB,M
Boys,,NS,Avery McThompson,Dripping Springs,,,,,,Single-ply,SB,M
Boys,,NS,Steven Alexander,Cedar Park Vista Ridge,,,,,,Single-ply,SB,M
Boys,,NS,Ryan Ritchie,Cedar Park Vista Ridge,,,,,,Single-ply,SB,M
Boys,,NS,Cole Shoemaker,Cedar Park Vista Ridge,,,,,,Single-ply,SB,M
Boys,,NS,Kyle Mealey,Austin Bowie,,,,,,Single-ply,SB,M
Boys,,NS,Christian Head,Austin Lake Travis,,,,,,Single-ply,SB,M
Boys,,NS,Caleb Zene,Austin Anderson,,,,,,Single-ply,SB,M
Boys,,NS,Miyah Woolven,Austin Anderson,,,,,,Single-ply,SB,M
Boys,,NS,Bryce Luster,Austin Bowie,,,,,,Single-ply,SB,M
Boys,,NS,Austin Bewley,Austin Lake Travis,,,,,,Single-ply,SB,M
Boys,,NS,Nate Alvarado,Buda Hays,,,,,,Single-ply,SB,M
Boys,,NS,Blake Borgholthaus,Pflugerville Hendrickson,,,,,,Single-ply,SB,M
Boys,,NS,Collin Anderson,San Marcos,,,,,,Single-ply,SB,M
Boys,,NS,Isaiah Bosquez,San Marcos,,,,,,Single-ply,SB,M
Boys,,NS,Jonathan Arredondo,San Marcos,,,,,,Single-ply,SB,M
Boys,,NS,DaAaron Jackson,Smithville,,,,,,Single-ply,SB,M
Boys,,NS,Joshua Urrutia,San Marcos,,,,,,Single-ply,SB,M
Boys,,NS,Eric Cerda,San Marcos,,,,,,Single-ply,SB,M
Boys,,NS,Bryan Martinez,Taylor,,,,,,Single-ply,SB,M
Boys,,NS,Donavon Mutin,Georgetown East View,,,,,,Single-ply,SB,M
Boys,,NS,Tycom Wright,Taylor,,,,,,Single-ply,SB,M
Boys,,NS,Justis Owens,Hutto,,,,,,Single-ply,SB,M
Boys,,NS,Braden Robersky,La Grange,,,,,,Single-ply,SB,M
Boys,,NS,Austen Brown,Pflugerville Connally,,,,,,Single-ply,SB,M
Boys,,NS,Bobby Limon,Buda Hays,,,,,,Single-ply,SB,M
Boys,,NS,Thomas Mascorro,San Marcos,,190.51,,,,Single-ply,SB,M
