Division,WeightClassKg,Place,Name,Team,BodyweightKg,Best3SquatKg,Best3BenchKg,Best3DeadliftKg,TotalKg,Equipment,Event,Sex,BirthDate
Boys,51.71,1,Eric Melendez,Carrollton Turner,50.35,52.16,29.48,68.04,149.69,Single-ply,SBD,M,
Boys,59.87,1,Andrew Mast,Carrollton Creekview,58.97,129.27,86.18,136.08,351.53,Single-ply,SBD,M,
Boys,59.87,2,Romario Melendez,Carrollton Turner,56.97,92.99,61.23,111.13,265.35,Single-ply,SBD,M,
Boys,59.87,3,Aidan Gray,Carrollton Creekview,59.69,90.72,63.5,102.06,256.28,Single-ply,SBD,M,
Boys,67.13,1,Donovan Smith,Carrollton Turner,66.41,167.83,104.33,199.58,471.74,Single-ply,SBD,M,
Boys,67.13,2,Kasey Nguyen,Carrollton Creekview,67.13,188.24,92.99,190.51,471.74,Single-ply,SBD,M,
Boys,67.13,3,Calvin Nguyen,Carrollton Creekview,65.41,124.74,63.5,129.27,317.51,Single-ply,SBD,M,
Boys,67.13,4,Ashton Nguyen,Carrollton Creekview,62.87,113.4,65.77,136.08,315.25,Single-ply,SBD,M,
Boys,74.84,1,Josiah Robison,Carrollton Creekview,74.84,142.88,102.06,158.76,403.7,Single-ply,SBD,M,
Boys,74.84,DQ,Beck Limon,Carrollton Creekview,73.57,102.06,,,,Single-ply,SBD,M,
Boys,82.1,1,Ryan Jung,Carrollton Creekview,79.92,165.56,104.33,190.51,460.4,Single-ply,SBD,M,
Boys,82.1,2,Edgar Castilla,Carrollton Turner,80.38,88.45,63.5,97.52,249.48,Single-ply,SBD,M,
Boys,89.81,1,Joshua Toyphommarath,Carrollton Creekview,86.18,183.7,122.47,192.78,498.95,Single-ply,SBD,M,
Boys,89.81,2,Julian Arevalo,Carrollton Turner,84.37,165.56,102.06,151.95,419.57,Single-ply,SBD,M,
Boys,89.81,3,Jack Nelson,Carrollton Creekview,88.45,129.27,83.91,142.88,356.07,Single-ply,SBD,M,
Boys,99.79,1,Joel Portillo,Carrollton Turner,94.98,147.42,104.33,154.22,405.97,Single-ply,SBD,M,
Boys,99.79,2,Keolan Harongsemal,Carrollton Creekview,99.79,129.27,92.99,170.1,392.36,Single-ply,SBD,M,
Boys,99.79,3,Josh Marquez,Carrollton Turner,98.7,117.93,77.11,136.08,331.12,Single-ply,SBD,M,
Boys,109.77,1,Isaiah Cabriales,Carrollton Turner,108.23,192.78,122.47,161.03,476.27,Single-ply,SBD,M,
Boys,109.77,2,Kevin Cabrera,Carrollton Creekview,103.06,70.31,40.82,79.38,190.51,Single-ply,SBD,M,
Boys,124.74,1,Tony Baker,Carrollton Creekview,120.2,210.92,124.74,199.58,535.24,Single-ply,SBD,M,
