Division,WeightClassKg,Place,Name,Team,BodyweightKg,Best3SquatKg,Best3BenchKg,Best3DeadliftKg,TotalKg,Equipment,Event,Sex,BirthDate
Boys,51.71,1,Landon Caudle,Maud,50.35,83.91,54.43,95.25,233.6,Single-ply,SBD,M,
Boys,51.71,2,Alex Simpson,Daingerfield,50.8,74.84,47.63,90.72,213.19,Single-ply,SBD,M,
Boys,51.71,3,Matt Watkins,Daingerfield,41.28,52.16,36.29,74.84,163.29,Single-ply,SBD,M,
Boys,55.79,1,Kadin Daniels,Maud,55.34,138.35,83.91,158.76,381.02,Single-ply,SBD,M,
Boys,55.79,2,Devin Espinoza,Gilmer Union Hill,53.98,115.67,58.97,117.93,292.57,Single-ply,SBD,M,
Boys,55.79,3,Seth Hicks,Hughes Springs,52.62,97.52,61.23,102.06,260.82,Single-ply,SBD,M,
Boys,59.87,1,Jace Lindsay,Beckville,58.06,158.76,95.25,176.9,430.91,Single-ply,SBD,M,
Boys,59.87,2,Kaden Barnwell,Hughes Springs,58.97,111.13,79.38,124.74,315.25,Single-ply,SBD,M,
Boys,59.87,DQ,Daniel Dunn,Gilmer Union Hill,58.97,,,,,Single-ply,SBD,M,
Boys,67.13,1,Jared Bickham,Maud,66.22,136.08,74.84,138.35,349.27,Single-ply,SBD,M,
Boys,67.13,2,Cyrus Palmore,Maud,66.22,113.4,81.65,142.88,337.93,Single-ply,SBD,M,
Boys,67.13,3,Jason Mullins,Detroit,60.33,124.74,81.65,113.4,319.78,Single-ply,SBD,M,
Boys,67.13,4,Ethan Ellis,Detroit,63.96,117.93,63.5,131.54,312.98,Single-ply,SBD,M,
Boys,74.84,1,Cruz Hernandez,De Kalb,71.67,208.65,115.67,185.97,510.29,Single-ply,SBD,M,
Boys,74.84,2,Jayke Bass,Gilmer Union Hill,72.57,142.88,120.2,158.76,421.84,Single-ply,SBD,M,
Boys,74.84,3,Bradrion Conkleton,Maud,71.67,147.42,97.52,163.29,408.23,Single-ply,SBD,M,
Boys,74.84,4,Tristin Lee,Maud,73.48,158.76,90.72,156.49,405.97,Single-ply,SBD,M,
Boys,74.84,5,Bryson Hampton,Daingerfield,71.67,142.88,92.99,158.76,394.63,Single-ply,SBD,M,
Boys,74.84,6,Hudson Hampton,Daingerfield,71.21,124.74,83.91,149.69,358.34,Single-ply,SBD,M,
Boys,74.84,7,Carlos Campos,Beckville,72.57,154.22,74.84,129.27,358.34,Single-ply,SBD,M,
Boys,74.84,8,Makaven Overstreet-Hurd,Clarksville,74.84,90.72,77.11,136.08,303.91,Single-ply,SBD,M,
Boys,74.84,9,Benji Rios,Beckville,71.67,106.59,68.04,113.4,288.03,Single-ply,SBD,M,
Boys,82.1,1,Jake Murray,Hughes Springs,78.47,165.56,99.79,170.1,435.45,Single-ply,SBD,M,
Boys,82.1,2,Texan Lancaster,Hughes Springs,80.74,129.27,104.33,147.42,381.02,Single-ply,SBD,M,
Boys,89.81,1,Amar Love,De Kalb,87.54,249.48,138.35,238.14,625.96,Single-ply,SBD,M,
Boys,89.81,2,Brad Parsons,Detroit,87.54,199.58,151.95,197.31,548.85,Single-ply,SBD,M,
Boys,89.81,3,Cole Edwards,Hughes Springs,88,217.72,127.01,204.12,548.85,Single-ply,SBD,M,
Boys,89.81,4,Lynnquavious Baird,Hughes Springs,88,154.22,104.33,149.69,408.23,Single-ply,SBD,M,
Boys,89.81,5,Arie Love,De Kalb,87.54,249.48,133.81,,383.29,Single-ply,SB,M,
Boys,89.81,6,Jonas Parish,Gilmer Union Hill,87.54,127.01,72.57,167.83,367.41,Single-ply,SBD,M,
Boys,89.81,7,Jayden Shelby,Detroit,85.28,145.15,77.11,136.08,358.34,Single-ply,SBD,M,
Boys,99.79,1,Ishmael Allen,Daingerfield,91.17,208.65,117.93,251.74,578.33,Single-ply,SBD,M,
Boys,99.79,2,Payton Yandle,De Kalb,92.99,215.46,122.47,201.85,539.77,Single-ply,SBD,M,
Boys,99.79,3,Patrick Boyd,Hughes Springs,94.35,190.51,127.01,206.38,523.9,Single-ply,SBD,M,
Boys,99.79,4,Dawson Daffern,Maud,91.63,185.97,117.93,172.37,476.27,Single-ply,SBD,M,
Boys,109.77,1,Malik Tatum,Daingerfield,105.69,176.9,92.99,210.92,480.81,Single-ply,SBD,M,
Boys,109.77,2,Oscar Rodríguez,Hughes Springs,101.15,167.83,127.01,163.29,458.13,Single-ply,SBD,M,
Boys,109.77,3,Marlon Hayes,Daingerfield,108.41,142.88,83.91,165.56,392.36,Single-ply,SBD,M,
Boys,124.74,1,Briley Barron,Maud,122.02,188.24,108.86,197.31,494.42,Single-ply,SBD,M,
Boys,124.74,2,Andrew Cormany,Beckville,115.21,174.63,102.06,192.78,469.47,Single-ply,SBD,M,
Boys,124.74,3,Trevor Balk,Maud,115.67,167.83,127.01,167.83,462.66,Single-ply,SBD,M,
Boys,124.74,4,Mikey Lanier,Hughes Springs,113.85,158.76,129.27,170.1,458.13,Single-ply,SBD,M,
Boys,124.74,5,Randall Shivers,Beckville,117.48,181.44,97.52,163.29,442.25,Single-ply,SBD,M,
Boys,124.74,6,Rylee Culpepper,Maud,122.02,124.74,79.38,158.76,362.87,Single-ply,SBD,M,
Boys,139.71,1,Jy'Keelin Frazier,Daingerfield,134.26,158.76,124.74,158.76,442.25,Single-ply,SBD,M,
Boys,139.71,2,Billy Stewart,Clarksville,127.01,127.01,97.52,149.69,374.21,Single-ply,SBD,M,
