Place,Name,Sex,BirthDate,Age,Country,State,Equipment,Division,BodyweightKg,WeightClassKg,Squat1Kg,Squat2Kg,Squat3Kg,Squat4Kg,Best3SquatKg,Bench1Kg,Bench2Kg,Bench3Kg,Best3BenchKg,Deadlift1Kg,Deadlift2Kg,Deadlift3Kg,Best3DeadliftKg,TotalKg,Event
1,Alisha Luna,F,1994-12-06,26,USA,HI,Wraps,Open,51.1,52,155,165,170,,170,75,87.5,92.5,92.5,170,182.5,192.5,192.5,455,SBD
1,Marianna Gasparyan,F,1989-02-25,32,USA,CA,Wraps,Open,55.6,56,240,255,-262.5,,255,125,130,-132.5,130,200,-210,-210,200,585,SBD
2,Anna Vishnyak,F,1984-12-12,36,Russia,,Wraps,Open,53.9,56,165,-175,-175,,165,95,-100,100,100,165,-180,-180,165,430,SBD
1,Cora Mecum,F,2000-04-28,20,USA,CA,Wraps,Open,59.2,60,182.5,-197.5,-200,,182.5,100,112.5,-120,112.5,190,200,-206,200,495,SBD
2,Diana Karen Juárez Ferrer,F,1993-02-03,28,Mexico,,Wraps,Open,59.1,60,185,195,-205,,195,90,95,-102.5,95,180,192.5,200,200,490,SBD
3,Yelena Espinoza,F,1996-08-19,24,USA,MD,Wraps,Open,58.6,60,150,165,-170,,165,90,95,97.5,97.5,-197.5,197.5,-215,197.5,460,SBD
4,Christina Ryan #1,F,1989-07-10,31,USA,IN,Wraps,Open,59.4,60,-155,165,172.5,,172.5,77.5,87.5,95,95,167.5,177.5,-187.5,177.5,445,SBD
1,Jennessa Labbate,F,1994-09-18,26,USA,CA,Wraps,Open,66.3,67.5,205,220,227.5,,227.5,115,125,132.5,132.5,230,245,255.5,255.5,615.5,SBD
2,Chloe Lansing,F,1991-05-24,29,USA,IA,Wraps,Open,66.8,67.5,232.5,-247.5,-260,,232.5,105,110,-115,110,225,237.5,247.5,247.5,590,SBD
3,Haley Hill,F,1997-03-21,24,USA,MO,Wraps,Open,62.5,67.5,192.5,202.5,-205,,202.5,117.5,122.5,125,125,192.5,205,212.5,212.5,540,SBD
4,Suzanne Davis,F,1971-06-06,49,USA,AZ,Wraps,Open,65.1,67.5,-197.5,-197.5,197.5,,197.5,107.5,-117.5,-117.5,107.5,-207.5,217.5,-227.5,217.5,522.5,SBD
5,Bria Robinson,F,1993-05-18,27,USA,CA,Wraps,Open,66.2,67.5,-207.5,-207.5,207.5,,207.5,87.5,95,100,100,205,215,-225,215,522.5,SBD
6,Tasha Whelan,F,1984-11-17,36,USA,WA,Wraps,Open,64.8,67.5,-180,-180,180,,180,105,110,-112.5,110,202.5,220,-230,220,510,SBD
7,Brooke Giaccio,F,1980-08-13,40,USA,AR,Wraps,Open,66.3,67.5,182.5,195,205,,205,92.5,97.5,102.5,102.5,185,197.5,-207.5,197.5,505,SBD
8,Kristen Coleman,F,1990-04-06,31,USA,CO,Wraps,Open,62.8,67.5,160,-172.5,175,,175,95,97.5,-100,97.5,190,200,-205,200,472.5,SBD
1,Hunter Henderson #1,F,1994-11-17,26,USA,MO,Wraps,Open,74.3,75,272.5,287.5,295,,295,137.5,147.5,-152.5,147.5,260,-267.5,-267.5,260,702.5,SBD
2,Ashley Garcia #1,F,1981-05-26,39,USA,TX,Wraps,Open,73.7,75,-250,255,270,,270,137.5,142.5,-147.5,142.5,242.5,-257.5,257.5,257.5,670,SBD
3,Nicole Dunlap,F,1986-11-11,34,USA,TN,Wraps,Open,74.5,75,217.5,227.5,-230,,227.5,110,115,-117.5,115,240,247.5,-252.5,247.5,590,SBD
4,Christina Sisk,F,1986-02-24,35,USA,CA,Wraps,Open,74.6,75,200,-212.5,-212.5,,200,110,115,120,120,195,205,-210,205,525,SBD
5,Allie Rosales,F,1990-10-10,30,USA,TX,Wraps,Open,75,75,-190,-202.5,202.5,,202.5,95,105,-107.5,105,182.5,197.5,-207.5,197.5,505,SBD
6,Caitlin King,F,1994-10-31,26,USA,TX,Wraps,Open,73.4,75,180,-192.5,-195,,180,100,105,-110,105,192.5,205,-215,205,490,SBD
7,Jean-Ann Stewart,F,1962-05-27,58,USA,IL,Wraps,Open,72.7,75,-195,195,-210,,195,110,-117.5,,110,145,165,182.5,182.5,487.5,SBD
8,Nikki Merson,F,1971-09-15,49,USA,IL,Raw,Open,72.7,75,140,150,155,,155,97.5,105,110,110,157.5,170,182.5,182.5,447.5,SBD
DQ,Rachel Torres,F,1997-05-30,23,USA,NY,Wraps,Open,74.5,75,-245,-245,-245,,,127.5,137.5,-140,137.5,245,-267.5,-267.5,245,,SBD
1,Samantha Rice,F,1990-06-25,30,USA,TX,Wraps,Open,85.8,90,240,252.5,260,,260,135,140,145,145,240,252.5,262.5,262.5,667.5,SBD
2,Sherine Marcelle,F,1992-07-01,28,USA,NY,Wraps,Open,88.8,90,-272.5,272.5,-292.5,,272.5,112.5,117.5,-122.5,117.5,227.5,-240,-240,227.5,617.5,SBD
3,Tenaya Tuteur,F,1989-07-14,31,USA,CA,Wraps,Open,89.9,90,220,-232.5,232.5,,232.5,120,130,-137.5,130,220,237.5,-242.5,237.5,600,SBD
4,Emma Jarman,F,1986-08-26,34,USA,OH,Raw,Open,88.1,90,190,-205,205,,205,132.5,-140,-140,132.5,227.5,245,255,255,592.5,SBD
5,Britt Holloway,F,1994-09-09,26,USA,OR,Wraps,Open,88.4,90,207.5,217.5,-227.5,,217.5,107.5,-110,-110,107.5,207.5,-217.5,-217.5,207.5,532.5,SBD
1,Tamara Walcott,F,1983-12-03,37,USA,MD,Wraps,Open,131.9,90+,242.5,-255,265,,265,137.5,145,-150,145,240,257.5,272.5,272.5,682.5,SBD
2,Sara Schiff,F,1975-02-10,46,USA,CA,Wraps,Open,110.8,90+,-205,217.5,235,,235,120,130,,130,265,277.5,287,287,652,SBD
3,Amber Hansen,F,1989-04-04,32,USA,VA,Wraps,Open,94.7,90+,-227.5,227.5,240,,240,137.5,147.5,-155,147.5,227.5,237.5,-240,237.5,625,SBD
DQ,Angie Becker,F,1977-08-25,43,USA,FL,Wraps,Open,110.3,90+,-245,245,-267.5,,245,,,,,,,,,,SBD
1,Gabriel Vega,M,1995-10-19,25,USA,MN,Wraps,Open,120.6,125,345,365,-377.5,,365,195,205,-215,205,312.5,327.5,-337.5,327.5,897.5,SBD
1,Fardin Ahmed,M,1998-06-09,22,USA,VA,Wraps,Open,67.3,67.5,235,250,-260,,250,135,142.5,147.5,147.5,245,260,275,275,672.5,SBD
2,Vincent Falzetta,M,1997-07-14,23,USA,CO,Wraps,Open,66.9,67.5,-235,235,-245,,235,140,-145,145,145,267.5,-280,-280,267.5,647.5,SBD
3,Richard Navarra,M,1991-03-05,30,USA,CA,Wraps,Open,65.8,67.5,-232.5,232.5,-242.5,,232.5,142.5,152.5,157.5,157.5,237.5,-245,-245,237.5,627.5,SBD
4,Jesse Zambrano,M,1988-02-14,33,USA,TX,Wraps,Open,66.2,67.5,225,-237.5,-237.5,,225,155,165,-170,165,225,-232.5,-232.5,225,615,SBD
1,Keith Correa,M,1996-04-10,25,USA,CA,Wraps,Open,74.3,75,267.5,285,-300,,285,155,165,167.5,167.5,-320,335,-350,335,787.5,SBD
2,Edgar Acevedo,M,1995-11-10,25,USA,TX,Wraps,Open,74,75,285,-300,-300,,285,172.5,-180,180,180,275,282.5,-292.5,282.5,747.5,SBD
1,Blake Lehew,M,1995-07-25,25,USA,TX,Wraps,Open,82,82.5,320,340,-350,,340,200,215,-227.5,215,340,355,-367.5,355,910,SBD
2,Maliek Derstine,M,1988-06-01,32,USA,TX,Wraps,Open,81.2,82.5,335,360,-371,,360,212.5,220,-227.5,220,290,320,-332.5,320,900,SBD
3,Rostislav Petkov,M,1988-12-12,32,USA,NV,Wraps,Open,80.8,82.5,320,340,350,,350,192.5,197.5,202.5,202.5,320,340,-357.5,340,892.5,SBD
4,Micah Marino,M,1990-10-28,30,USA,NV,Wraps,Open,82.1,82.5,302.5,-320,-320,,302.5,192.5,202.5,,202.5,327.5,342.5,-357.5,342.5,847.5,SBD
5,Nick Onega,M,1998-07-22,22,USA,OH,Wraps,Open,80.6,82.5,-292.5,292.5,320,,320,185,-192.5,-192.5,185,287.5,-307.5,-317.5,287.5,792.5,SBD
DQ,Roy Glenn,M,1990-07-16,30,USA,CA,Wraps,Open,80.9,82.5,305,320,-325,,320,180,-185,-185,180,-305,-305,-305,,,SBD
DQ,David Thompson,M,1992-12-14,28,USA,IA,Wraps,Open,81.1,82.5,-305,-312.5,,,,185,-192.5,,185,-287.5,,,,,SBD
1,Chad Penson,M,1992-06-13,28,USA,CA,Wraps,Open,88.5,90,370,393,400,,400,220,232.5,-235,232.5,347.5,365,-372.5,365,997.5,SBD
2,John Haack,M,1993-02-01,28,USA,CA,Raw,Open,90,90,302.5,322.5,337.5,,337.5,232.5,252.5,262.5,262.5,370,-400,-400,370,970,SBD
3,Charles Dunkelman,M,1994-12-15,26,USA,CO,Wraps,Open,89.3,90,340,355,-367.5,,355,210,217.5,225,225,295,-305,-305,295,875,SBD
4,Devon Porter,M,1998-02-11,23,USA,SC,Wraps,Open,89.1,90,-300,300,320,,320,-187.5,187.5,-190,187.5,317.5,332.5,-347.5,332.5,840,SBD
5,James Mapp Jr,M,1995-05-03,25,USA,MD,Wraps,Open,88.5,90,272.5,-285,285,,285,180,187.5,-192.5,187.5,350,-367.5,-372.5,350,822.5,SBD
1,Ranson Lee,M,1990-12-11,30,USA,WA,Wraps,Open,98,100,-360,360,-387.5,,360,222.5,-235,-237.5,222.5,330,-352.5,-352.5,330,912.5,SBD
2,Rory Payne,M,1988-07-28,32,USA,TN,Wraps,Open,98.6,100,305,327.5,350,,350,202.5,217.5,227.5,227.5,277.5,300,317.5,317.5,895,SBD
3,Edward Blair,M,1995-01-19,26,USA,IL,Wraps,Open,99.7,100,340,357.5,365,,365,235,250,-255,250,272.5,-292.5,-292.5,272.5,887.5,SBD
1,Phillip Herndon,M,1995-05-21,25,USA,PA,Wraps,Open,108.3,110,390,415,-425,,415,200,,,200,340,362.5,367.5,367.5,982.5,SBD
2,Jordan Faria,M,1994-05-03,26,USA,FL,Wraps,Open,108.7,110,340,365,372.5,,372.5,225,237.5,242.5,242.5,310,340,-347.5,340,955,SBD
3,Daniel Clancy,M,1985-07-14,35,USA,CA,Wraps,Open,108.7,110,312.5,327.5,-345,,327.5,187.5,197.5,-205,197.5,347.5,367.5,387.5,387.5,912.5,SBD
4,Justin Cherocci,M,1992-06-23,28,USA,MI,Wraps,Open,109.5,110,365,-385,-385,,365,205,217.5,-220,217.5,320,-335,-335,320,902.5,SBD
5,Houston Woods,M,1993-04-14,28,USA,OH,Wraps,Open,101.4,110,-307.5,-307.5,317.5,,317.5,187.5,202.5,-207.5,202.5,317.5,350,-370,350,870,SBD
1,Justin Jackson #1,M,1985-10-17,35,USA,IN,Wraps,Open,122.9,125,400,417.5,425,,425,250,260,-270,260,-340,340,,340,1025,SBD
2,Wacey Coleman,M,1987-08-01,33,USA,CO,Wraps,Open,118.1,125,345,-362.5,362.5,-372.5,362.5,192.5,210,-215,210,-365,365,380,380,952.5,SBD
3,Dustin Kueck,M,1987-08-25,33,USA,TX,Wraps,Open,124.2,125,330,342.5,365,,365,240,252.5,-272.5,252.5,312.5,322.5,327.5,327.5,945,SBD
4,Luke Uribe,M,1980-06-19,40,USA,IA,Wraps,Open,120.3,125,-400,400,-417.5,,400,215,227.5,-240,227.5,287.5,305,-317.5,305,932.5,SBD
5,Nathan Brandhorst,M,1993-09-16,27,USA,WA,Wraps,Open,120.9,125,-355,355,-387.5,,355,205,-220,,205,332.5,352.5,,352.5,912.5,SBD
1,Marcus Leoni,M,1991-11-04,29,USA,FL,Wraps,Open,138.4,140,360,380,400,,400,230,240,-250,240,360,380,-400,380,1020,SBD
2,Josh Gregory,M,1994-01-31,27,USA,KY,Wraps,Open,129.3,140,340,362.5,380,,380,225,232.5,-242.5,232.5,352.5,367.5,377.5,377.5,990,SBD
3,Nick Best,M,1968-11-03,52,USA,NV,Wraps,Open,138.4,140,340,-370,370,,370,205,220,-230,220,330,-372.5,,330,920,SBD
1,Daniel Bell #1,M,1986-09-22,34,USA,FL,Wraps,Open,175.5,140+,465,485,505,,505,260,272.5,275,275,390,-410,-410,390,1170,SBD
2,Thomas Davis #1,M,1992-07-21,28,USA,IN,Raw,Open,186.6,140+,317.5,342.5,365,,365,287.5,317.5,-325,317.5,342.5,365,-410,365,1047.5,SBD
3,Craig Foster,M,1988-10-05,32,USA,FL,Raw,Open,167.9,140+,415,442.5,455,,455,245,257.5,265,265,-290,302.5,-325,302.5,1022.5,SBD
4,Tyler Obringer,M,1991-10-17,29,USA,OH,Wraps,Open,155.2,140+,400,-430,-430,,400,220,232.5,,232.5,340,365,-382.5,365,997.5,SBD
