Version 4
SHEET 1 880 680
WIRE 64 -112 -208 -112
WIRE 176 -112 64 -112
WIRE -208 -64 -208 -112
WIRE 64 -48 64 -112
WIRE 400 0 272 0
WIRE -208 32 -208 16
WIRE 176 48 176 -112
WIRE 64 64 64 32
WIRE 144 64 64 64
WIRE 272 80 272 0
WIRE 272 80 208 80
WIRE 400 80 272 80
WIRE 144 96 -208 96
WIRE -208 128 -208 96
WIRE 64 176 64 64
WIRE 80 176 64 176
WIRE 176 176 176 112
WIRE 176 176 160 176
WIRE 176 208 176 176
WIRE -208 224 -208 208
FLAG -208 224 0
FLAG -208 32 0
FLAG 400 80 LED_indicators
IOPIN 400 80 Out
FLAG 400 0 Pi
IOPIN 400 0 Out
FLAG 176 208 0
SYMBOL Opamps\\OP747 176 16 R0
SYMATTR InstName U2
SYMBOL voltage -208 -80 R0
WINDOW 123 0 0 Left 0
WINDOW 39 0 0 Left 0
SYMATTR InstName Power_Regulator
SYMATTR Value 3.3
SYMBOL voltage -208 112 R0
WINDOW 123 0 0 Left 0
WINDOW 39 0 0 Left 0
SYMATTR InstName IR_Sensor
SYMATTR Value PULSE(0 3.3 0 0.25 0.25 1 2)
SYMBOL res 176 160 R90
WINDOW 0 0 56 VBottom 2
WINDOW 3 32 56 VTop 2
SYMATTR InstName R1
SYMATTR Value 1k
SYMBOL res 48 -64 R0
SYMATTR InstName R2
SYMATTR Value 1k
TEXT -274 294 Left 2 !.tran 0 10 1 0.1
RECTANGLE Normal -32 256 -320 80 2
