EESchema Schematic File Version 4
EELAYER 30 0
EELAYER END
$Descr A4 11693 8268
encoding utf-8
Sheet 1 1
Title ""
Date ""
Rev ""
Comp ""
Comment1 ""
Comment2 ""
Comment3 ""
Comment4 ""
$EndDescr
$Comp
L Device:R_US R1
U 1 1 60B9EE21
P 4750 3250
F 0 "R1" V 4545 3250 50  0000 C CNN
F 1 "80" V 4636 3250 50  0000 C CNN
F 2 "Resistor_THT:R_Axial_DIN0309_L9.0mm_D3.2mm_P5.08mm_Vertical" V 4790 3240 50  0001 C CNN
F 3 "~" H 4750 3250 50  0001 C CNN
	1    4750 3250
	0    1    1    0   
$EndComp
$Comp
L Device:LED D1
U 1 1 60BA39A5
P 5300 3250
F 0 "D1" H 5293 2995 50  0000 C CNN
F 1 "NSCW100" H 5293 3086 50  0000 C CNN
F 2 "LED_THT:LED_D3.0mm" H 5300 3250 50  0001 C CNN
F 3 "~" H 5300 3250 50  0001 C CNN
	1    5300 3250
	-1   0    0    1   
$EndComp
$Comp
L power:GND #PWR01
U 1 1 60BA5108
P 5900 3300
F 0 "#PWR01" H 5900 3050 50  0001 C CNN
F 1 "GND" H 5905 3127 50  0000 C CNN
F 2 "" H 5900 3300 50  0001 C CNN
F 3 "" H 5900 3300 50  0001 C CNN
	1    5900 3300
	1    0    0    -1  
$EndComp
Wire Wire Line
	4900 3250 5150 3250
Wire Wire Line
	5450 3250 5900 3250
Wire Wire Line
	5900 3250 5900 3300
Wire Wire Line
	4600 3250 4250 3250
Text GLabel 4250 3250 0    50   Input ~ 0
GPIO_LED_1
$Comp
L Device:R_US R2
U 1 1 60BA9A80
P 4750 3700
F 0 "R2" V 4545 3700 50  0000 C CNN
F 1 "80" V 4636 3700 50  0000 C CNN
F 2 "Resistor_THT:R_Axial_DIN0309_L9.0mm_D3.2mm_P5.08mm_Vertical" V 4790 3690 50  0001 C CNN
F 3 "~" H 4750 3700 50  0001 C CNN
	1    4750 3700
	0    1    1    0   
$EndComp
$Comp
L Device:LED D2
U 1 1 60BA9A86
P 5300 3700
F 0 "D2" H 5293 3445 50  0000 C CNN
F 1 "NSCW100" H 5293 3536 50  0000 C CNN
F 2 "LED_THT:LED_D3.0mm" H 5300 3700 50  0001 C CNN
F 3 "~" H 5300 3700 50  0001 C CNN
	1    5300 3700
	-1   0    0    1   
$EndComp
$Comp
L power:GND #PWR02
U 1 1 60BA9A8C
P 5900 3750
F 0 "#PWR02" H 5900 3500 50  0001 C CNN
F 1 "GND" H 5905 3577 50  0000 C CNN
F 2 "" H 5900 3750 50  0001 C CNN
F 3 "" H 5900 3750 50  0001 C CNN
	1    5900 3750
	1    0    0    -1  
$EndComp
Wire Wire Line
	4900 3700 5150 3700
Wire Wire Line
	5450 3700 5900 3700
Wire Wire Line
	5900 3700 5900 3750
Wire Wire Line
	4600 3700 4250 3700
Text GLabel 4250 3700 0    50   Input ~ 0
GPIO_LED_2
$Comp
L Device:R_US R3
U 1 1 60BAB0B7
P 4750 4150
F 0 "R3" V 4545 4150 50  0000 C CNN
F 1 "80" V 4636 4150 50  0000 C CNN
F 2 "Resistor_THT:R_Axial_DIN0309_L9.0mm_D3.2mm_P5.08mm_Vertical" V 4790 4140 50  0001 C CNN
F 3 "~" H 4750 4150 50  0001 C CNN
	1    4750 4150
	0    1    1    0   
$EndComp
$Comp
L Device:LED D3
U 1 1 60BAB0BD
P 5300 4150
F 0 "D3" H 5293 3895 50  0000 C CNN
F 1 "NSCW100" H 5293 3986 50  0000 C CNN
F 2 "LED_THT:LED_D3.0mm" H 5300 4150 50  0001 C CNN
F 3 "~" H 5300 4150 50  0001 C CNN
	1    5300 4150
	-1   0    0    1   
$EndComp
$Comp
L power:GND #PWR03
U 1 1 60BAB0C3
P 5900 4200
F 0 "#PWR03" H 5900 3950 50  0001 C CNN
F 1 "GND" H 5905 4027 50  0000 C CNN
F 2 "" H 5900 4200 50  0001 C CNN
F 3 "" H 5900 4200 50  0001 C CNN
	1    5900 4200
	1    0    0    -1  
$EndComp
Wire Wire Line
	4900 4150 5150 4150
Wire Wire Line
	5450 4150 5900 4150
Wire Wire Line
	5900 4150 5900 4200
Wire Wire Line
	4600 4150 4250 4150
Text GLabel 4250 4150 0    50   Input ~ 0
GPIO_LED_3
$Comp
L Device:R_US R4
U 1 1 60BAD7CB
P 4750 4600
F 0 "R4" V 4545 4600 50  0000 C CNN
F 1 "80" V 4636 4600 50  0000 C CNN
F 2 "Resistor_THT:R_Axial_DIN0309_L9.0mm_D3.2mm_P5.08mm_Vertical" V 4790 4590 50  0001 C CNN
F 3 "~" H 4750 4600 50  0001 C CNN
	1    4750 4600
	0    1    1    0   
$EndComp
$Comp
L Device:LED D4
U 1 1 60BAD7D1
P 5300 4600
F 0 "D4" H 5293 4345 50  0000 C CNN
F 1 "NSCW100" H 5293 4436 50  0000 C CNN
F 2 "LED_THT:LED_D3.0mm" H 5300 4600 50  0001 C CNN
F 3 "~" H 5300 4600 50  0001 C CNN
	1    5300 4600
	-1   0    0    1   
$EndComp
$Comp
L power:GND #PWR04
U 1 1 60BAD7D7
P 5900 4650
F 0 "#PWR04" H 5900 4400 50  0001 C CNN
F 1 "GND" H 5905 4477 50  0000 C CNN
F 2 "" H 5900 4650 50  0001 C CNN
F 3 "" H 5900 4650 50  0001 C CNN
	1    5900 4650
	1    0    0    -1  
$EndComp
Wire Wire Line
	4900 4600 5150 4600
Wire Wire Line
	5450 4600 5900 4600
Wire Wire Line
	5900 4600 5900 4650
Wire Wire Line
	4600 4600 4250 4600
Text GLabel 4250 4600 0    50   Input ~ 0
GPIO_LED_4
$EndSCHEMATC
