EESchema Schematic File Version 4
EELAYER 30 0
EELAYER END
$Descr A4 11693 8268
encoding utf-8
Sheet 1 1
Title "Raspberry Pi Zero (W) uHAT Template Board"
Date "2019-02-28"
Rev "1.0"
Comp ""
Comment1 "This Schematic is licensed under MIT Open Source License."
Comment2 ""
Comment3 ""
Comment4 ""
$EndDescr
$Comp
L Connector_Generic:Conn_02x20_Odd_Even J5
U 1 1 5C77771F
P 6950 4250
F 0 "J5" H 7000 5367 50  0000 C CNN
F 1 "GPIO_CONNECTOR" H 7000 5276 50  0000 C CNN
F 2 "lib:PinSocket_2x20_P2.54mm_Vertical_Centered_Anchor" H 6950 4250 50  0001 C CNN
F 3 "~" H 6950 4250 50  0001 C CNN
	1    6950 4250
	1    0    0    -1  
$EndComp
Wire Wire Line
	6750 3750 6550 3750
Wire Wire Line
	6550 3750 6550 4550
Wire Wire Line
	6750 4550 6550 4550
Connection ~ 6550 4550
Wire Wire Line
	6550 4550 6550 5250
Wire Wire Line
	6750 5250 6550 5250
Wire Wire Line
	7250 3550 7450 3550
Wire Wire Line
	7450 3550 7450 3950
Wire Wire Line
	7250 3950 7450 3950
Connection ~ 7450 3950
Wire Wire Line
	7450 3950 7450 4250
Wire Wire Line
	7250 4250 7450 4250
Connection ~ 7450 4250
Wire Wire Line
	7250 4750 7450 4750
Wire Wire Line
	7450 4250 7450 4750
Connection ~ 7450 4750
Wire Wire Line
	7450 4750 7450 4950
Wire Wire Line
	7250 4950 7450 4950
Connection ~ 7450 4950
Wire Wire Line
	7450 4950 7450 5400
Text Label 5800 3450 0    50   ~ 0
GPIO2_SDA1
Text Label 5800 3550 0    50   ~ 0
GPIO3_SCL1
Text Label 5800 3650 0    50   ~ 0
GPIO4_GPIO_GCLK
Text Label 5800 3850 0    50   ~ 0
GPIO17_GEN0
Text Label 5800 3950 0    50   ~ 0
GPIO27_GEN2
Text Label 5800 4050 0    50   ~ 0
GPIO22_GEN3
Text Label 5800 4250 0    50   ~ 0
GPIO10_SPI_MOSI
Wire Wire Line
	5700 4250 6750 4250
Wire Wire Line
	5700 4350 6750 4350
Wire Wire Line
	5700 4450 6750 4450
Wire Wire Line
	5700 4650 6750 4650
Wire Wire Line
	5700 4050 6750 4050
Wire Wire Line
	5700 3950 6750 3950
Wire Wire Line
	5700 3850 6750 3850
Text Label 5800 4350 0    50   ~ 0
GPIO9_SPI_MISO
Text Label 5800 4450 0    50   ~ 0
GPIO11_SPI_SCLK
Text Label 5800 4650 0    50   ~ 0
ID_SD
Text Label 5800 4750 0    50   ~ 0
GPIO5
Text Label 5800 4850 0    50   ~ 0
GPIO6
Text Label 5800 4950 0    50   ~ 0
GPIO13
Text Label 5800 5050 0    50   ~ 0
GPIO19
Text Label 5800 5150 0    50   ~ 0
GPIO26
NoConn ~ 5700 3550
NoConn ~ 5700 3850
NoConn ~ 5700 3950
NoConn ~ 5700 4050
NoConn ~ 5700 4250
NoConn ~ 5700 4350
NoConn ~ 5700 4450
NoConn ~ 5700 4650
Text Label 7600 3650 0    50   ~ 0
GPIO14_TXD0
Text Label 7600 3750 0    50   ~ 0
GPIO15_RXD0
Text Label 7600 3850 0    50   ~ 0
GPIO18_GEN1
Text Label 7600 4050 0    50   ~ 0
GPIO23_GEN4
Text Label 7600 4150 0    50   ~ 0
GPIO24_GEN5
Text Label 7600 4350 0    50   ~ 0
GPIO25_GEN6
Text Label 7600 4450 0    50   ~ 0
GPIO8_SPI_CE0_N
Text Label 7600 4550 0    50   ~ 0
GPIO7_SPI_CE1_N
Wire Wire Line
	7250 4450 8300 4450
Wire Wire Line
	7250 4550 8300 4550
Text Label 7600 4650 0    50   ~ 0
ID_SC
Text Label 7600 4850 0    50   ~ 0
GPIO12
Text Label 7600 5050 0    50   ~ 0
GPIO16
Text Label 7600 5150 0    50   ~ 0
GPIO20
Text Label 7600 5250 0    50   ~ 0
GPIO21
Wire Wire Line
	7250 3650 8300 3650
Wire Wire Line
	7250 3750 8300 3750
Wire Wire Line
	7250 3850 8300 3850
Wire Wire Line
	7250 4050 8300 4050
Wire Wire Line
	7250 4150 8300 4150
Wire Wire Line
	7250 4350 8300 4350
Wire Wire Line
	7250 4650 8300 4650
Wire Wire Line
	7250 4850 8300 4850
Wire Wire Line
	7250 5050 8300 5050
Wire Wire Line
	7250 5150 8300 5150
NoConn ~ 8300 3650
NoConn ~ 8300 3750
NoConn ~ 8300 3850
NoConn ~ 8300 4050
NoConn ~ 8300 4150
NoConn ~ 8300 4350
NoConn ~ 8300 4450
NoConn ~ 8300 4550
NoConn ~ 8300 4650
NoConn ~ 8300 4850
NoConn ~ 8300 5050
NoConn ~ 8300 5150
NoConn ~ 8300 5250
Wire Wire Line
	7250 5250 8300 5250
$Comp
L Mechanical:MountingHole H1
U 1 1 5C7C4C81
P 6050 6750
F 0 "H1" H 6150 6796 50  0000 L CNN
F 1 "MountingHole" H 6150 6705 50  0000 L CNN
F 2 "lib:MountingHole_2.7mm_M2.5_uHAT_RPi" H 6050 6750 50  0001 C CNN
F 3 "~" H 6050 6750 50  0001 C CNN
	1    6050 6750
	1    0    0    -1  
$EndComp
$Comp
L Mechanical:MountingHole H2
U 1 1 5C7C7FBC
P 6050 6950
F 0 "H2" H 6150 6996 50  0000 L CNN
F 1 "MountingHole" H 6150 6905 50  0000 L CNN
F 2 "lib:MountingHole_2.7mm_M2.5_uHAT_RPi" H 6050 6950 50  0001 C CNN
F 3 "~" H 6050 6950 50  0001 C CNN
	1    6050 6950
	1    0    0    -1  
$EndComp
$Comp
L Mechanical:MountingHole H3
U 1 1 5C7C8014
P 6050 7150
F 0 "H3" H 6150 7196 50  0000 L CNN
F 1 "MountingHole" H 6150 7105 50  0000 L CNN
F 2 "lib:MountingHole_2.7mm_M2.5_uHAT_RPi" H 6050 7150 50  0001 C CNN
F 3 "~" H 6050 7150 50  0001 C CNN
	1    6050 7150
	1    0    0    -1  
$EndComp
$Comp
L Mechanical:MountingHole H4
U 1 1 5C7C8030
P 6050 7350
F 0 "H4" H 6150 7396 50  0000 L CNN
F 1 "MountingHole" H 6150 7305 50  0000 L CNN
F 2 "lib:MountingHole_2.7mm_M2.5_uHAT_RPi" H 6050 7350 50  0001 C CNN
F 3 "~" H 6050 7350 50  0001 C CNN
	1    6050 7350
	1    0    0    -1  
$EndComp
Text GLabel 3750 800  2    50   Input ~ 0
12V_Vcc
Wire Wire Line
	2350 800  3550 800 
$Comp
L Regulator_Linear:LT1085-3.3 U1
U 1 1 60BA150C
P 2950 1150
F 0 "U1" H 2950 1392 50  0000 C CNN
F 1 "LT1085-3.3" H 2950 1301 50  0000 C CNN
F 2 "Package_TO_SOT_THT:TO-220-3_Vertical" H 2950 1400 50  0001 C CIN
F 3 "https://www.analog.com/media/en/technical-documentation/data-sheets/1083ffe.pdf" H 2950 1150 50  0001 C CNN
	1    2950 1150
	1    0    0    -1  
$EndComp
$Comp
L Device:CP C1
U 1 1 60BA444D
P 2350 1400
F 0 "C1" H 2468 1446 50  0000 L CNN
F 1 "1u" H 2468 1355 50  0000 L CNN
F 2 "Capacitor_THT:CP_Radial_D4.0mm_P1.50mm" H 2388 1250 50  0001 C CNN
F 3 "~" H 2350 1400 50  0001 C CNN
	1    2350 1400
	1    0    0    -1  
$EndComp
$Comp
L Device:CP C2
U 1 1 60BA6D04
P 3550 1400
F 0 "C2" H 3668 1446 50  0000 L CNN
F 1 "10u" H 3668 1355 50  0000 L CNN
F 2 "Capacitor_THT:CP_Radial_D4.0mm_P1.50mm" H 3588 1250 50  0001 C CNN
F 3 "~" H 3550 1400 50  0001 C CNN
	1    3550 1400
	1    0    0    -1  
$EndComp
$Comp
L Device:R_US R1
U 1 1 60BA8DB2
P 1200 1400
F 0 "R1" H 1132 1354 50  0000 R CNN
F 1 "27" H 1132 1445 50  0000 R CNN
F 2 "Resistor_THT:R_Axial_DIN0204_L3.6mm_D1.6mm_P2.54mm_Vertical" V 1240 1390 50  0001 C CNN
F 3 "~" H 1200 1400 50  0001 C CNN
	1    1200 1400
	-1   0    0    1   
$EndComp
Wire Wire Line
	2000 1150 2350 1150
Wire Wire Line
	2350 1250 2350 1150
Connection ~ 2350 1150
Wire Wire Line
	2350 1150 2650 1150
$Comp
L power:GND #PWR04
U 1 1 60BAA799
P 1800 2000
F 0 "#PWR04" H 1800 1750 50  0001 C CNN
F 1 "GND" H 1805 1827 50  0000 C CNN
F 2 "" H 1800 2000 50  0001 C CNN
F 3 "" H 1800 2000 50  0001 C CNN
	1    1800 2000
	1    0    0    -1  
$EndComp
$Comp
L power:GND #PWR07
U 1 1 60BAB553
P 2950 1700
F 0 "#PWR07" H 2950 1450 50  0001 C CNN
F 1 "GND" H 2955 1527 50  0000 C CNN
F 2 "" H 2950 1700 50  0001 C CNN
F 3 "" H 2950 1700 50  0001 C CNN
	1    2950 1700
	1    0    0    -1  
$EndComp
Wire Wire Line
	1800 1950 1800 2000
Wire Wire Line
	1200 1550 1800 1550
Wire Wire Line
	1800 1450 1800 1550
Connection ~ 1800 1550
Wire Wire Line
	1800 1550 1800 1650
Wire Wire Line
	1200 1250 1200 1150
Wire Wire Line
	1200 1150 1600 1150
Wire Wire Line
	2350 1550 2350 1600
Wire Wire Line
	2350 1600 2950 1600
Wire Wire Line
	3550 1600 3550 1550
Wire Wire Line
	2950 1450 2950 1600
Connection ~ 2950 1600
Wire Wire Line
	2950 1600 3550 1600
Wire Wire Line
	2950 1700 2950 1600
Wire Wire Line
	3250 1150 3550 1150
Wire Wire Line
	3550 1150 3550 1250
Wire Wire Line
	3550 1150 3750 1150
Connection ~ 3550 1150
Wire Wire Line
	2350 800  2350 1150
Text GLabel 3750 1150 2    50   Input ~ 0
3V3_Vcc
Wire Wire Line
	1200 1150 1050 1150
Connection ~ 1200 1150
Text GLabel 1050 1150 0    50   Input ~ 0
Power_Input
$Comp
L Device:D_Zener D1
U 1 1 60BA2379
P 1800 1800
F 0 "D1" V 1754 1880 50  0000 L CNN
F 1 "BZX85C12" V 1845 1880 50  0000 L CNN
F 2 "Diode_THT:D_5W_P5.08mm_Vertical_AnodeUp" H 1800 1800 50  0001 C CNN
F 3 "~" H 1800 1800 50  0001 C CNN
	1    1800 1800
	0    1    1    0   
$EndComp
$Comp
L Device:R_US R4
U 1 1 60B9EE21
P 9900 850
F 0 "R4" V 9695 850 50  0000 C CNN
F 1 "80" V 9786 850 50  0000 C CNN
F 2 "Resistor_THT:R_Axial_DIN0204_L3.6mm_D1.6mm_P2.54mm_Vertical" V 9940 840 50  0001 C CNN
F 3 "~" H 9900 850 50  0001 C CNN
	1    9900 850 
	0    1    1    0   
$EndComp
$Comp
L Device:LED D2
U 1 1 60BA39A5
P 10450 850
F 0 "D2" H 10443 595 50  0000 C CNN
F 1 "NSCW100" H 10443 686 50  0000 C CNN
F 2 "LED_THT:LED_D3.0mm" H 10450 850 50  0001 C CNN
F 3 "~" H 10450 850 50  0001 C CNN
	1    10450 850 
	-1   0    0    1   
$EndComp
$Comp
L power:GND #PWR015
U 1 1 60BA5108
P 11050 900
F 0 "#PWR015" H 11050 650 50  0001 C CNN
F 1 "GND" H 11055 727 50  0000 C CNN
F 2 "" H 11050 900 50  0001 C CNN
F 3 "" H 11050 900 50  0001 C CNN
	1    11050 900 
	1    0    0    -1  
$EndComp
Wire Wire Line
	10050 850  10300 850 
Wire Wire Line
	10600 850  11050 850 
Wire Wire Line
	11050 850  11050 900 
Wire Wire Line
	9750 850  9400 850 
Text GLabel 9400 850  0    50   Input ~ 0
GPIO_LED_1
$Comp
L Device:R_US R5
U 1 1 60BA9A80
P 9900 1300
F 0 "R5" V 9695 1300 50  0000 C CNN
F 1 "80" V 9786 1300 50  0000 C CNN
F 2 "Resistor_THT:R_Axial_DIN0204_L3.6mm_D1.6mm_P2.54mm_Vertical" V 9940 1290 50  0001 C CNN
F 3 "~" H 9900 1300 50  0001 C CNN
	1    9900 1300
	0    1    1    0   
$EndComp
$Comp
L Device:LED D3
U 1 1 60BA9A86
P 10450 1300
F 0 "D3" H 10443 1045 50  0000 C CNN
F 1 "NSCW100" H 10443 1136 50  0000 C CNN
F 2 "LED_THT:LED_D3.0mm" H 10450 1300 50  0001 C CNN
F 3 "~" H 10450 1300 50  0001 C CNN
	1    10450 1300
	-1   0    0    1   
$EndComp
$Comp
L power:GND #PWR016
U 1 1 60BA9A8C
P 11050 1350
F 0 "#PWR016" H 11050 1100 50  0001 C CNN
F 1 "GND" H 11055 1177 50  0000 C CNN
F 2 "" H 11050 1350 50  0001 C CNN
F 3 "" H 11050 1350 50  0001 C CNN
	1    11050 1350
	1    0    0    -1  
$EndComp
Wire Wire Line
	10050 1300 10300 1300
Wire Wire Line
	10600 1300 11050 1300
Wire Wire Line
	11050 1300 11050 1350
Wire Wire Line
	9750 1300 9400 1300
Text GLabel 9400 1300 0    50   Input ~ 0
GPIO_LED_2
$Comp
L Device:R_US R6
U 1 1 60BAB0B7
P 9900 1750
F 0 "R6" V 9695 1750 50  0000 C CNN
F 1 "80" V 9786 1750 50  0000 C CNN
F 2 "Resistor_THT:R_Axial_DIN0204_L3.6mm_D1.6mm_P2.54mm_Vertical" V 9940 1740 50  0001 C CNN
F 3 "~" H 9900 1750 50  0001 C CNN
	1    9900 1750
	0    1    1    0   
$EndComp
$Comp
L Device:LED D4
U 1 1 60BAB0BD
P 10450 1750
F 0 "D4" H 10443 1495 50  0000 C CNN
F 1 "NSCW100" H 10443 1586 50  0000 C CNN
F 2 "LED_THT:LED_D3.0mm" H 10450 1750 50  0001 C CNN
F 3 "~" H 10450 1750 50  0001 C CNN
	1    10450 1750
	-1   0    0    1   
$EndComp
$Comp
L power:GND #PWR017
U 1 1 60BAB0C3
P 11050 1800
F 0 "#PWR017" H 11050 1550 50  0001 C CNN
F 1 "GND" H 11055 1627 50  0000 C CNN
F 2 "" H 11050 1800 50  0001 C CNN
F 3 "" H 11050 1800 50  0001 C CNN
	1    11050 1800
	1    0    0    -1  
$EndComp
Wire Wire Line
	10050 1750 10300 1750
Wire Wire Line
	10600 1750 11050 1750
Wire Wire Line
	11050 1750 11050 1800
Wire Wire Line
	9750 1750 9400 1750
Text GLabel 9400 1750 0    50   Input ~ 0
GPIO_LED_3
$Comp
L Device:R_US R7
U 1 1 60BAD7CB
P 9900 2200
F 0 "R7" V 9695 2200 50  0000 C CNN
F 1 "80" V 9786 2200 50  0000 C CNN
F 2 "Resistor_THT:R_Axial_DIN0204_L3.6mm_D1.6mm_P2.54mm_Vertical" V 9940 2190 50  0001 C CNN
F 3 "~" H 9900 2200 50  0001 C CNN
	1    9900 2200
	0    1    1    0   
$EndComp
$Comp
L Device:LED D5
U 1 1 60BAD7D1
P 10450 2200
F 0 "D5" H 10443 1945 50  0000 C CNN
F 1 "NSCW100" H 10443 2036 50  0000 C CNN
F 2 "LED_THT:LED_D3.0mm" H 10450 2200 50  0001 C CNN
F 3 "~" H 10450 2200 50  0001 C CNN
	1    10450 2200
	-1   0    0    1   
$EndComp
$Comp
L power:GND #PWR018
U 1 1 60BAD7D7
P 11050 2250
F 0 "#PWR018" H 11050 2000 50  0001 C CNN
F 1 "GND" H 11055 2077 50  0000 C CNN
F 2 "" H 11050 2250 50  0001 C CNN
F 3 "" H 11050 2250 50  0001 C CNN
	1    11050 2250
	1    0    0    -1  
$EndComp
Wire Wire Line
	10050 2200 10300 2200
Wire Wire Line
	10600 2200 11050 2200
Wire Wire Line
	11050 2200 11050 2250
Wire Wire Line
	9750 2200 9400 2200
Text GLabel 9400 2200 0    50   Input ~ 0
GPIO_LED_4
$Comp
L pspice:OPAMP U2
U 1 1 60B94384
P 6500 1450
F 0 "U2" H 6500 1200 50  0000 L CNN
F 1 "LM358" H 6500 1300 50  0000 L CNN
F 2 "Package_DIP:DIP-8_W7.62mm_Socket_LongPads" H 6500 1450 50  0001 C CNN
F 3 "http://www.ti.com/lit/ds/symlink/lm2904-n.pdf" H 6500 1450 50  0001 C CNN
	1    6500 1450
	1    0    0    -1  
$EndComp
$Comp
L Device:R_US R3
U 1 1 60B99513
P 6050 1900
F 0 "R3" H 5982 1854 50  0000 R CNN
F 1 "1k" H 5982 1945 50  0000 R CNN
F 2 "Resistor_THT:R_Axial_DIN0204_L3.6mm_D1.6mm_P2.54mm_Vertical" V 6090 1890 50  0001 C CNN
F 3 "~" H 6050 1900 50  0001 C CNN
	1    6050 1900
	-1   0    0    1   
$EndComp
$Comp
L Device:R_US R2
U 1 1 60B977DC
P 6050 950
F 0 "R2" H 6118 996 50  0000 L CNN
F 1 "1k" H 6118 905 50  0000 L CNN
F 2 "Resistor_THT:R_Axial_DIN0204_L3.6mm_D1.6mm_P2.54mm_Vertical" V 6090 940 50  0001 C CNN
F 3 "~" H 6050 950 50  0001 C CNN
	1    6050 950 
	1    0    0    -1  
$EndComp
Wire Wire Line
	6200 1350 6050 1350
Wire Wire Line
	6050 1350 6050 1100
Wire Wire Line
	6050 1350 6050 1750
Connection ~ 6050 1350
$Comp
L power:GND #PWR010
U 1 1 60BA0375
P 6400 2150
F 0 "#PWR010" H 6400 1900 50  0001 C CNN
F 1 "GND" H 6405 1977 50  0000 C CNN
F 2 "" H 6400 2150 50  0001 C CNN
F 3 "" H 6400 2150 50  0001 C CNN
	1    6400 2150
	1    0    0    -1  
$EndComp
Wire Wire Line
	6050 2050 6400 2050
Wire Wire Line
	6400 2050 6400 1750
Wire Wire Line
	6400 2050 6400 2150
Connection ~ 6400 2050
Wire Wire Line
	6400 1150 6400 700 
Wire Wire Line
	6400 700  6050 700 
Wire Wire Line
	6050 700  6050 800 
Wire Wire Line
	6200 1550 5950 1550
Text GLabel 6900 1450 2    50   Input ~ 0
GPIO_Amplifier
Text GLabel 5950 1550 0    50   Input ~ 0
IR_sensor_Output
Wire Wire Line
	6800 1450 6900 1450
$Comp
L Transistor_FET:FDS6890A Q1
U 2 1 60CD180B
P 1250 3750
F 0 "Q1" H 1454 3796 50  0000 L CNN
F 1 "FDS6890A" H 1454 3705 50  0000 L CNN
F 2 "Package_SO:SOIC-8_3.9x4.9mm_P1.27mm" H 1450 3675 50  0001 L CIN
F 3 "https://www.onsemi.com/pub/Collateral/FDS6890A-D.PDF" H 1250 3750 50  0001 L CNN
	2    1250 3750
	1    0    0    -1  
$EndComp
$Comp
L Transistor_FET:FDS6890A Q1
U 1 1 60CD2B4B
P 1250 3100
F 0 "Q1" H 1454 3146 50  0000 L CNN
F 1 "FDS6890A" H 1454 3055 50  0000 L CNN
F 2 "Package_SO:SOIC-8_3.9x4.9mm_P1.27mm" H 1450 3025 50  0001 L CIN
F 3 "https://www.onsemi.com/pub/Collateral/FDS6890A-D.PDF" H 1250 3100 50  0001 L CNN
	1    1250 3100
	1    0    0    -1  
$EndComp
$Comp
L Transistor_FET:FDS6890A Q2
U 1 1 60CD313C
P 1250 4400
F 0 "Q2" H 1454 4446 50  0000 L CNN
F 1 "FDS6890A" H 1454 4355 50  0000 L CNN
F 2 "Package_SO:SOIC-8_3.9x4.9mm_P1.27mm" H 1450 4325 50  0001 L CIN
F 3 "https://www.onsemi.com/pub/Collateral/FDS6890A-D.PDF" H 1250 4400 50  0001 L CNN
	1    1250 4400
	1    0    0    -1  
$EndComp
Wire Wire Line
	1350 3550 1950 3550
Wire Wire Line
	1950 3550 1950 3150
Wire Wire Line
	1350 4200 2050 4200
Wire Wire Line
	2050 4200 2050 3400
$Comp
L power:GND #PWR01
U 1 1 60D33805
P 1350 3300
F 0 "#PWR01" H 1350 3050 50  0001 C CNN
F 1 "GND" H 1355 3127 50  0000 C CNN
F 2 "" H 1350 3300 50  0001 C CNN
F 3 "" H 1350 3300 50  0001 C CNN
	1    1350 3300
	1    0    0    -1  
$EndComp
$Comp
L power:GND #PWR02
U 1 1 60D377A6
P 1350 3950
F 0 "#PWR02" H 1350 3700 50  0001 C CNN
F 1 "GND" H 1355 3777 50  0000 C CNN
F 2 "" H 1350 3950 50  0001 C CNN
F 3 "" H 1350 3950 50  0001 C CNN
	1    1350 3950
	1    0    0    -1  
$EndComp
$Comp
L power:GND #PWR03
U 1 1 60D3B5B3
P 1350 4600
F 0 "#PWR03" H 1350 4350 50  0001 C CNN
F 1 "GND" H 1355 4427 50  0000 C CNN
F 2 "" H 1350 4600 50  0001 C CNN
F 3 "" H 1350 4600 50  0001 C CNN
	1    1350 4600
	1    0    0    -1  
$EndComp
Text GLabel 1050 3100 0    50   Input ~ 0
Lights_1
Text GLabel 1050 3750 0    50   Input ~ 0
Lights_2
Text GLabel 1050 4400 0    50   Input ~ 0
Lights_3
$Comp
L Transistor_FET:FDS6890A Q2
U 2 1 60D86413
P 1750 5650
F 0 "Q2" H 1954 5696 50  0000 L CNN
F 1 "FDS6890A" H 1954 5605 50  0000 L CNN
F 2 "Package_SO:SOIC-8_3.9x4.9mm_P1.27mm" H 1950 5575 50  0001 L CIN
F 3 "https://www.onsemi.com/pub/Collateral/FDS6890A-D.PDF" H 1750 5650 50  0001 L CNN
	2    1750 5650
	1    0    0    -1  
$EndComp
Wire Wire Line
	1850 5850 1850 6000
$Comp
L Connector:Conn_01x02_Male J4
U 1 1 60D9AF9E
P 3950 6350
F 0 "J4" H 3922 6232 50  0000 R CNN
F 1 "External_connector" H 3922 6323 50  0000 R CNN
F 2 "Connector_Molex:Molex_KK-254_AE-6410-02A_1x02_P2.54mm_Vertical" H 3950 6350 50  0001 C CNN
F 3 "~" H 3950 6350 50  0001 C CNN
	1    3950 6350
	-1   0    0    1   
$EndComp
Wire Wire Line
	3750 6250 3750 5900
Wire Wire Line
	3750 6750 3750 6350
$Comp
L power:GND #PWR05
U 1 1 60DA693A
P 1850 6700
F 0 "#PWR05" H 1850 6450 50  0001 C CNN
F 1 "GND" H 1855 6527 50  0000 C CNN
F 2 "" H 1850 6700 50  0001 C CNN
F 3 "" H 1850 6700 50  0001 C CNN
	1    1850 6700
	1    0    0    -1  
$EndComp
Wire Wire Line
	1850 6600 1850 6700
Text GLabel 1550 5650 0    50   Input ~ 0
GPIO_ExternalTrigger
Text GLabel 1850 5350 0    50   Input ~ 0
12V_Vcc
Wire Wire Line
	1850 5350 1850 5450
NoConn ~ 7250 3450
NoConn ~ 7250 3350
NoConn ~ 6750 3350
NoConn ~ 6750 4150
$Comp
L Connector:Conn_01x03_Female J6
U 1 1 60E2EF45
P 7850 850
F 0 "J6" H 7878 876 50  0000 L CNN
F 1 "IRSensor_connector" H 7878 785 50  0000 L CNN
F 2 "Connector:FanPinHeader_1x03_P2.54mm_Vertical" H 7850 850 50  0001 C CNN
F 3 "~" H 7850 850 50  0001 C CNN
	1    7850 850 
	1    0    0    -1  
$EndComp
$Comp
L power:+3V3 #PWR09
U 1 1 60E32446
P 3550 1100
F 0 "#PWR09" H 3550 950 50  0001 C CNN
F 1 "+3V3" H 3565 1273 50  0000 C CNN
F 2 "" H 3550 1100 50  0001 C CNN
F 3 "" H 3550 1100 50  0001 C CNN
	1    3550 1100
	1    0    0    -1  
$EndComp
Wire Wire Line
	3550 1100 3550 1150
$Comp
L power:+12V #PWR08
U 1 1 60E37FF0
P 3550 750
F 0 "#PWR08" H 3550 600 50  0001 C CNN
F 1 "+12V" H 3565 923 50  0000 C CNN
F 2 "" H 3550 750 50  0001 C CNN
F 3 "" H 3550 750 50  0001 C CNN
	1    3550 750 
	1    0    0    -1  
$EndComp
Wire Wire Line
	3550 750  3550 800 
Connection ~ 3550 800 
Wire Wire Line
	3550 800  3750 800 
$Comp
L power:+3V3 #PWR012
U 1 1 60E4755A
P 7550 750
F 0 "#PWR012" H 7550 600 50  0001 C CNN
F 1 "+3V3" H 7565 923 50  0000 C CNN
F 2 "" H 7550 750 50  0001 C CNN
F 3 "" H 7550 750 50  0001 C CNN
	1    7550 750 
	1    0    0    -1  
$EndComp
$Comp
L power:GND #PWR013
U 1 1 60E48947
P 7550 1000
F 0 "#PWR013" H 7550 750 50  0001 C CNN
F 1 "GND" H 7555 827 50  0000 C CNN
F 2 "" H 7550 1000 50  0001 C CNN
F 3 "" H 7550 1000 50  0001 C CNN
	1    7550 1000
	1    0    0    -1  
$EndComp
Wire Wire Line
	7650 950  7550 950 
Wire Wire Line
	7550 950  7550 1000
Wire Wire Line
	7650 850  7550 850 
Wire Wire Line
	7650 750  7550 750 
Text GLabel 5150 4600 0    50   Input ~ 0
GPIO_ExternalTrigger
Text GLabel 4900 4700 0    50   Input ~ 0
GPIO_LED_4
Wire Wire Line
	4900 4700 5150 4700
Wire Wire Line
	5700 3450 6750 3450
Text GLabel 5400 5200 0    50   Input ~ 0
Lights_1
Text GLabel 5400 5300 0    50   Input ~ 0
GPIO_LED_1
Wire Wire Line
	5400 5200 5650 5200
Wire Wire Line
	5400 5300 5650 5300
Wire Wire Line
	5700 4750 6750 4750
$Comp
L power:+12V #PWR06
U 1 1 60ED186F
P 2250 2800
F 0 "#PWR06" H 2250 2650 50  0001 C CNN
F 1 "+12V" H 2265 2973 50  0000 C CNN
F 2 "" H 2250 2800 50  0001 C CNN
F 3 "" H 2250 2800 50  0001 C CNN
	1    2250 2800
	1    0    0    -1  
$EndComp
Connection ~ 2250 3000
Wire Wire Line
	2250 3000 2250 2800
Wire Wire Line
	2250 3250 2250 3500
Connection ~ 2250 3250
Wire Wire Line
	2400 3250 2250 3250
Wire Wire Line
	2400 3500 2250 3500
Wire Wire Line
	2250 3000 2250 3250
Wire Wire Line
	2400 3000 2250 3000
Wire Wire Line
	2050 3400 2400 3400
Wire Wire Line
	1950 3150 2400 3150
Wire Wire Line
	1350 2900 2400 2900
$Comp
L Connector:Conn_01x02_Female J3
U 1 1 60CF2F70
P 2600 3400
F 0 "J3" H 2628 3376 50  0000 L CNN
F 1 "Lights_connector3" H 2628 3285 50  0000 L CNN
F 2 "Connector_Molex:Molex_KK-254_AE-6410-02A_1x02_P2.54mm_Vertical" H 2600 3400 50  0001 C CNN
F 3 "~" H 2600 3400 50  0001 C CNN
	1    2600 3400
	1    0    0    -1  
$EndComp
$Comp
L Connector:Conn_01x02_Female J2
U 1 1 60CEFDED
P 2600 3150
F 0 "J2" H 2628 3126 50  0000 L CNN
F 1 "Lights_connector2" H 2628 3035 50  0000 L CNN
F 2 "Connector_Molex:Molex_KK-254_AE-6410-02A_1x02_P2.54mm_Vertical" H 2600 3150 50  0001 C CNN
F 3 "~" H 2600 3150 50  0001 C CNN
	1    2600 3150
	1    0    0    -1  
$EndComp
$Comp
L Connector:Conn_01x02_Female J1
U 1 1 60CEDF1A
P 2600 2900
F 0 "J1" H 2628 2876 50  0000 L CNN
F 1 "Lights_connector1" H 2628 2785 50  0000 L CNN
F 2 "Connector_Molex:Molex_KK-254_AE-6410-02A_1x02_P2.54mm_Vertical" H 2600 2900 50  0001 C CNN
F 3 "~" H 2600 2900 50  0001 C CNN
	1    2600 2900
	1    0    0    -1  
$EndComp
$Comp
L power:+3V3 #PWR019
U 1 1 60F4A565
P 5750 700
F 0 "#PWR019" H 5750 550 50  0001 C CNN
F 1 "+3V3" H 5765 873 50  0000 C CNN
F 2 "" H 5750 700 50  0001 C CNN
F 3 "" H 5750 700 50  0001 C CNN
	1    5750 700 
	1    0    0    -1  
$EndComp
Wire Wire Line
	6050 700  5750 700 
Connection ~ 6050 700 
Text GLabel 5500 3550 0    50   Input ~ 0
GPIO_Amplifier
Wire Wire Line
	5500 3550 6750 3550
$Comp
L Connector:Conn_01x02_Male J7
U 1 1 60F6675B
P 4450 1900
F 0 "J7" H 4450 1600 50  0000 C CNN
F 1 "External_Power_Input" H 4450 1700 50  0000 C CNN
F 2 "Connector_Molex:Molex_KK-254_AE-6410-02A_1x02_P2.54mm_Vertical" H 4450 1900 50  0001 C CNN
F 3 "~" H 4450 1900 50  0001 C CNN
	1    4450 1900
	-1   0    0    1   
$EndComp
Text GLabel 4150 1800 0    50   Input ~ 0
Power_Input
Wire Wire Line
	4150 1800 4250 1800
$Comp
L power:GND #PWR020
U 1 1 60F73E9B
P 4150 1900
F 0 "#PWR020" H 4150 1650 50  0001 C CNN
F 1 "GND" H 4155 1727 50  0000 C CNN
F 2 "" H 4150 1900 50  0001 C CNN
F 3 "" H 4150 1900 50  0001 C CNN
	1    4150 1900
	1    0    0    -1  
$EndComp
Wire Wire Line
	4250 1900 4150 1900
$Comp
L Transistor_BJT:TIP3055 Q3
U 1 1 60F91B7B
P 1800 1250
F 0 "Q3" V 2128 1250 50  0000 C CNN
F 1 "TIP3055" V 2037 1250 50  0000 C CNN
F 2 "Package_TO_SOT_THT:TO-218-3_Vertical" H 2000 1175 50  0001 L CIN
F 3 "http://www.onsemi.com/pub_link/Collateral/TIP3055-D.PDF" H 1800 1250 50  0001 L CNN
	1    1800 1250
	0    -1   -1   0   
$EndComp
Text GLabel 7550 850  0    50   Input ~ 0
IR_sensor_Output
Connection ~ 6550 5250
Wire Wire Line
	6550 5250 6550 5400
$Comp
L power:GND #PWR011
U 1 1 60FD9757
P 6550 5400
F 0 "#PWR011" H 6550 5150 50  0001 C CNN
F 1 "GND" H 6555 5227 50  0000 C CNN
F 2 "" H 6550 5400 50  0001 C CNN
F 3 "" H 6550 5400 50  0001 C CNN
	1    6550 5400
	1    0    0    -1  
$EndComp
$Comp
L power:GND #PWR014
U 1 1 60FDF2C2
P 7450 5400
F 0 "#PWR014" H 7450 5150 50  0001 C CNN
F 1 "GND" H 7455 5227 50  0000 C CNN
F 2 "" H 7450 5400 50  0001 C CNN
F 3 "" H 7450 5400 50  0001 C CNN
	1    7450 5400
	1    0    0    -1  
$EndComp
$Comp
L Relay:G6K-2 K1
U 1 1 6101097C
P 2250 6300
F 0 "K1" H 2880 6346 50  0000 L CNN
F 1 "G6K-2" H 2880 6255 50  0000 L CNN
F 2 "Relay_THT:Relay_DPDT_Omron_G6K-2P" H 2250 6300 50  0001 L CNN
F 3 "http://omronfs.omron.com/en_US/ecb/products/pdf/en-g6k.pdf" H 2250 6300 50  0001 C CNN
	1    2250 6300
	1    0    0    -1  
$EndComp
Wire Wire Line
	2350 5900 2350 6000
Wire Wire Line
	2350 5900 3750 5900
Wire Wire Line
	2250 6750 2250 6600
Wire Wire Line
	2250 6750 3750 6750
NoConn ~ 2150 6000
NoConn ~ 2550 6000
NoConn ~ 2750 6000
NoConn ~ 2650 6600
Wire Wire Line
	6750 3650 6800 3650
Wire Wire Line
	5650 5300 5650 5200
Wire Wire Line
	5650 5150 6750 5150
Connection ~ 5650 5200
Wire Wire Line
	5650 5200 5650 5150
Connection ~ 6750 3650
Wire Wire Line
	5700 3650 6750 3650
NoConn ~ 5700 3650
Wire Wire Line
	5550 4950 6750 4950
Wire Wire Line
	5550 4950 5550 4850
Wire Wire Line
	4850 4900 5000 4900
Text GLabel 4850 4900 0    50   Input ~ 0
GPIO_LED_3
Wire Wire Line
	4850 4800 5000 4800
Text GLabel 4850 4800 0    50   Input ~ 0
Lights_3
Wire Wire Line
	5400 5000 5550 5000
Wire Wire Line
	5400 5100 5550 5100
Text GLabel 5400 5000 0    50   Input ~ 0
GPIO_LED_2
Text GLabel 5400 5100 0    50   Input ~ 0
Lights_2
Wire Wire Line
	5550 5000 5550 5050
Wire Wire Line
	5550 5050 6750 5050
Connection ~ 5550 5050
Wire Wire Line
	5550 5050 5550 5100
Wire Wire Line
	5550 4850 5000 4850
Wire Wire Line
	5000 4850 5000 4800
Wire Wire Line
	5000 4850 5000 4900
Connection ~ 5000 4850
NoConn ~ 5700 4750
Wire Wire Line
	5150 4700 5150 4650
Wire Wire Line
	5600 4850 5600 4650
Wire Wire Line
	5600 4650 5150 4650
Wire Wire Line
	5600 4850 6750 4850
Connection ~ 5150 4650
Wire Wire Line
	5150 4650 5150 4600
NoConn ~ 5700 3450
$EndSCHEMATC
