#: table_doi: 10.17182/hepdata.130266.v1/t3
#: name: Figure 3
#: description: Ratio of observed rate to predicted SM event rate for different combinations of Higgs boson production and decay processes. The narrow grey bands indicate the theory uncertainties in the SM cross-section times the branching fraction predictions. The $p$-value for compatibility of the measurement and the SM prediction is 72%.
#: data_file: figure_3.yaml
#: keyword reactions: 
#: keyword observables: 
#: keyword cmenergies: 13000.0
#: keyword phrases: 
#: ,Cross-section normalized to SM value
,Data,Total uncertainty +,Total uncertainty -,Syst. uncertainty +,Syst. uncertainty -
$ttH+tH \times bb$,0.34799,0.34131,-0.32988,0.27934,-0.26691
ggF + VBF + $bbH \times bb$,0.98031,0.37558,-0.36282,0.19548,-0.1714
$WH \times bb$,1.0585,0.28364,-0.26408,0.2077,-0.1844
$ZH \times bb$,1.0008,0.2459,-0.2256,0.17594,-0.15006
$ttH+tH \times WW$,1.639,0.64953,-0.61363,0.47535,-0.43812
ggF + $bbH \times WW$,1.1402,0.13022,-0.12581,0.11562,-0.11077
VBF $\times WW$,1.1284,0.19453,-0.1835,0.11727,-0.10781
$WH \times WW$,2.2639,1.2116,-1.0218,0.61111,-0.47128
$ZH \times WW$,2.8611,1.8361,-1.3348,0.78763,-0.407
$ttH+tH \times \tau\tau$,1.3731,0.85932,-0.75279,0.54606,-0.43702
ggF + $bbH \times \tau\tau$,0.89788,0.29101,-0.25638,0.2459,-0.20398
VBF $\times \tau\tau$,0.99778,0.20661,-0.1826,0.15171,-0.12315
$VH \times \tau\tau$,1.0037,0.62433,-0.59479,0.34551,-0.32363
$ttH+tH \times ZZ$,1.6832,1.6821,-1.1065,0.35011,-0.16164
ggF + $bbH \times ZZ$,0.95157,0.10984,-0.1047,0.037966,-0.032525
VBF $\times ZZ$,1.3313,0.51944,-0.43235,0.10837,-0.076768
$VH \times ZZ$,1.4999,1.1664,-0.93885,0.22729,-0.15841
$tH \times \gamma\gamma$,2.6099,4.2259,-3.3784,1.3429,-0.89239
$ttH \times \gamma\gamma$,0.90103,0.32752,-0.30859,0.076043,-0.050075
ggF + $bbH \times \gamma\gamma$,1.0377,0.103,-0.09916,0.061573,-0.055193
VBF $\times \gamma\gamma$,1.3576,0.29687,-0.26491,0.21366,-0.17663
$WH \times \gamma\gamma$,1.528,0.5604,-0.50742,0.1232,-0.085
$ZH \times \gamma\gamma$,-0.22116,0.6056,-0.54052,0.11951,-0.14649
ggF + $ttH+tH+bbH \times \mu\mu$,0.53722,0.8908,-0.88495,0.1921,-0.17601
VBF + $VH \times \mu\mu$,2.3139,1.33,-1.2576,0.27061,-0.22412

#: ,Cross-section normalized to SM value
## ,SM prediction, +, -
## $ttH+tH \times bb$,1.0,0.085139,-0.086498
## ggF + VBF + $bbH \times bb$,1.0,0.052115,-0.052422
## $WH \times bb$,1.0,0.019582,-0.019635
## $ZH \times bb$,1.0,0.036741,-0.036769
## $ttH+tH \times WW$,1.0,0.088229,-0.089341
## ggF + $bbH \times WW$,1.0,0.060802,-0.061502
## VBF $\times WW$,1.0,0.025074,-0.025454
## $WH \times WW$,1.0,0.025599,-0.026273
## $ZH \times WW$,1.0,0.040461,-0.040772
## $ttH+tH \times \tau\tau$,1.0,0.08828,-0.089392
## ggF + $bbH \times \tau\tau$,1.0,0.060876,-0.061575
## VBF $\times \tau\tau$,1.0,0.025253,-0.02563
## $VH \times \tau\tau$,1.0,0.027924,-0.028477
## $ttH+tH \times ZZ$,1.0,0.088229,-0.089341
## ggF + $bbH \times ZZ$,1.0,0.060802,-0.061502
## VBF $\times ZZ$,1.0,0.025074,-0.025454
## $VH \times ZZ$,1.0,0.027762,-0.028318
## $tH \times \gamma\gamma$,1.0,0.065582,-0.12837
## $ttH \times \gamma\gamma$,1.0,0.10254,-0.10216
## ggF + $bbH \times \gamma\gamma$,1.0,0.061513,-0.062205
## VBF $\times \gamma\gamma$,1.0,0.026753,-0.027109
## $WH \times \gamma\gamma$,1.0,0.027245,-0.027879
## $ZH \times \gamma\gamma$,1.0,0.041522,-0.041826
## ggF + $ttH+tH+bbH \times \mu\mu$,1.0,0.060374,-0.061064
## VBF + $VH \times \mu\mu$,1.0,0.02388,-0.024362
## 
