<?xml version="1.0" encoding="UTF-8" standalone="no"?>
<!-- Created with Inkscape (http://www.inkscape.org/) -->

<svg
   xmlns:dc="http://purl.org/dc/elements/1.1/"
   xmlns:cc="http://creativecommons.org/ns#"
   xmlns:rdf="http://www.w3.org/1999/02/22-rdf-syntax-ns#"
   xmlns:svg="http://www.w3.org/2000/svg"
   xmlns="http://www.w3.org/2000/svg"
   xmlns:xlink="http://www.w3.org/1999/xlink"
   xmlns:sodipodi="http://sodipodi.sourceforge.net/DTD/sodipodi-0.dtd"
   xmlns:inkscape="http://www.inkscape.org/namespaces/inkscape"
   width="210mm"
   height="297mm"
   viewBox="0 0 210 297"
   version="1.1"
   id="svg8"
   inkscape:version="0.92.2 (5c3e80d, 2017-08-06)"
   sodipodi:docname="itpie.svg"
   inkscape:export-filename="C:\code\vae\product-website\hugo-vae-src\static\img\logo.png"
   inkscape:export-xdpi="6.2406201"
   inkscape:export-ydpi="6.2406201">
  <defs
     id="defs2" />
  <sodipodi:namedview
     id="base"
     pagecolor="#ffffff"
     bordercolor="#666666"
     borderopacity="1.0"
     inkscape:pageopacity="0.0"
     inkscape:pageshadow="2"
     inkscape:zoom="0.35"
     inkscape:cx="237.68998"
     inkscape:cy="611.52421"
     inkscape:document-units="mm"
     inkscape:current-layer="layer1"
     showgrid="false"
     inkscape:snap-to-guides="true"
     inkscape:window-width="1881"
     inkscape:window-height="2128"
     inkscape:window-x="1950"
     inkscape:window-y="0"
     inkscape:window-maximized="0"
     inkscape:snap-text-baseline="true" />
  <metadata
     id="metadata5">
    <rdf:RDF>
      <cc:Work
         rdf:about="">
        <dc:format>image/svg+xml</dc:format>
        <dc:type
           rdf:resource="http://purl.org/dc/dcmitype/StillImage" />
        <dc:title />
      </cc:Work>
    </rdf:RDF>
  </metadata>
  <g
     inkscape:label="Layer 1"
     inkscape:groupmode="layer"
     id="layer1">
    <text
       xml:space="preserve"
       style="font-style:normal;font-weight:500;font-size:183.39151916px;line-height:1.25;font-family:Roboto;letter-spacing:0px;word-spacing:0px;fill:#0d5580;fill-opacity:1;stroke:none;stroke-width:4.5847683;-inkscape-font-specification:'Roboto, Medium';font-stretch:normal;font-variant:normal;text-anchor:start;text-align:start;writing-mode:lr;font-variant-ligatures:normal;font-variant-caps:normal;font-variant-numeric:normal;font-feature-settings:normal;"
       x="184.86429"
       y="207.51433"
       id="text3701"><tspan
         sodipodi:role="line"
         id="tspan3699"
         x="184.86429"
         y="207.51433"
         style="font-style:normal;font-variant:normal;font-weight:500;font-stretch:normal;font-size:183.39151916px;font-family:Roboto;-inkscape-font-specification:'Roboto, Medium';font-variant-ligatures:normal;font-variant-caps:normal;font-variant-numeric:normal;font-feature-settings:normal;text-align:start;writing-mode:lr;text-anchor:start;fill:#0d5580;fill-opacity:1;stroke-width:4.5847683;">itpie</tspan></text>
    <image
       y="78.189575"
       x="1.4552037"
       id="image3711"
       xlink:href="data:image/png;base64,iVBORw0KGgoAAAANSUhEUgAAAiUAAAIWCAYAAACIg/3oAAAAGXRFWHRTb2Z0d2FyZQBBZG9iZSBJ bWFnZVJlYWR5ccllPAAAQFJJREFUeNrs3Qe8HFX5//Gz6W3SG0lI74VyuUIihCKogEAoDh2pPxQR FEGiKDCCqIiign9RKaKACgsoSBWQIoEAl0voJCQhnfS2KTd1/8+5u4Ek3CS7s9POmc/79XqcSHLv 3X1m7u53z5w5k8nn8woAACBuGUIJAAAglAAAABBKAAAAoQQAAIBQAgAAEhlKaAGSznG9NrJpItVK qplUc6mWxb9uKtV6q3++5d80pEWxkCCf331pkydOf2kjnQBS7cVMVc3UJvQBIYQIHRI6SXWRaivV Tqr9Vn9uV/xzm2KIaFcMCy2L/65lMXi0JTjbr0WTTQtk041OAKl2thShBCWFDD0asVuxuha3OnD0 LG67FkOIro5qxyMVAADsEKEEOnTo0Yn+xeon1Wur6l38FMuIBQCAUIJAgoc+pTJEalhxO1RqQDGE dKBDAABCCYIOH41lM1hqD6m9pPaUGqEKIx4AABBKEFoI0aMd+0qNltqvGEZa0pnSNc7kVb8Oa1Tv dmtUn3ZrVbc2derDpW3U/FwL1avtWrW7/Lcla5qpBaubqw8Wt1EzlrdSm/OczQIAQkm6A0ijYug4 uFifV4WJpiiDjhPVPZepw/otUqN7LVP7yp9bN9v2itTxT49QD7zXQ506ao666qAPtvm71eubqHcW OurZGV3Uk9O6qjc+bkdIAQBCSSqCiL7C5chiHaSY/+HbkE6r1Kl7zFbHDf1Y9W2/xvf30QFmPwkz ur5/wBS1aE1zde87PdVttX3U9GWtaTQAEEqsCiL7yOZYqaNUYV4IKjC29xL1ndHT1BcHLAzl+3dp tU59a9/p9fXsjM7q+hcHq5dmd6TxAEAoMTaIDJfNKVKuKlwdgwoN65xTPz30PXVo/0WR/cxD+i6u r2emd1FXPTtMvb2wLTsCAAglRgQRPdZ/stTXpT5HR4LRoslm9YOxk9VF+05XTRrFc28nHYQO7rdY /XbiAPXzFweruo2N2DEAQChJZBjpK5tLpc7U/5eOBGdEl5y649ja+lGSuOmrer47Zqo6evB8de7D e6tJ89uxgwCAUJKYMKLXDBkvdaJ+z6IjwXJHzFW/O+It1bLppkQ9rkGdVqmnvzZBXfafkerOSSwX AwCEknjDiF5F9VqpE+hGOPRVMFeMnZLYx9es8WZ1kwSmwRJQfvjMcJVnlwEAoSTiMNKzGEa+phgZ CYVeHeTnh72rLvjcR0Y8Xn2FTseW69WFj+6pNrG2CQAQSiIII81lc4nUlVKt6Eh4Duu/UE1Z0qZ+ 5MGUt/jJix01ZvelasKsToyYAAChJNRAcrhsbpYaSDfC9dXh89T97/X45P/fePjbiQ8mVz87TP16 4oD6P584Yq66792e7EgAIJQEHkY6yeZXqnBFDUJ2xKAF6vZxtWpk15XKe26ouv2NPokPJlsHkktG T1M/PuR91SiTV/94pxc7FAAEiycEE0j06qvvEkiioW+c96ejJtWHD33JrXdw4d40Oph894lRiTwl 8suXBn4SSC7erxBIND35NQmXLwMAocT8MNJG6g754z+lutGR8Om1P247ZpJq12LDJ/8t6cHkxpcH qmueH1r/53P3nqmu/cL7n/ydXuhNr6vSvPFmdi4AQgkt8B1IqmRTK3U23YjOuVUz1eheSz/z33Uw uXqrYPKj/w5PTCDRp5e2BJKGTi/pBd8u/fxUdi6A1GNOib9A8m3Z3CDVlG5ER9/47soDJ+/w7y+V YLKyrmn9aZKbX+mvmmTyn5wm2Rk9qvLy7I7quRmd1StzO6gPl7RR81e1qP+7f7zTU70ws5Pq32GN 2me35erQ/gvV/r2X1o/YBBFIPnnsn/9Q3ftuTzVtKXcZBkAoQWlhRF/ee6vUqXQjelcfPHmb0zYN 2RJCdDDZModjR8Fk5bom6rbavlJ91JyVLRv8N5vzmfq/06XDif6e3dusU2dLyPj6PjPq1xypNJBo TRvl1bXyOE99oJodDSC1WNCr9ECi3+GeljqMbkSvT/s16vdfeVM1KuHSmkP6LVZ1GxuriXM61pf+ s/5vW+gxjr++2VudnP2cenxqNwkn5Q14rVrfRL04q5O6440+qmWTTaqqx4ptHle5gWQLvdrrU9O7 qnm5Fqnat/06rFl98si5bTjKgVR76Md/nDeJOSWlBZIDZfOq1Ci6EQ99CW0pp0y20KMj+ms0Pbqh L8fVlq5tpo6/dz910WN7qCXy50rokZbxT49QX7lnjJq/qnlFgWSLi/abxs4GkFqcvtl1INFLxN+m mD8SGz2X5PQ9Zpf9ddufylle11Q9N7Oz+mhZsIvsvjS7ozr4zrHqlJFz1K9eHug7kGjHDJmvejp1 am7KRksAgFCy8zCi309+InUF3YjXSSPn1t/Qzo+tg8mfQ7xDrz7lsiWQ6LsV//LL7/haxE2PBp23 zwz14+JoCwCkCadvGg4keq7NbQSSZDhl1JyKvv57+3+oOu1gQmrQWjfdpH5+2HtlnWra3skj5yhu 1QeAUAIdSPS4+f1S59CN+Ok1PEZ1XVnR97jsPyMrnj9SqtUbGqsLH92jou+hT9/svdtydj4AQknK A0k72TwhdSzdSIbDBiys6Ouf/aiL+tvb0d5b5omp3ba5UaAfem4JABBK0h1I/iN1EN1Iji/0W+T7 a/UaI+Ofjmdl16ueHabWb/L/6/XFCsMYABBKzA8k+9KN5NCTW8c0sKR8qR6Z0k19sNiJ5bHrxdYq ufuvPm3VqukmDgIAhJKUBZJOBJJkGtJpVf0N6/y6vbZvrI9frxTr+xczk1d7dV/BQQCAUJKiQLJl DgmBJIGGdcn5/tpFa5qr52d2ivXxT5rfrqI1UfbpwWRXAISStAQS/W7xqBQ3G7EwlPx3euf6OSVx e3JaN99f26fdGg4CAISSFAQSfX3ow1L7cwgk1+5t1/r+Wn3PmyR4dW4H31/bw6njIABAKLE8kOiF 0e6TOpTdn2wdK1jw7L1FTiKew/sVPI5eFYQyACCUmOH3UuPY9SaEkg2+v3b2ypaJeA6zKngcUa1C CwBJkap73ziud7Vszme3m+Hix/dQy+r83QdxXkJuaJdb10SN+L2/QbnOrdZxEAAglFgaSPSy8R67 3BwLVzdT81eZf7fc2Sv8jZZs2swdcAAQSmwMJF+Sza3sbrNcc8gHqqfPeRWnP1itlq1tGv8vWKO8 euiUib6+dkVdU3XqA1wcBoBQYlMgGSabrGKhOOMM7LhKVftcq6N32zUSStrF/hy6t6lTY3sv8fW1 b85vx0EAIFWsfqOWQNJZFdYiacuuNs+sFf4XHhvYcXUinsPgTqt8f+3SiO5sDACEkvADiX5F/6dU P3azmSqZrJqU1VD32c3/41i0hlACgFBii/8ndQC72FxzKwglB/VdnIjnUMnjmLy4DQcBAEKJ6RzX 05f9nsfuNds7C/yfdRvVdaXq2z7eZdo7t1qv9u/t/y7H7y92OAgAEEoMDyRjZPM7dq35Xv+4vcpX 8PVn7jUr1sd/6qjZqnHG/zN4ZyFToQAQSkwOJN1l86BUU3at+Vatb6ImVzBacJaEktbNNsby2Js2 yqtvVM/w/fX61NWM5a04CAAQSgwNJPryZn1Pm+7sVnu8MLOT76/Vy7RfMnpaLI/7/OqPKrp3zXMf dWHnAyCUGOwnUmPZpXZ5ZEplGfPi/aapQRVcluuHDiNXHDClou/xzEed2fkACCUmclzvCNmMZ3fa 58VZndTyOv9n41o02azuOOYN1bTx5mh+oTJ5dav8PKe5/9NGazc2Vk9O68bOB0AoMTCQ7C6bu9iV dtq4OaP+9cFuFX2P5euaqqjuIqN/zoq6yqY0PTK5e/2N/ACAUGJWINGv3PdKdWJX2uvW1/v6/trn Z3ZWJ973ObV+UyPVp/2a+pGMsPTvsEZtymfUGQ9Wq8c+9D/ScffbvdjpAAglBrpSagy70W5vL2yr Jszu6DuQ6NMheoXXCee8oP52Qk1Fp1Ya0rLpJnX7MW+ol899Xh3YZ4nasNl/MNFrkzDJFQChxDCO 6+nVWn/ELkyHP7xW3t0Caua1V6fcX10fSPbsvkI9dPJE1VbCyJGDFqgXz37B903ytve5nsvU82e9 qNwRc+vDSdZ9taJgcsOEQSrP7gZAKDEqkLSXzT2KO/+mxsOTd1NvlbjCqw4k4/4xun6dk+Fdcuqf J71SH0i26NdhjXrktJfVX497vf7v/dBX9Pzp6EnqqTNeUkM7f/o9Kgkm05e1rnj+DAAQSmL44CzV m92XHnr04Mr/Di85kOiJojpwPHLqy/XLvW9PT0g9dujH6uXznlePn/6SOnfvmfVzTnZm93Zr1Zl7 zlL/PnWieu3/nlcnj5zT4ByVLcFk/92X1geTM/+5T/2ppF0Z//SI+om9AJBWxk3xd1zvNNmcxK5L n2dndFYPT+6ujhkyv6JAsn040eFBl7Z4TTM1dWkbdePLA9QTU7vVj3hcMXayGthxterael3Jj1UH k3slmOjH87o8Lj235b4TX1MH9Wn4Bn2Pf9hNPTm1KzsZQKoZNVIigaSn4r42qXbpk6MavOTWTyBp iP6a0b2W1p/i0fRCaJ+XwFJOINlCnzLSc1n0JFs9t0UHk4ZGTNZsaKy+99QIdi4AQolBgUR/qL1N qj27Lb0WrG6uvv3EqFACSRhKCSbff3qEmrWC+9wAgEkjJedLHc4uw4Pv91C31vZNfCApJZj8451e 6s5JTI8CAGNCieN6+nrQX7G7sMUPnh6u/v52L3XcvfvVB5JhnZMZSHYWTHQY2X7UBwAIJckOJPq0 za1Srdld2EKv0Pq9p0eonk5d/fyPB09+JbGBpKFg0rNtnbr2+aFq7YbG7EwAMCWUiLOlDmVXYXsr 65qqBauaq98d8VZ9ODGBDiY3Hf5W/eTWRWuasRMBwJRQ4rieXknqRnYTdmTJ2mbqzH9VqTcXtDPi 8U5Z0kadmN1Xzcu1YOcBgEmhRPxeqh27CTuj1xY5/O4x9euKJNkLMzupw/66v5pLIAEAs0KJ43on yOZYdhFKsXp9E3Xy/dXquheGqM355K2K+tuJA9S4v49WyxtYYwUAkOBQIoHE0a/j7B6UQ4eR6ycM Ul/4y/71d9tNgjkrW6pjJIxc+ewwtSnPEvIAYFwoET+W6snugR+1H7dXY+8Yq376v8H1E0rjoK8O +s3EAar6Twer52Z0ZqcAQAkSd+8bx/X2lM3F7BpUGgp+/uJgdXttH3XZ56eqc6pmquaNN4f+c/Vo yL3v9FQ/k589czmrtAKAsaGkuCbJLVIs3oBALFrTvP7uuze+PFCdsefs+rv87upuwH7oyat6ddbb Xu/LRFYAsCGUiHOlxrBbEDR9z5xfvjSw/u6/+o7ARw5aoL40YKEa1GmV7+85Y3kr9dT0ruqB93qo iXM6JHKCLQAQSnxwXE9f+vtTdgnCpIPD/2Z1qq8fPDO8ftG1PbqvUHt0XamGdsmpLq3Wqa6t16um jfKqh/xds8ab1UfLWqmPV7Wov2nezBUt1dsL2tWHkIUSdAAAFoYScZVUF3YJoqRPteh6/MOG1zjR 96fhhnkAEI1EXH3juN4Q2VzE7gAAgFASt19LsaoUAACEkvg4rneEbI5gVwAAQCiJM5DoOS03sBsA AEDcIyVnSY1gNwAAgNhCieN6ernLa9gFAAAg1lAiLpXajV0AAAC0WNYpcVyvq2wup/2hWyG1QGqJ 1FKpRcU/6/+ek9LLma6VWi21UmrLzWH0f1tH+xCFNRsa69ehjZY9rQFS97N3S/K61Hm0IfVmxRZK xBVSbdgHFdNBY7LUh1JTizt1jtRcqdm5rLeaFiHpnpLK/Nqu55Svre7Eni3Z3ExVzSTagFhCieN6 ennMb9L6suhRjbeK9WZx+4GEjmW0BkikbrSgrA9XQDyhRFypWChtZ/QplHelXt6qpkgAydMawBjM lyvdclqAWEKJ43oDZXM2bf+MD1RhFPtpqeclgKygJYDRGCkpHSO+iCeUCE+qMW1X64sB5F9Sj0sI mUNLAKswUkIoQZJDieN6w2Vzaop7XSf1sNSDUo9JEMlx+AHWYqSEUIIkhxJxlVQmhT1+QeouqSyn ZYDUYKSEUIKkhpLiKMmJKfslu13qFgki0znMgNRhpKR0THRFtKFEFRZKS8Moib5U97dSf5cwspbD C0iffG21fl3tQifK+hAHRBNKilfcnG55Hyeqwn18nuDSXSD1utICQgkSGkrED5W9V9zo+SJXSxB5 jkMJQBHzSQglSGIoKa7eepqFfXtfaryEkX9zCAHYDvNJSleXqaqpow2IJJSIy5Rdq7cuVoWRnzsk kGzk8AHQAEZKSscoCaIJJY7r6RtSnWNRr/TVNJdLGOE+DQB2hpGS0nHlDaIJJeJCqdYW9Eifqvm6 hJH/cbgAKAEjJaVjpATbaBTGN3Vcr6VsLragPzdJVRFIAJSBkRJCCXwKa6REn7bpZHBf5kmdLWHk PxwiAMrESAmhBEkJJY7r6dGXywzuyTNSJ0sgWczhAcAHRkoIJfApjNM346T6GtqPX0h9mUACoAKM lJSOia7YRhinby4xsA96SfivSRi5n0MCgF/52upWsmlDJ0rGSAnCCyWO61XJZqxhPVggdbQEktc4 HABUqActKAtLLCC8UCK+Y9jz15f7HimBZAaHAoAAcN+b8jBSgm0ENqfEcb3usjnZoOf+otQYAgmA ADFSQihBEkKJuECZs6S8vmeNntC6gkMAQIAYKSkPE10RfChxXE+HkfMNec53Sh0ngWQNux9AwBgp KQ8jJQg+lOg3eanuBjzfP0idI4FkE7seQAgYKSGUoAJBTXT9pgHP9XoJI99nlwMIESMlpduQqapZ TRuwtYpHShzXGyGbgwgkAMBISRkYJUHwoUQlf5SEQAIgKoyUlI5Jrgg2lDiu58jmDAIJANRjpKR0 jJQg2FAiTtTZJKHP7QYCCYCo5GurOytzlkUglMDKUJLUy4BvlRrP7gUQIUZJCCWIK5Q4rjdKNvsm 8DllpS7IZb08uxdAhJhPQihBXKFE/F8Cn8+TUqezDgmAGDBSUh4muiKYUOK4Xgv95p+w51IjdbwE kvXsVgAxYKSkPIyUIJhQot/8pTok6HlMU4W7/bJ0PIC4MFJCKEFMoeScBD2HxVKHSyBZxO4EECNG SggliDqUOK63u2y+kJDHXyd1lASSqexKADFjpIRQgqhDiSoslpZJyOM/SwLJK+xGAAnASAmhBDGE krMS8tivlEByL7sQQEIwUkIoQZShxHG90bIZlIDHfY/Udew+AEmQr63WK7l2oROEEkQYSlQyRkn0 pb/nsTgagAQhkJRnc6aqZiVtgO9Q4rhec9mcFPPjXSB1rASSOnYdgATpSQvKwigJKgsl4kip9jE+ 1g1SJ0ggmctuA5AwjJSUh9VcUXEoOSXmx3qxBJIJ7DIACcRISXkYKYH/UOK4niObo2N8nHdJIPkD uwtAQjFSQihBVKFEHCfVIqbH+I7UN9hVABKMkRJCCSIMJafG9Pj07OzjuacNgIRjpIRQgihCieN6 ekGgw2J6fOdKIPmQ3QQg4RgpIZQgilAiTpBqHMNj+6MEkvvZRQAMwEhJebj6Br5DyVdjeFxvSX2H 3QPAEIyUlIeREjSoyc7+snjq5uCIH9NqqZNYIA02kt+pdqpwQ8vVcoxvoCPmy9dWt5JNKzpBKEHI oUQcr/zdtK8S35EX6w/YNdjqjbxt8Thsu9XxqN8EmhX/3GyrN4Ut/+6TL1efnn5sKdW8+Gd9r5LW xT/rkNBuq69ps9XvRgv16ZVnTYp/t8XWiwm2Ln5PVfwZLYt/brzd12xxlNSj7F0rMEpCKEFEocSN +PE8KIHkNnYLtgokOmQs2iqA2IJz6vZgPgmhBAFptJM3g6hP3cyTOp9dggY+hTaz8HkRSuw6RsHx jzBDiYr+1M3XcllvCbsE2xnAizISjpGS8jFSgrJDSZRX3fxWAskz7A4QSmAgRkoIJQgzlDiu10E2 B0X0GKZIXcGuQIpCyUYJ4avZtdZgpKTMQJ6pqsnTBpQcSsRX1K4nwQZhs9SZLCOPnRhk44syu9Uq jJSUh1ESlB1Kjo3o5/9cAslEdgN2oj+hBAnHSAnHP8IKJY7r6fUVDo/gZ78rdQ27ALtg4+kbXpTt wkhJeRgpQemhRBVuvtc65J+rT9uck8t669gF2BEJyJ3UtouaEUqQRF1pAaEE4YWSKE7d3CiB5FXa j12w9cqbFexaO+Rrq/WpmyZ0glCCEEJJcfXMo0L+mVOlrqL1KMEgS58XIyX2YJSEUIKwQonYN4Jf svNyWW8trUcJ+lv6vAgl9uhBCzj+EV4o+UrIP+92CSTP03aUiIXTkHSMlJSPkRKUHEqODvFnLZS6 nJaDUEIosQgjJYQShBFKHNfrJZs9Q/xZl+Sy3lJaDkIJocQijJQQShBGKFHhnrr5jwSSv9FulEpC sr4sfTdCCRKOkRJCCQwLJXotkgtpNcrU3+LnRiixByMlHP8IOpTIp9IWqrBoWhh+kct6U2k1yjTA 4ufGi7I9GCkpHyMl2HkoEWOlWobw/adL/ZQ2w4dBFj83Qok9GCkhlCCEUHJESN//4lzWq6PN8GEw oQRJlq+tbiqbznSiLKsyVTUbaQN2FUq+FML3flgCyaO0GD7ZOlKySX4vVrF7rcAoSfkYJcHOQ0nx UuARAX9fPbn1u7QXhJLPYJTEHswnIZQg6FAi9eUQvq++4d402gs/JCi3sfgFn1BiD0ZKOP4RQig5 PODvOU/qOlqLCtg8yZVPivZgpKR8LKCJndK33B4oNTPA7zk+l/VW01pUYCAvyjAAIyWEcgQdSiRA 7E0bkDBDeVGGARgp4fhHwBrRAiSQzSMlvCjbg5GS8jGnBIQSGIc5JTBBT1rA8Q9CCew3hBdlGKAL LeD4B6EEFnNcr4NsOvKiDAMwUsLxD0IJLDfE8ufHi7IF8rXVrVU49wsjlIBQAiTIIMufHy/KdmCU hOMfhBIQSnhRRiIwn8Qfrr4BoQRGGWz581vCLrYCIyWEchBKkAKMlMAEjJSUb22mqmYdbQChBCax eaRkUy7r5djFVmCkhEAOQgls5rhed9m04UUZBmCkhOMfhBJYbqjlz48XZXswUlI+JrmCUAKjsEYJ TMFICcc/CCWw3DBelGEIRko4/kEogeU4fQNTMFLC8Q9CCQglvCgjXvna6q6yaUInyraUFoBQAiM4 rtdKNr15UYYBGCXxh4muIJTAGHp9kozlz5GREjswn4TjH4QSWG5oCp4jIyV2YKSEUAJCCQglxlvM brYCIyWEEhBKYLlhKXiOjJTYoSstIJSAUAK7DUnBcySU2KEHLfCFia4glCD5HNdrlJJQsoS9bQVG SvxhpASEEhhBXwrcIgXPk5ESOzBSUr71maqaNbQBhBKYIA3zSXK5rLeRXW0FRkrKxygJCCUwBlfe wAj52upmsulEJwglIJSAUGIy5pPYgVESf5jkCkIJCCUJwnwSOzCfxB9GSkAoAaGEUIKAMVJCKAGh BLZyXK9DSl7oCSV2YKSEUAJCCSw2LCXPkzkldmCkhFACQgksNiQlz5Orb+zASAmhBIQSWCwtIyWc vrEDIyX+cPUNCCUwQlpGSjh9YwdGSvxhpASEEhhheEqeJyMldmCkhOMfhBLYyHE9fb+b/rwowyCM lPjDSAkIJUi8oSk6BgklhsvXVreRTUs64QtzSkAoQeKNSMv7GaHECoyS+MdICQglSLy0zCdZkst6 eXa38ZhP4s+mTFVNjjaAUIKkS8tICWuU2IGREn8YJQGhBISSBOFyYDswUkIoAaEENkrZlTeL2ONW YKSEUAJCCSyVpitvCCV26EYLfOHKGxBKkHgjUvRcOX1jh91ogS+MlIBQgsQbnqLnSiixAyMlhBIQ SmCpNI2ULGB3W4GREkIJCCUglBiPkRLD5WurM4qrbwglIJTAPo7rtVLpufKGUGKHLlKNaYMvTHQF oQSJNjxlxx6Lp5mP+ST+MVICQgkSbWTKnu9CdrnxmE9CKAGhBJbaI0XPdX0u63HfD/MxUkIoAaEE lkrTSAnzSezASAmhBIQSWGoUoQSGYaSEUAJCCWzjuF4n2XRP0VNmjRI7MFLiU6aqhqtvQChBYo1K 2fNlpMQOjJT4wygJCCUglBBKEDBGSgglIJSAUGI87hBsB0ZKCCUglMBCaVujhDklhsvXVjeTTUc6 4QvzSUAoAaEkQVjN1XyMkvjHSAkIJUgmx/X66U3KnjYjJeZjPgmhBIQSWGjPFD5nlpg3HyMlhBIQ SmChvVL4nDl9Y74etIBQAkIJ7JO2kZJNhBIrdKUFvjHRFYQSJFbaRkoW57Jent1uPEZK/GOkBIQS JI/jem1l0zdlT5s1SuzASAmhBIQSWCaNk1zns9utwEgJoQSEEhBKjMd8EjswUkIoAaEElknjlTdc DmwHRkoIJSCUwDJ7pPA5s3Ca4fK11XqxvxZ0wjeuvgGhBMniuF5jlb4b8WmcvjEfoyT+5TJVNZto AwglSJrBKf20yURX8zGfxD9O3YBQgkTaK6XPm0uCzcdIiX9LaQEIJUiiqpQ+b07fmI+REv+YTwJC CRJpn5Q+74/Z9cZjpMQ/Tt+AUAJCSULU5bLeKna98RgpIZSAUAJbOK7XXzZtU/jUmeRqB0ZKCCUg lMAiaT11wxoldmCkhFACQgkIJcZjPokdGCkhlIBQAkKJ8RgpMVy+tjojmy50wjeuvgGhBImT1suB CSXm06duGtMG3xgpAaEEyeG4Xm/ZdEzp0+f0jR2hBIQSEEpgieoUP3dGSszHfBJCCQglsMg+KX7u XBJsPkZKCCUglIBQYgVGSsy3Gy2oCBNdQShBoqT59A1zSszHlTf+rclU1aynDSCUIBEc1xsom04p ffqrcllvLUeB8ZhT4h+nbkAoQaLsm+LnziiJHRgpIZSAUAJL7Jfi576Q3W8F5pQQSkAoAaHEePPY /Vbg6htCCQglMJ3jek1ls3eKW7CIo8Bs+dpqvZIrp2/848obEEqQGHtJNUvx85/LIWA8HUgytMG3 JbQAhBIkxb4pf/4snGa+brSgIpy+AaEEiTE65c+fOSXm604LKrKUFoBQgqRI+0gJocR8THKtDCMl IJQgfo7rdZDN4JS3gdM35uNy4MowUgJCCRJhv5Q//w25rMc6JebjypvKMFICQgkS4YCUP39GSezA EvOEEhBKQCgxHvNJ7MBISWU4fQNCCeLluJ5em4RJrrABc0oqw0gJCCWIXZVUy5T3gNM3duDqG/9W ZqpqNtEGEEoQt7G0QM2hBWZjifmKsZorCCVIhP1pASMlFmCJ+cpw6gaEEsTLcb0MoaQec0rMxxLz lWGSKwgliN0Qqc60gVBiAZaYrwwjJSCUIHbMJyng9I35mORaGUZKQChB7A6gBWo9q7lagcuBK8NI CQgliN1BtIBTN5bgypvKMFICQgni47jeQNn0oROEEkv0pAUVYaQEhBLE6ou0oN5sWmAFRkoIJSCU wGCH0gJCiUW4GV9lOH0DQgni4biePoa+QCfqcfrGDoyUVIYVXUEoQWz0/W460IZ6LDFvOJaYD8RK WgBCCeLCqZtPcfrGfASSyi2nBSCUIC5Mcv3UXFpAKIHK0QIQShA5x/VaKO53s8VmqY9pg/FYYr4y azNVNZtoAwgliIMOJC1oQ70Fuay3kTYYj/s3VYZREhBKEJsjacEnmE9iB+4QTCgBoQSGOooWfIIr bwglIJSAUII4OK43SDaD6cQnmORqB07fVGYFLQChBHH4Ci0glFiIOwRXhjVKQChBLMbRgm3MogVW 4JLgynD6BoQSRMtxva6yOZBObIOJrnboSgsIJSCUwCzHcux8BiMldmCia2U4fQNCCSJ3PC3Yhl4s ipvxGS5fW91aNi3pREUYKQGhBNFxXE9fncD9brY1j4XTrMBqroQSEEpgGFeqCW3YBqdu7MAk18px Mz4QShCp02gBocRSTHKtHCMlIJQgGo7r9VbcgI9QYi9O3xBKQCiBQU6lBQ2aSQuswGquhBIQSkAo MR5rlNiBkRJCCQglMIHjeiNlM4pONIjTN3ZgTgmhBIQSGIIJroQS23H6pnLckA+EEoTLcb1GhJId fzLMZT0ug7QDN+OrHOv1gFCC0H1Banfa0CBGSezBSEmFMlU1q+gCCCUI21m0YIe48sYC+dpq/VrI 4mmVWU8LQChBqBzXa6u4183OfEQLrKADSYY2VGQtLQChBGE7WXGTsp2ZQQuswKkbQgkIJTDAWbSA UJICTHKt3DpaAEIJQuO43mDZjKEThJIUYD5J5ZjkCkIJQnUWLSCUpASnbyrH5cAglCAcjus1IZTs +pNhLustpg1W6EYLKsbCaSCUIDRHKc6z7wpX3tiDkZLKbaIFIJQgLOfTgl2aQQus0YkWVGwlLQCh BIFzXK+PbA6nE4SSFOH0TeWYUwJCCUJxnmIhKUJJunD1TeW4+gaEEgSrOMH1XDpBKEkZTt9UjnVK QChB4JjgWjomulqgeN8bJrpWjhVdQShB4JjgSihJGx1IOF1ZuTW0AIQSBMZxvQGKCa6lWpbLestp gxU4dRMM7hIMQgkC9S0+MZZsGi2wBpNcg5GjBSCUIBCO67VWrOBajum0wBpdaUEgWDwNhBIE5gyp 9rShZFNpgTWY5AoQSpAwF9KCsjBSQijBtupoAQglqJjjeofIZiSdKAtzSuzBaq6EEhBKkCDfogVl Y6TEHoyUAIQSJIHjer1lM45OlEVf+jiHNhBKsI08LQChBJW6SKoxbSjLjFzW20wbrMHVN8FYQQtA KIFvjus5ihVc/eDKG7uwTglAKEEC6LsBt6UNZWM+iV04fQMQShCn4t2Av00nfOHKG0vka6vbyaYp nQAIJYjX8VJ9aAOhJOWYTwIQSpAAl9EC3z6kBdbg1E1wuPoGhBKUz3G9A2TzOTrhi76/B3NK7MEd goPD1TcglMAXRkn8m5nLetyi3R6s5goQShAXx/WGy+YYOuEbp27swkgJQChBjMZLZWgDoQT1OtIC gFCCGBSXlD+NTlSEhdPswkgJQChBTC5XLClPKAGhBCCUIE6O6+mltM+lExWbTAuswhLzAKEEMbhE qgVtqMhGqRm0wSqMlPB+Ag4iRMlxPb2U9jfpRMX03YE30garMNE1ONxHC4QSlOQCqXa0oWJTaIF1 GCkBCCWIiuN6bRSLpQWFy4Etkq+t1p/sm9AJgFCC6HyLT4OBYZKrXZjkChBKEBVGSQL3AS2wCmEd IJQgQoySBIuRErswyRUglCAKjJIEblUu682jDVYhsAeLJQdAKMEOMUoSLK68IZSAUAJCCcrFKEko 3qcF1mGiK0AoQQQYJQkeIyX24XckWCyeBkIJtuW4XnvZjKcTgePKG/sw0ZX3E3AQIWSXSrWnDYHj yhv7MFISLBaiA6EEnyreCfgSOhEKVnO1DyMlwWpDC0AowdZ+KNWaNgRuVi7rraEN1ulKCwBCCULg uF5v2XydToSCK2/sxEhJsFrSAhBKsMWVinUCwsIkV8vka6v170orOhGo5rQAhBLoUZJBsjmbToTm XVpgHSaDB68dLQChBNrPpBrThtBw5Y19OtCCwDFSC0JJ2jmuN0Y2J9CJUDFSQijBrjGnBIQSqBto QagW57LeEtpAKMEucfoGhJI0c1zvONnsTydC9R4tIJSgJJy+AaEkxYFEr574czoROi4HJpSgNJy+ AaEkxc6XGkwbQsflwIQSlIbTNyCUpJHjeno556vpRCSY5EooQWlY9wWEkpTSdwFmiexocDmwnVjN NXis/QJCSdo4rtdHNpfRiUjkcllvFm2wEiMlwWuWr61mXgkIJSnzC8Us96hw6oZQgvIwWgJCSVo4 rneAbE6kE5F5hxYQSlAWJruCUJKSQKL31W/oRKQYKSGUoDyMlIBQkhJnSu1DGyLFSAmhBIQSEEqw Ncf1HFW46R4IJahQvra6uWKhL0IJCCXw7QqpbrQhUstyWW8+bbASoyT0FoQS+OG43gDZXEInIvc2 LeCNE2XrQgtAKLHbTVLNaUPkOHVDKEH5GNEFocRWjusdI5sj6UQsuDswoQTl60wLQCixM5DoiXi/ pROx4fSNvdrSgtAwUgJCiaV+INWXNsSG0zeEEpSPe3KBUGKb4uTWy+lEbBbkst5S2kAoQdk4fQNC iYWY3BovTt0QSuAzlORrq3lfAaHEFo7rjVNMbo0by8sTSuBPRjGvBBVoQgsSFUjayOZmOhE75pPY jZvGhau31Me0wX752ur+srkxwG+5mVCSLNdI7U4bCCUglBisl9QrtCEV9P3YxgX4/eZw+iYhHNer ks3FdCIRWKPEbpy+CT+UIB2GBfz9PiKUJCOQNJbNH6Ua043YzcplvZW0we5fOVpAKEEghgf8/aYT SpLhQqlq2pAInLqxHyMl4eIUNKHErxmEkrg/srme/lTxEzqRGJy6IZSgMj1pgf3ytdXNVPCnbxgp SQB9tQ3DycnBSAmhBJXpSwtSYaQK/gpe5pTEyXG942RzLJ1IFBZOs/vTnX7Na00nQtVL+tySNlhv rxC+J6EkxkDSXja30IlE2aQ4fWM7Rkmi0Z8WWG/vgL/feql5rFMSn98oVj5Mmim5rFdHG6zWnhZE YqBiZWTb7Rvw95uZqarZzEhJDBzX+5JszqQTicOpG/sxUhJdKIGl8rXV+t5sQZ++maL/h1ASfSDR S8nfSicS6U1aYP+vIC2IBKdv7KZP3TQjlNjhZ6pwbwgkz1u0wHrNaEEkhtACq40J4XtOJpRE/RHN 9caqwkJpSCZGSuzHfW+iMYwWWO0gQon5gaSFKpy2ydCNRFqey3qzaYP1WtCCSPTI11Z3pA32kf2q 38PGEkrMd51iSDPJGCUhlCBYo2iBlUZIBR04c5mqmo8JJREpnra5hE4kGlfepAOnb6IzkhZY6dAQ vueULX8glIQfSPTVNncqTtskHSMl6dCcFhBKUJEvh/A93yeUROd6xeVxJuDKm3RoRQsIJfAnX1ut T38eHMK3ZqQkCsVF0r5JJxJvs+L0TWp+LWlBZKrkTawxbbDKgVJh3NeIkZIIAok+d30bnTDCB7ms t5Y2pALrlERHj0qNoA1WOTqk7/s2oSR8v5XanTYY4Q1akJ7PC7QgUvvRAjsULwUeF8K31vcbm0oo CfNVz/X0juPeNoQSJPPTO6KzLy2wxj4hfdB+L1NVs4lQEl4g6a44bUMoQVJx9U20GCmxx1dD+r7b zOcjlAQbSPTw1p+lOtMNQgkSiXVKojUiX1vNnZkNVzx1c1JI3/4tQkl49H1tDqcNRpmRy3rLaAMQ Cv0ecyBtMJ6+AV/fkL43IyVhcFxvuGxuoBPGYZQkXZhTEr1DaYHxTgvxexNKQggk+jz1PYr7ahBK kHRcEhy9Q2iBuYoLpp0a0rdfnKmqmU8oCd61UnvRBkIJgM/YU97YutAGY+kJru1D+t6Ttv8PhJIK Oa6nPwVcRicIJQB2iNESc50X4vd+nVASbCDRV9ncrbjZnqkW5LLeXNqQrl9bWhCLcbTAPPnaan3/ ooNC/BGvEUqCCyQ6iNwp1YNuGOt1WpA63IslHkfJG1xT2mCcb4f8/QklAbpY6iu0wWiv0QIgEnqt ki/QBnNIiOwkm9ND/BF6kussQkkAHNerks0v6AShBMbhVGt8jqMFRrlIhXtFaYMj1YSS8gNJG9nc q7i00AacvkkfVnSNz7Hy6bsJbUg+2U967tV34nj9JZSU7xapgbTBeHNzWW8+bQAi003qSNpghAsj CPA1hJIKOa53hgr3HBui8yotACJ3Li1ItnxttV6T5HtxvQYTSkoPJINUYZQEduDUDRC9I+VNrxtt SDQdSDqG/DPmZKpq5hJK/AcSPX/kH1Kt6QahBEZbRQtipeeUnEkbkkkCo17i4pIIftSEHf0FoaQ0 P5Oqog1W4fRNOm2kBbH7jrz5caFAMumrSlsSShLMcb3DZfNdOmGV6bmst5Q2ALHYTeprtCFZJCge oMK9GzChJIBA0l02f6UT1mGUBIjX5fImyPtPcgKJXm339xH9uNVSbxFKyg8kepGlP0txd0v7TKQF qbWSFiSCvnDgJNqQGOOlRkX0s17JVNVsJJSU75tSh9MGQgmsspkWJMZ1zC2JX/Gme1dG+CMn7Owv CSUNcFxvqGxuoBNWWi81iTakFlffJEc/xXy9uANJc9ncpaJdoZxQUmYg0efW7lbRzEBG9N7IZb11 tIFQgkS4St4Y+9GG2FwvtVeEP28TocTHL4nUPrTBWpy6IZQgOfSHvzuY9Bo96fk42Xw74h/7aqaq ZhWhpESO642WzQ/ohNVeoQWEEiTKwVLfpw2RBhI9ReGuGH70f3f1DwglnwYSfYvmO6Ua0w2rMVKS bstpQSJdK2+UX6INkQQSfW+bh/TbXgw//mlCSRm/FFJDaIPVFuay3ke0IdUYKUkm/V6UlTfMPWlF qIGkWTGQDI7hx9eV8qGQUKI+OW3DLHD7MUoCQklytdWfpOWNcxStCCWQ6Pf7e6QOjOkhTMhU1dQR SnYdSLactiGg2W8CLUi9RbQg0TpLvVBc8hzBBRK9GOj/k/pqjA/jmVL+EW/EhUVjOG2TDi/SgtSb TwsST895eEreSI+nFYEFEr2E/Ddifij/LeUfpTqUOK6nhwkv57BNBb02yeu0IfUW0wIj6BFsPcfk +8U3VfgLJHoOyd0JCCT6Bqg1hJKdBxJ9lc3tUk04dFPhNRZNg1hAC4yh359+JnWPvLmymGX5gaSN bP4tdWoCHs6TmaqaTYSSnfuW1Oc4dFOD+STQFtIC45yiP1TIm+wIWlFyIOkvm5ekknKZ9WPlJNHU cVxvd9lcx6FLKEG6yKe1NbJZQyeMowPJq/Jmey6t2GUg+aIqnCpJylVM+iaYjxNKdu5GqdYcvqny Ei1A0TxaYKRWUrfJm+6jUj1px2fCSFOpX8gfn5TqkKCHNlE+DCwhlOyA43pfVvFeFoXovZ/Lekto A4pm0gKjHSn1rrwBf4N75nwSSPSoiF6H6XtSSZsY/Fg5/zhVO1QCib5N8+84hFOHS4GxtRm0wHjt pG6RekXekFM7N1BPAJbSUxFqpaoS+jAfJZTs2GVSA/l9Tp0XaAG2MosWWKNaFeaa3CeVmtd2fZm0 lJ4A/L7UFSq5V5HOlXqTUNIAx/X0Ocgf8jucSs/RAmxlBi2wjqvfoOWN+lbbw4k8v8NV4W7nf5Pq k/CH+89MVU2+nC9I0xod+np3rnVPn2m5rDeHNoBQYj39fnae1Dnyxn2/bH8jb4gvWxJE9HM7VhXm jOxr0EP/p5+daD3H9fROPIPf2VR6jhaAUJIq+gzAibrkzXySKsw9uU8CynIDw4ge4T9LFVZk7WXY w9f3mXqeUPLZQKJnIv+G31NCCVCkR87WKkZO02AvqT9K3Sxv8Hp103ulnpCAkktwEOkkm2NUYSXW Q1XyrqYp1YOlruKaqlCiCpf/juF3k1ACaPJCuVle+D+QP+5NN1JD3wPmhGKtl/3/rA4nxdeHt/Qx EWMI0e/DesLuIVJHSO2v7Jjv+YCv30+bj0LH9fTOfldqML+TqTQ9l/UG0AY08EbwV8UpXRTom8Xp NT70DTtfk3pbalYYQUUvcCYbvQT8HlL7FEt/aLZtMc9lUt2khxvK/ULbR0rOJpCk2v9oAXbgfVqA oo6qsCDbkVv9tzoJEFNUYf6Rvqx1tirMkVhefMNdpQp3Ht9eWyl9Izy9jkp7qd2kekjpuSH6A1I/ lY4zFP/0E0isDiWO6+nzxVfz+5Zqz9ICEErgQwtVGM3Yg1b4cp/fL7R5nZILiukU6fU0LcAOvEsL gFDMr+S118pQUhwl+R7HRro/Ceey3lzagB2YrrhbMBCGv/m56sbqUCK+LtWdYyPVGCXBDhVfNF+n E0Dg7qrki60LJcVRkvEcF4QSWoBdeJUWAIF6WwL/JELJts5SjJKknf4U/BxtwC7U0AIgUHdV+g2s CiWO6+nncynHRepNzGW9lbQBu8BICRAcva7LPYSSbY1ThWvBkW6cusEuZapq9GTXJXQCCMRT8js1 j1CyLUZJQChBOSbSAiAQfwjim1gTShzX0/cO2J/jIvVW8EaDMjxHC4CK6RGSRwgl27qA4wLiqVzW 20gbUCJW/QUqd2umqiaQ110rQonjevp+AydzXEA8SgtQhjdU4V4mAPzRVzveHtQ3s2Wk5HSpVhwb UIXbkQMlKd4J9gU6Afj2iPwezSaUbOs8jgvoT725rDefNqBMz9ACwLc/BfnNjA8ljusNk83eHBdQ nLqBP1ytBfgzVQU8Om3DSMlpHBcoeowWoFyZqpr3iy+uAMrz6+IpUELJVk7huIBYqlihE/49RAuA suiFB+8M+psaHUoc19tLNv05NiAeyWW9TbQBPj1MC4Cy/CFTVbOGULKtozkuwCddBGCCYsl5oFTr pG4O4xsTSmCDOqknaQP8kk98epTtEToBlORu+Z1ZQCjZiuN6XWVTzbEBVVjFdTVtQIXuowXALuWl fhXWNzd5pORA/QGH4wPiX7QAAfiP1ELaAOw8vBevWCOUbOcgjg0IfTnav2kDKlW8d8ff6QSwQ3qU 5Jowf4DJoWQsxwfEhFzWW0QbEJC7aAGwQ3qU5D1CyXYc12shm5EcHxBZWoCgyAvu67J5n04AnxH6 KImxoUSMkGrMMcIvidQDtAEBu5MWAJ8R+iiJyaFkD44PiBdzWW8ebUDA/qwK6zAA+PQD4DVR/CBT Q8lQjhGIv9ECBE0+Deo5Sv+gE8An7olilMTkUNKbYyT19FU3D9IGhORmWgDU04tTXhHVDzM1lPTi OEm953JZjzUlEIrihNdX6ARQfyfg2YSSnduN4yT1WE8CYbuJFiDl9KnMn0f5A00NJS04VlJNT0K8 nzYgZHrZ+Wm0ASnmZapqVhJKdq0Nx0qqPZTLestpA8JUXOH1ejqBlPpA6k9R/9BG9B0G+gstQITH 2mzagBS6qBjMCSXATsyXepI2IAryorxeNj+lE0iZv8ux/3QcP5hQAtPcnct6m2gDIqQXU/uYNiAl 9ByS78b1w00NJcwnSC9O3SBS8olRT6z+IZ1ASlwhx/x8Qkn5SQ7p82ou671DGxBTGJ5EG2C5Gqlb 4nwApoaSpRw7qXQLLUAc5JOjXkH4UjoBi+nT4t8oHuuEkjKxkmf6LFPcjwTxBpP/yuYROgFLXV9c yThWpoYSLtFLnztzWa+ONiBml0ltoA2wzLsqorsA2xpKZnEMpQ6nbhA7+SQ5WTa/oBOwiF6L5GvF Cd2EEp8+4jhKlWdyWe9D2oCEuE5qOm2AJa6SQFKblAdjaih5i+MoVX5NC5AU8gK+Vjbn0QlY4EWV sJE/U0PJTKnVHE+p8J7UY7QBCQsmz8rm93QCBtMXD5wmx3KiFqM0MpTksl5eNrUcU6lwY3F/A0kz XnEXYZjrbAkkiZufafIy8y9zTFlPL+19F21AEskL+irZnKEK6zsAJvmNHL8PJfGBmRxKJnBcWe+m XNZbTxuQ4GCiPxx5dAIG0fNILk/qgzM5lDynCpcywU4rpP5AG2AAfRfhp2gDDLBA6kQJ04lda8fY UCKfoPX9bxgtsdf1so+58SISr7gs9+lS8+gGEkyPOh8rx2ui73jdyPAmP85xZqUlUjfTBhgUTPSt L44vvvADSXS+HKcTk/4gTQ8lf+c4s9IvcllvFW2AYcHkFdl8g04ggfR9bf5iwgM1OpTIG5e+nGki x5tV5itGSWBuMPmzYhl6JEtW6gemPNhGFjT8Do45q/xIwuZa2gCDfV/qAdqABNBX2uj72hiz1pMN oeRvUjmOPSvUSP2ZNsBkxTeA06SepxuI0dtSR8nxaNTd1Y0PJfKpWi83fyfHnxW+LftzM22ABcFE 33F1nNSbdAMx0CsNHy7H4QrTHngjS3bAL6U2cBwa7R4JJC/RBlgUTPQbwhel3qEbiNBcfdzJ8Wfk JepWhJLihNd7OBaNtVTqMtoAC4PJItl8SepDuoGIAsnBctx9ZOoTaGTRzrhGsUaAqS6WYDmfNsDS YKIXq9pfMWKCaALJVKN/X2zaI47r6dM4l3JsGuV+CSQubYDt8rXVXVRhOfo96QYIJA1rZNmOuU5q EcenMfS++iZtQBoUT+UcpLg9BoI1RWq0DYHEulAin7iXyeY7HKNG0FfZnCr7jBCJNAUTPflVzzFh HRME4XWpA+S4mmPN74iNe8lxvcdkcwTHa6JdLYHkGtqANMrXVusPhNcrJnjDvyekXAkkVt2So5Gl O+tcVbipG5LpSamf0Aaklb6zsNT35I8XqMKoIVCOW1VhYTTr7hGWsXWPOa6nFy76F8du4kyWGlM8 1QakXr62+suqcHPRDnQDu6AD7KUSRn5jbWC3ee9JMNHDo5dzHCeGHr0aLYFkKq0Atgkm/WRzv1QV 3cAO6A9yJ0kgecrmJ9nI8p14hSqcd0P89BoyxxJIgAY+HRYWu9JrmdxGN9CAN6T2sT2Q1P8u2P4E HddrJ5sXpPbguI6NHnJ0JZA8SCuAncvXVp8tm5ulWtMNiD9Jfdu0G+sRSnYeTHrKRt9XpTfHdyyB 5GsSSLgNAFB6MBkkm79IjaEbqbVc6nwJI9k0PelMWp6oBJOBsnlOqifHeqS+KYHkFtoAlB1MGstm vNSPpZrQkVTR71VnSiCZlbYnnknTkyWYREqPkHxdAgnnyIHKwslesrlTsTx9GqyV+oHUTRJI8mls QCZtT1iCSX9VWCdjIMd/aDaowmqt99MKIJBgokdKLlKFUROHjljpGVU4XTM9zU3IpPFJSzDRN8bS q75W83sQOL2YzwkSSP5DK4DAw4ke5dVrVHyVblhjoSqs7Ht3WkdHUh9KisGklSoMiXKH2uDMkDpK Asm7tAIINZzo++fcoLiq0GSbpH4vdWXxnkhIcygpBhP9/H8odU3aexGA51VhhITl/YFogoleZ+o0 VbhlA1cWmuVRqcsljLxHKwglDYWTw2Rzt1Q3ulH+a2PxE9uPJJBsoB1A5OGkuWy+pQoTJDvRkUR7 RX8QljDyDK0glOwqmHRXhXUBvkQ3Svax1JkSRp6iFUDs4USfkj5f6rtSu9ORRNErsnoSRh6mFYSS coKJ7sd5Ur9SzHDfFb2gz4USSBbRCiBR4aSZbE5XhTVOBtORWE2Q+omEEW53QiipKJzo87N6hvtx dOMzZhfDyL9pBZDocKLnnOg7EF8g9RVl/73OkkJPYH1A6kYJI6/QDkJJkOHkSNn8mk8b9dZJ3SR1 rQSSHO0AjAoofVTh1I4eCe5KR0KhT2ffKnWbhJHZtINQElYw0YsW/Z/UVVLd0/h6JqXvW6Mnss7k iACMDidNZfNFVbhqZ5zipn+V0jfJe0jqLqknJYxspCWEkqjCSUvZfF0VFrlJwzL1eghSr8j6Mwkj b3IEANYFFB1Iji4GFH0FYgu6UhJ9C43/qsIVmw9KEGHkmFASazjRk8hOkbpYqsrCp7hG6q9Sv5Qw Mo09DqQioOgrdw6VOkoV5p9wf7Bt6eChrzJ8ROpxCSLzaQmhJIkBRd9W/FypE5X5V+vUSumb590j YWQlexdIbUDR7wv65n969GRssTqkrQ1S720VRP4nQWQ9RwehxJRwoj9lHCN1gtQRypzztB+owima ByWIvMGeBNBASNFX7YyUOlDq86owQjzYsvcPPZH/NVW4hPd/Ui9JCFnG3ieU2BBQ9NyTQ1RhMple iG14gh7e6uIvnF5N8BEJIh+wxwD4CCr6g9deUnsXa2gxqHQ24OHrUy9vb1VvSb0rIWQde5ZQkoaQ on9JR0vtX/wlHqWiOV+rJ6pOlnpdapJO/lI1EkSYHQ4grLDSXjaDpIZI9Su+1vWQ2k2qlypcjhz2 ein69LO+PHfGVjWruJ0i4WMxe4pQgm2DSsfiL+5Aqf7FX9zuxdLnbtsWq1UDX64vQdOJfq2U/uXS t73WN8FbIKUnpk4v1lQJIHV0G0CCQkvj4mucDi/tGqgt70ltpJps9+V6pHfL/bWWq8K8j6XF17+l W4rLcs32/wUYABmv7mDv9gdJAAAAAElFTkSuQmCC "
       preserveAspectRatio="none"
       height="141.28751"
       width="145.25626" />
  </g>
</svg>
