<svg width="24" height="24" viewBox="0 0 24 24" fill="none" xmlns="http://www.w3.org/2000/svg">
<rect x="2" y="5" width="20" height="14" stroke="#073B75" stroke-linecap="round" stroke-linejoin="round"/>
<path d="M2 5L12 14L22 5" stroke="#073B75"/>
<path d="M2 19L9 11" stroke="#073B75"/>
<path fill-rule="evenodd" clip-rule="evenodd" d="M22 19L15 11L22 19Z" stroke="#073B75"/>
</svg>
