<?xml version="1.0" encoding="UTF-8" standalone="no"?>
<svg
   version="1.1"
   id="svg2"
   xml:space="preserve"
   width="841mm"
   height="1189mm"
   viewBox="0 0 3178.5827 4493.8583"
   sodipodi:docname="mtnos-color.svg"
   inkscape:version="1.1.2 (b8e25be833, 2022-02-05)"
   xmlns:inkscape="http://www.inkscape.org/namespaces/inkscape"
   xmlns:sodipodi="http://sodipodi.sourceforge.net/DTD/sodipodi-0.dtd"
   xmlns="http://www.w3.org/2000/svg"
   xmlns:svg="http://www.w3.org/2000/svg"
   xmlns:rdf="http://www.w3.org/1999/02/22-rdf-syntax-ns#"
   xmlns:cc="http://creativecommons.org/ns#"
   xmlns:dc="http://purl.org/dc/elements/1.1/"><metadata
     id="metadata8"><rdf:RDF><cc:Work
         rdf:about=""><dc:format>image/svg+xml</dc:format><dc:type
           rdf:resource="http://purl.org/dc/dcmitype/StillImage" /></cc:Work></rdf:RDF></metadata><defs
     id="defs6" /><sodipodi:namedview
     pagecolor="#ffffff"
     bordercolor="#666666"
     borderopacity="1"
     objecttolerance="10"
     gridtolerance="10"
     guidetolerance="10"
     inkscape:pageopacity="0"
     inkscape:pageshadow="2"
     inkscape:window-width="1920"
     inkscape:window-height="1129"
     id="namedview4"
     inkscape:pagecheckerboard="0"
     showgrid="false"
     inkscape:zoom="0.68583333"
     inkscape:cx="661.23937"
     inkscape:cy="176.4277"
     inkscape:window-x="-1928"
     inkscape:window-y="166"
     inkscape:window-maximized="1"
     inkscape:current-layer="g12"
     units="mm"
     inkscape:document-units="mm"><inkscape:grid
       type="xygrid"
       id="grid114" /></sodipodi:namedview><g
     id="g10"
     inkscape:groupmode="layer"
     inkscape:label="ink_ext_XXXXXX"
     transform="matrix(1.3333333,0,0,-1.3333333,0,600)"><g
       id="g12"
       transform="scale(0.1)"><path
         d="m 1112.6974,3788.5625 c 26.02,0 47.14,-21.13 47.14,-47.14 0,-26.02 -21.12,-47.15 -47.14,-47.15 -26.02,0 -47.14,21.13 -47.14,47.15 0,26.01 21.12,47.14 47.14,47.14"
         style="fill:#373c56;fill-opacity:1;fill-rule:evenodd;stroke:none"
         id="path14" /><path
         d="m 1112.6974,3599.9925 c 26.02,0 47.14,-21.13 47.14,-47.15 0,-26.01 -21.12,-47.14 -47.14,-47.14 -26.02,0 -47.14,21.13 -47.14,47.14 0,26.02 21.12,47.15 47.14,47.15"
         style="fill:#373c56;fill-opacity:1;fill-rule:evenodd;stroke:none"
         id="path16" /><path
         d="m 1112.6974,3977.1325 c 26.02,0 47.14,-21.12 47.14,-47.14 0,-26.02 -21.12,-47.15 -47.14,-47.15 -26.02,0 -47.14,21.13 -47.14,47.15 0,26.02 21.12,47.14 47.14,47.14"
         style="fill:#373c56;fill-opacity:1;fill-rule:evenodd;stroke:none"
         id="path18" /><path
         d="m 1112.6974,3411.4225 c 26.02,0 47.14,-21.13 47.14,-47.15 0,-26.02 -21.12,-47.14 -47.14,-47.14 -26.02,0 -47.14,21.12 -47.14,47.14 0,26.02 21.12,47.15 47.14,47.15"
         style="fill:#373c56;fill-opacity:1;fill-rule:evenodd;stroke:none"
         id="path20" /><path
         d="m 1112.6974,3222.8425 c 26.02,0 47.14,-21.12 47.14,-47.14 0,-26.02 -21.12,-47.14 -47.14,-47.14 -26.02,0 -47.14,21.12 -47.14,47.14 0,26.02 21.12,47.14 47.14,47.14"
         style="fill:#373c56;fill-opacity:1;fill-rule:evenodd;stroke:none"
         id="path22" /><path
         d="m 1112.6974,3034.2725 c 26.02,0 47.14,-21.12 47.14,-47.14 0,-26.02 -21.12,-47.14 -47.14,-47.14 -26.02,0 -47.14,21.12 -47.14,47.14 0,26.02 21.12,47.14 47.14,47.14"
         style="fill:#373c56;fill-opacity:1;fill-rule:evenodd;stroke:none"
         id="path24" /><path
         d="m 1112.6974,2845.7025 c 26.02,0 47.14,-21.12 47.14,-47.14 0,-26.02 -21.12,-47.14 -47.14,-47.14 -26.02,0 -47.14,21.12 -47.14,47.14 0,26.02 21.12,47.14 47.14,47.14"
         style="fill:#373c56;fill-opacity:1;fill-rule:evenodd;stroke:none"
         id="path26" /><path
         d="m 1112.6974,2657.1325 c 26.02,0 47.14,-21.12 47.14,-47.14 0,-26.02 -21.12,-47.15 -47.14,-47.15 -26.02,0 -47.14,21.13 -47.14,47.15 0,26.02 21.12,47.14 47.14,47.14"
         style="fill:#373c56;fill-opacity:1;fill-rule:evenodd;stroke:none"
         id="path28" /><path
         d="m 1301.2674,3599.9925 c 26.02,0 47.14,-21.13 47.14,-47.15 0,-26.01 -21.12,-47.14 -47.14,-47.14 -26.02,0 -47.14,21.13 -47.14,47.14 0,26.02 21.12,47.15 47.14,47.15"
         style="fill:#373c56;fill-opacity:1;fill-rule:evenodd;stroke:none"
         id="path30" /><path
         d="m 924.12742,3599.9925 c 26.02,0 47.14,-21.13 47.14,-47.15 0,-26.01 -21.12,-47.14 -47.14,-47.14 -26.02,0 -47.14,21.13 -47.14,47.14 0,26.02 21.12,47.15 47.14,47.15"
         style="fill:#373c56;fill-opacity:1;fill-rule:evenodd;stroke:none"
         id="path32" /><path
         d="m 1301.2674,3411.4225 c 26.02,0 47.14,-21.13 47.14,-47.15 0,-26.02 -21.12,-47.14 -47.14,-47.14 -26.02,0 -47.14,21.12 -47.14,47.14 0,26.02 21.12,47.15 47.14,47.15"
         style="fill:#373c56;fill-opacity:1;fill-rule:evenodd;stroke:none"
         id="path34" /><path
         d="m 924.12742,3411.4225 c 26.02,0 47.14,-21.13 47.14,-47.15 0,-26.02 -21.12,-47.14 -47.14,-47.14 -26.02,0 -47.14,21.12 -47.14,47.14 0,26.02 21.12,47.15 47.14,47.15"
         style="fill:#373c56;fill-opacity:1;fill-rule:evenodd;stroke:none"
         id="path36" /><path
         d="m 1301.2674,3222.8425 c 26.02,0 47.14,-21.12 47.14,-47.14 0,-26.02 -21.12,-47.14 -47.14,-47.14 -26.02,0 -47.14,21.12 -47.14,47.14 0,26.02 21.12,47.14 47.14,47.14"
         style="fill:#373c56;fill-opacity:1;fill-rule:evenodd;stroke:none"
         id="path38" /><path
         d="m 924.12742,3222.8425 c 26.02,0 47.14,-21.12 47.14,-47.14 0,-26.02 -21.12,-47.14 -47.14,-47.14 -26.02,0 -47.14,21.12 -47.14,47.14 0,26.02 21.12,47.14 47.14,47.14"
         style="fill:#373c56;fill-opacity:1;fill-rule:evenodd;stroke:none"
         id="path40" /><path
         d="m 1489.8374,3222.8425 c 26.02,0 47.15,-21.12 47.15,-47.14 0,-26.02 -21.13,-47.14 -47.15,-47.14 -26.02,0 -47.14,21.12 -47.14,47.14 0,26.02 21.12,47.14 47.14,47.14"
         style="fill:#373c56;fill-opacity:1;fill-rule:evenodd;stroke:none"
         id="path42" /><path
         d="m 735.55742,3222.8425 c 26.02,0 47.14,-21.12 47.14,-47.14 0,-26.02 -21.12,-47.14 -47.14,-47.14 -26.02,0 -47.15,21.12 -47.15,47.14 0,26.02 21.13,47.14 47.15,47.14"
         style="fill:#373c56;fill-opacity:1;fill-rule:evenodd;stroke:none"
         id="path44" /><path
         d="m 1489.8374,3034.2725 c 26.02,0 47.15,-21.12 47.15,-47.14 0,-26.02 -21.13,-47.14 -47.15,-47.14 -26.02,0 -47.14,21.12 -47.14,47.14 0,26.02 21.12,47.14 47.14,47.14"
         style="fill:#373c56;fill-opacity:1;fill-rule:evenodd;stroke:none"
         id="path46" /><path
         d="m 735.55742,3034.2725 c 26.02,0 47.14,-21.12 47.14,-47.14 0,-26.02 -21.12,-47.14 -47.14,-47.14 -26.02,0 -47.15,21.12 -47.15,47.14 0,26.02 21.13,47.14 47.15,47.14"
         style="fill:#373c56;fill-opacity:1;fill-rule:evenodd;stroke:none"
         id="path48" /><path
         d="m 1678.4074,2845.7025 c 26.02,0 47.15,-21.12 47.15,-47.14 0,-26.02 -21.13,-47.14 -47.15,-47.14 -26.01,0 -47.14,21.12 -47.14,47.14 0,26.02 21.13,47.14 47.14,47.14"
         style="fill:#373c56;fill-opacity:1;fill-rule:evenodd;stroke:none"
         id="path50" /><path
         d="m 546.98742,2845.7025 c 26.01,0 47.14,-21.12 47.14,-47.14 0,-26.02 -21.13,-47.14 -47.14,-47.14 -26.02,0 -47.15,21.12 -47.15,47.14 0,26.02 21.13,47.14 47.15,47.14"
         style="fill:#373c56;fill-opacity:1;fill-rule:evenodd;stroke:none"
         id="path52" /><path
         d="m 1866.9874,2657.1325 c 26.01,0 47.14,-21.12 47.14,-47.14 0,-26.02 -21.13,-47.15 -47.14,-47.15 -26.02,0 -47.15,21.13 -47.15,47.15 0,26.02 21.13,47.14 47.15,47.14"
         style="fill:#373c56;fill-opacity:1;fill-rule:evenodd;stroke:none"
         id="path54" /><path
         d="m 1866.9874,2468.5625 c 26.01,0 47.14,-21.13 47.14,-47.14 0,-26.02 -21.13,-47.15 -47.14,-47.15 -26.02,0 -47.15,21.13 -47.15,47.15 0,26.01 21.13,47.14 47.15,47.14"
         style="fill:#373c56;fill-opacity:1;fill-rule:evenodd;stroke:none"
         id="path56" /><path
         d="m 2055.5574,2279.9925 c 26.02,0 47.14,-21.13 47.14,-47.15 0,-26.01 -21.12,-47.14 -47.14,-47.14 -26.02,0 -47.15,21.13 -47.15,47.14 0,26.02 21.13,47.15 47.15,47.15"
         style="fill:#373c56;fill-opacity:1;fill-rule:evenodd;stroke:none"
         id="path58" /><path
         d="m 358.40742,2657.1325 c 26.02,0 47.15,-21.12 47.15,-47.14 0,-26.02 -21.13,-47.15 -47.15,-47.15 -26.01,0 -47.14,21.13 -47.14,47.15 0,26.02 21.13,47.14 47.14,47.14"
         style="fill:#373c56;fill-opacity:1;fill-rule:evenodd;stroke:none"
         id="path60" /><path
         d="m 358.40742,2468.5625 c 26.02,0 47.15,-21.13 47.15,-47.14 0,-26.02 -21.13,-47.15 -47.15,-47.15 -26.01,0 -47.14,21.13 -47.14,47.15 0,26.01 21.13,47.14 47.14,47.14"
         style="fill:#373c56;fill-opacity:1;fill-rule:evenodd;stroke:none"
         id="path62" /><path
         d="m 169.83742,2279.9925 c 26.02,0 47.15,-21.13 47.15,-47.15 0,-26.01 -21.13,-47.14 -47.15,-47.14 -26.02,0 -47.14,21.13 -47.14,47.14 0,26.02 21.12,47.15 47.14,47.15"
         style="fill:#373c56;fill-opacity:1;fill-rule:evenodd;stroke:none"
         id="path64" /><path
         d="m 1301.2674,3034.2725 c 26.02,0 47.14,-21.12 47.14,-47.14 0,-26.02 -21.12,-47.14 -47.14,-47.14 -26.02,0 -47.14,21.12 -47.14,47.14 0,26.02 21.12,47.14 47.14,47.14"
         style="fill:#373c56;fill-opacity:1;fill-rule:evenodd;stroke:none"
         id="path66" /><path
         d="m 924.12742,3034.2725 c 26.02,0 47.14,-21.12 47.14,-47.14 0,-26.02 -21.12,-47.14 -47.14,-47.14 -26.02,0 -47.14,21.12 -47.14,47.14 0,26.02 21.12,47.14 47.14,47.14"
         style="fill:#373c56;fill-opacity:1;fill-rule:evenodd;stroke:none"
         id="path68" /><path
         d="m 735.55742,2845.7025 c 26.02,0 47.14,-21.12 47.14,-47.14 0,-26.02 -21.12,-47.14 -47.14,-47.14 -26.02,0 -47.15,21.12 -47.15,47.14 0,26.02 21.13,47.14 47.15,47.14"
         style="fill:#373c56;fill-opacity:1;fill-rule:evenodd;stroke:none"
         id="path70" /><path
         d="m 924.12742,2845.7025 c 26.02,0 47.14,-21.12 47.14,-47.14 0,-26.02 -21.12,-47.14 -47.14,-47.14 -26.02,0 -47.14,21.12 -47.14,47.14 0,26.02 21.12,47.14 47.14,47.14"
         style="fill:#373c56;fill-opacity:1;fill-rule:evenodd;stroke:none"
         id="path72" /><path
         d="m 1489.8374,2657.1325 c 26.02,0 47.15,-21.12 47.15,-47.14 0,-26.02 -21.13,-47.15 -47.15,-47.15 -26.02,0 -47.14,21.13 -47.14,47.15 0,26.02 21.12,47.14 47.14,47.14"
         style="fill:#373c56;fill-opacity:1;fill-rule:evenodd;stroke:none"
         id="path74" /><path
         d="m 1489.8374,2845.7025 c 26.02,0 47.15,-21.12 47.15,-47.14 0,-26.02 -21.13,-47.14 -47.15,-47.14 -26.02,0 -47.14,21.12 -47.14,47.14 0,26.02 21.12,47.14 47.14,47.14"
         style="fill:#373c56;fill-opacity:1;fill-rule:evenodd;stroke:none"
         id="path76" /><path
         d="m 1301.2674,2845.7025 c 26.02,0 47.14,-21.12 47.14,-47.14 0,-26.02 -21.12,-47.14 -47.14,-47.14 -26.02,0 -47.14,21.12 -47.14,47.14 0,26.02 21.12,47.14 47.14,47.14"
         style="fill:#373c56;fill-opacity:1;fill-rule:evenodd;stroke:none"
         id="path78" /><path
         d="m 1678.4074,2657.1325 c 26.02,0 47.15,-21.12 47.15,-47.14 0,-26.02 -21.13,-47.15 -47.15,-47.15 -26.01,0 -47.14,21.13 -47.14,47.15 0,26.02 21.13,47.14 47.14,47.14"
         style="fill:#373c56;fill-opacity:1;fill-rule:evenodd;stroke:none"
         id="path80" /><path
         d="m 1678.4074,2468.5625 c 26.02,0 47.15,-21.13 47.15,-47.14 0,-26.02 -21.13,-47.15 -47.15,-47.15 -26.01,0 -47.14,21.13 -47.14,47.15 0,26.01 21.13,47.14 47.14,47.14"
         style="fill:#373c56;fill-opacity:1;fill-rule:evenodd;stroke:none"
         id="path82" /><path
         d="m 1301.2674,2468.5625 c 26.02,0 47.14,-21.13 47.14,-47.14 0,-26.02 -21.12,-47.15 -47.14,-47.15 -26.02,0 -47.14,21.13 -47.14,47.15 0,26.01 21.12,47.14 47.14,47.14"
         style="fill:#373c56;fill-opacity:1;fill-rule:evenodd;stroke:none"
         id="path84" /><path
         d="m 1112.6974,2279.9925 c 26.02,0 47.14,-21.13 47.14,-47.15 0,-26.01 -21.12,-47.14 -47.14,-47.14 -26.02,0 -47.14,21.13 -47.14,47.14 0,26.02 21.12,47.15 47.14,47.15"
         style="fill:#373c56;fill-opacity:1;fill-rule:evenodd;stroke:none"
         id="path86" /><path
         d="m 924.12742,2468.5625 c 26.02,0 47.14,-21.13 47.14,-47.14 0,-26.02 -21.12,-47.15 -47.14,-47.15 -26.02,0 -47.14,21.13 -47.14,47.15 0,26.01 21.12,47.14 47.14,47.14"
         style="fill:#373c56;fill-opacity:1;fill-rule:evenodd;stroke:none"
         id="path88" /><path
         d="m 1112.6974,3788.5625 c 26.02,0 47.14,-21.13 47.14,-47.14 0,-26.02 -21.12,-47.15 -47.14,-47.15 -26.02,0 -47.14,21.13 -47.14,47.15 0,26.01 21.12,47.14 47.14,47.14"
         style="fill:#373c56;fill-opacity:1;fill-rule:evenodd;stroke:none"
         id="path90" /><path
         d="m 924.12742,2657.1325 c 26.02,0 47.14,-21.12 47.14,-47.14 0,-26.02 -21.12,-47.15 -47.14,-47.15 -26.02,0 -47.14,21.13 -47.14,47.15 0,26.02 21.12,47.14 47.14,47.14"
         style="fill:#373c56;fill-opacity:1;fill-rule:evenodd;stroke:none"
         id="path92" /><path
         d="m 735.55742,2657.1325 c 26.02,0 47.14,-21.12 47.14,-47.14 0,-26.02 -21.12,-47.15 -47.14,-47.15 -26.02,0 -47.15,21.13 -47.15,47.15 0,26.02 21.13,47.14 47.15,47.14"
         style="fill:#373c56;fill-opacity:1;fill-rule:evenodd;stroke:none"
         id="path94" /><path
         d="m 546.98742,2657.1325 c 26.01,0 47.14,-21.12 47.14,-47.14 0,-26.02 -21.13,-47.15 -47.14,-47.15 -26.02,0 -47.15,21.13 -47.15,47.15 0,26.02 21.13,47.14 47.15,47.14"
         style="fill:#373c56;fill-opacity:1;fill-rule:evenodd;stroke:none"
         id="path96" /><path
         d="m 546.98742,2468.5625 c 26.01,0 47.14,-21.13 47.14,-47.14 0,-26.02 -21.13,-47.15 -47.14,-47.15 -26.02,0 -47.15,21.13 -47.15,47.15 0,26.01 21.13,47.14 47.15,47.14"
         style="fill:#373c56;fill-opacity:1;fill-rule:evenodd;stroke:none"
         id="path98" /><path
         d="m 546.98742,2091.4225 c 26.01,0 47.14,-21.13 47.14,-47.15 0,-26.02 -21.13,-47.14 -47.14,-47.14 -26.02,0 -47.15,21.12 -47.15,47.14 0,26.02 21.13,47.15 47.15,47.15"
         style="fill:#373c56;fill-opacity:1;fill-rule:evenodd;stroke:none"
         id="path102" /><path
         d="m 735.55742,2279.9925 c 26.02,0 47.14,-21.13 47.14,-47.15 0,-26.01 -21.12,-47.14 -47.14,-47.14 -26.02,0 -47.15,21.13 -47.15,47.14 0,26.02 21.13,47.15 47.15,47.15"
         style="fill:#373c56;fill-opacity:1;fill-rule:evenodd;stroke:none"
         id="path100" /><path
         d="M 4091.5761,2037.5297 V 3663.6019 H 3791.339 L 3213.1658,2340.2837 2639.6121,3663.6019 H 2334.7873 V 2037.5297 h 222.215 v 1265.9724 l 550.6472,-1265.9724 h 206.4768 l 555.2348,1265.9724 V 2037.5297 h 222.215"
         style="fill:#373c56;fill-opacity:1;fill-rule:nonzero;stroke:none;stroke-width:3.18588"
         id="path104" /><path
         d="m 4770.5505,3489.2707 h -197.0147 v -178.919 c 0,-96.3409 -50.4325,-169.7435 -169.7118,-169.7435 h -59.6396 v -194.6891 h 211.0326 v -605.8266 c 0,-199.4997 119.12,-314.032 307.0868,-314.032 73.4026,0 128.4546,13.763 146.8052,20.6445 v 183.2517 c -18.3506,-4.5876 -57.3458,-9.1753 -84.8718,-9.1753 -112.3977,0 -153.6867,50.4643 -153.6867,151.4248 v 573.7129 h 238.5585 v 194.6891 h -238.5585 v 348.6625"
         style="fill:#373c56;fill-opacity:1;fill-rule:nonzero;stroke:none;stroke-width:3.18588"
         id="path106" /><path
         d="m 5488.52,2675.2151 c 0,167.4497 87.2293,302.7858 257.0685,302.7858 192.7775,0 257.0367,-123.8669 257.0367,-277.5537 v -662.9175 h 215.3335 v 699.6188 c 0,245.4401 -130.5892,435.5733 -394.348,435.5733 -128.5184,0 -259.3624,-52.6944 -339.6784,-190.1332 v 158.0196 H 5273.1865 V 2037.5297 H 5488.52 v 637.6854"
         style="fill:#373c56;fill-opacity:1;fill-rule:nonzero;stroke:none;stroke-width:3.18588"
         id="path108" /><path
         d="m 6711.1326,2851.7127 c 0,424.4546 284.4989,640.1385 587.3485,640.1385 302.8814,0 587.3804,-215.6839 587.3804,-640.1385 0,-424.4545 -284.499,-642.4005 -587.3804,-642.4005 -302.8496,0 -587.3485,217.946 -587.3485,642.4005 z m -229.0965,0 c 0,-543.7657 408.0473,-848.5905 816.445,-848.5905 408.4296,0 816.4769,304.8248 816.4769,848.5905 0,543.7657 -408.0473,846.2967 -816.4769,846.2967 -408.3977,0 -816.445,-302.531 -816.445,-846.2967"
         style="fill:#373c56;fill-opacity:1;fill-rule:nonzero;stroke:none;stroke-width:3.18588"
         id="path110" /><path
         d="m 9450.0002,3294.5179 c -36.6694,176.6888 -183.2835,403.4915 -550.4241,403.4915 -300.6195,0 -536.5975,-229.0965 -536.5975,-483.7756 0,-243.2099 164.9329,-394.6347 396.61,-445.099 l 231.8045,-50.4962 c 162.9258,-34.4075 243.2418,-135.368 243.2418,-252.3853 0,-142.2494 -110.1677,-259.2349 -335.0588,-259.2349 -245.5357,0 -373.9266,167.4816 -389.9834,348.7262 l -215.4291,-68.8149 c 29.8198,-231.7408 215.4291,-483.8075 607.7063,-483.8075 346.4961,0 561.8615,229.1284 561.8615,481.4818 0,227.1531 -151.2018,396.9285 -421.874,456.6 l -243.2418,52.7582 c -137.6937,29.8198 -208.8343,119.3111 -208.8343,236.3284 0,151.4248 130.8121,270.7041 314.3824,270.7041 227.2169,0 325.8835,-160.5683 344.2023,-277.5856 l 201.6342,71.1088"
         style="fill:#373c56;fill-opacity:1;fill-rule:nonzero;stroke:none;stroke-width:3.18588"
         id="path112" /></g></g></svg>
