0000000000000692 <main>:
 692:	55                   	push   rbp
 693:	48 89 e5             	mov    rbp,rsp
 696:	48 83 ec 10          	sub    rsp,0x10
 69a:	c7 45 f0 0a 00 00 00 	mov    DWORD PTR [rbp-0x10],0xa
 6a1:	c7 45 f4 21 00 00 00 	mov    DWORD PTR [rbp-0xc],0x21
 6a8:	c7 45 f8 1c 00 00 00 	mov    DWORD PTR [rbp-0x8],0x1c
 6af:	8b 55 f8             	mov    edx,DWORD PTR [rbp-0x8]
 6b2:	8b 4d f4             	mov    ecx,DWORD PTR [rbp-0xc]
 6b5:	8b 45 f0             	mov    eax,DWORD PTR [rbp-0x10]
 6b8:	89 ce                	mov    esi,ecx
 6ba:	89 c7                	mov    edi,eax
 6bc:	e8 79 ff ff ff       	call   63a <to_seconds>
 6c1:	89 45 fc             	mov    DWORD PTR [rbp-0x4],eax
 6c4:	b8 00 00 00 00       	mov    eax,0x0
 6c9:	c9                   	leave  
 6ca:	c3                   	ret    
 6cb:	0f 1f 44 00 00       	nop    DWORD PTR [rax+rax*1+0x0]
