\BOOKMARK [1][]{section*.1}{\376\377\000\311\000d\000u\000c\000a\000t\000i\000o\000n}{}% 1
\BOOKMARK [1][]{section*.2}{\376\377\000M\000a\000n\000u\000s\000c\000r\000i\000t\000s}{}% 2
\BOOKMARK [2][]{section*.3}{\376\377\000T\000h\000\350\000s\000e\000\040\000d\000e\000\040\000d\000o\000c\000t\000o\000r\000a\000t}{section*.2}% 3
\BOOKMARK [2][]{section*.4}{\376\377\000M\000\351\000m\000o\000i\000r\000e\000\040\000d\000e\000\040\000m\000a\000s\000t\000e\000r}{section*.2}% 4
\BOOKMARK [1][]{section*.5}{\376\377\000E\000x\000p\000\351\000r\000i\000e\000n\000c\000e\000s}{}% 5
\BOOKMARK [2][]{section*.6}{\376\377\000T\000e\000a\000c\000h\000i\000n\000g\000\040\000A\000s\000s\000i\000s\000t\000a\000n\000t}{section*.5}% 6
\BOOKMARK [2][]{section*.7}{\376\377\000E\000x\000t\000r\000a\000-\000a\000c\000a\000d\000\351\000m\000i\000q\000u\000e}{section*.5}% 7
\BOOKMARK [1][]{section*.8}{\376\377\000P\000u\000b\000l\000i\000c\000a\000t\000i\000o\000n\000s}{}% 8
\BOOKMARK [1][]{section*.9}{\376\377\000C\000o\000m\000m\000u\000n\000i\000c\000a\000t\000i\000o\000n\000s}{}% 9
\BOOKMARK [1][]{section*.10}{\376\377\000L\000a\000n\000g\000u\000a\000g\000e\000s}{}% 10
\BOOKMARK [1][]{section*.11}{\376\377\000C\000o\000m\000p\000\351\000t\000e\000n\000c\000e\000s}{}% 11
\BOOKMARK [1][]{section*.12}{\376\377\000P\000a\000r\000t\000i\000c\000i\000p\000a\000t\000i\000o\000n\000\040\000\340\000\040\000d\000e\000s\000\040\000\351\000v\000\350\000n\000e\000m\000e\000n\000t\000s}{}% 12
\BOOKMARK [1][]{section*.13}{\376\377\000C\000e\000r\000t\000i\000f\000i\000c\000a\000t\000i\000o\000n\000s}{}% 13
\BOOKMARK [1][]{section*.14}{\376\377\000R\000\351\000f\000\351\000r\000e\000n\000c\000e\000s}{}% 14
