<svg xmlns="http://www.w3.org/2000/svg" xmlns:xlink="http://www.w3.org/1999/xlink" width="288" height="94" viewBox="0 0 288 94">
  <defs>
    <filter id="Mask" x="-12" y="-4" width="312" height="118" filterUnits="userSpaceOnUse">
      <feOffset dy="8" input="SourceAlpha"/>
      <feGaussianBlur stdDeviation="4" result="blur"/>
      <feFlood flood-color="#5b6e86" flood-opacity="0.302"/>
      <feComposite operator="in" in2="blur"/>
      <feComposite in="SourceGraphic"/>
    </filter>
    <clipPath id="clip-path">
      <g transform="matrix(1, 0, 0, 1, 0, 0)" filter="url(#Mask)">
        <rect id="Mask-2" data-name="Mask" width="288" height="94" rx="8" fill="#fff"/>
      </g>
    </clipPath>
  </defs>
  <g id="Enmascarar_grupo_6" data-name="Enmascarar grupo 6" clip-path="url(#clip-path)">
    <g id="color_sea-green" data-name="color/sea-green">
      <rect id="Rectangle" width="288" height="94" fill="#f2b10d"/>
    </g>
    <g id="Symbol_Destacada" data-name="Symbol/Destacada" transform="translate(223 15)">
      <g id="Salir2" transform="translate(8.602 5.556)">
        <path id="Path" d="M0,0H14.219V38.889H0V35.222H10.719V3.667H0Z" transform="translate(19.523)" fill="#fff"/>
        <path id="Path-2" data-name="Path" d="M.164,7.236,5.523,13.57a.558.558,0,0,0,.984-.333V8.681H25.539V5.459H6.508V.57A.539.539,0,0,0,5.523.236L.164,6.459A.543.543,0,0,0,.164,7.236Z" transform="translate(0 12.541)" fill="#fff"/>
      </g>
    </g>
    <text id="Operativa" transform="translate(30 61.433)" fill="#fff" font-size="26" font-family="SegoeUI, Segoe UI"><tspan x="0" y="0">Cancelar</tspan></text>
  </g>
</svg>
