<svg id="Grupo_2204" data-name="Grupo 2204" xmlns="http://www.w3.org/2000/svg" xmlns:xlink="http://www.w3.org/1999/xlink" width="458.983" height="423.416" viewBox="0 0 458.983 423.416">
  <defs>
    <clipPath id="clip-path">
      <path id="Trazado_1297" data-name="Trazado 1297" d="M786.708-619C669.785-619,575-524.213,575-407.29s94.785,211.708,211.708,211.708S998.416-290.367,998.416-407.29,903.631-619,786.708-619Z" transform="translate(-575 618.998)" fill="none"/>
    </clipPath>
    <clipPath id="clip-path-2">
      <path id="Trazado_1299" data-name="Trazado 1299" d="M821.091-619A11.291,11.291,0,0,0,809.8-607.706a11.291,11.291,0,0,0,11.291,11.291,11.291,11.291,0,0,0,11.291-11.291A11.291,11.291,0,0,0,821.091-619Z" transform="translate(-809.8 618.998)" fill="none"/>
    </clipPath>
    <clipPath id="clip-path-3">
      <path id="Trazado_1301" data-name="Trazado 1301" d="M574.091-535.4A11.291,11.291,0,0,0,562.8-524.107a11.291,11.291,0,0,0,11.291,11.291,11.291,11.291,0,0,0,11.291-11.291A11.291,11.291,0,0,0,574.091-535.4Z" transform="translate(-562.8 535.398)" fill="none"/>
    </clipPath>
    <clipPath id="clip-path-4">
      <path id="Trazado_1303" data-name="Trazado 1303" d="M829.091-338A11.291,11.291,0,0,0,817.8-326.706a11.291,11.291,0,0,0,11.291,11.291,11.291,11.291,0,0,0,11.291-11.291A11.291,11.291,0,0,0,829.091-338Z" transform="translate(-817.8 337.998)" fill="none"/>
    </clipPath>
    <clipPath id="clip-path-5">
      <path id="Trazado_1305" data-name="Trazado 1305" d="M876.228-362A28.228,28.228,0,0,0,848-333.77a28.228,28.228,0,0,0,28.228,28.228,28.228,28.228,0,0,0,28.228-28.228A28.228,28.228,0,0,0,876.228-362Z" transform="translate(-848 361.998)" fill="none"/>
    </clipPath>
  </defs>
  <g id="Grupo_2147" data-name="Grupo 2147" transform="translate(17.219)" clip-path="url(#clip-path)">
    <path id="Trazado_1296" data-name="Trazado 1296" d="M1007.53-186.468H570V-624h437.53Z" transform="translate(-577.057 616.941)" fill="rgba(23,164,77,0.1)"/>
  </g>
  <g id="Grupo_2148" data-name="Grupo 2148" transform="translate(348.612)" clip-path="url(#clip-path-2)">
    <path id="Trazado_1298" data-name="Trazado 1298" d="M841.5-587.3H804.8V-624h36.7Z" transform="translate(-811.857 616.941)" fill="rgba(23,164,77,0.1)"/>
  </g>
  <g id="Grupo_2149" data-name="Grupo 2149" transform="translate(0 117.992)" clip-path="url(#clip-path-3)">
    <path id="Trazado_1300" data-name="Trazado 1300" d="M594.5-503.7H557.8v-36.7h36.7Z" transform="translate(-564.857 533.341)" fill="rgba(23,164,77,0.1)"/>
  </g>
  <g id="Grupo_2150" data-name="Grupo 2150" transform="translate(359.903 396.6)" clip-path="url(#clip-path-4)">
    <path id="Trazado_1302" data-name="Trazado 1302" d="M849.5-306.3H812.8V-343h36.7Z" transform="translate(-819.857 335.941)" fill="rgba(23,164,77,0.1)"/>
  </g>
  <g id="Grupo_2151" data-name="Grupo 2151" transform="translate(402.527 362.726)" clip-path="url(#clip-path-5)">
    <path id="Trazado_1304" data-name="Trazado 1304" d="M913.569-296.428H843V-367h70.569Z" transform="translate(-850.057 359.941)" fill="rgba(23,164,77,0.1)"/>
  </g>
  <g id="Grupo_1950" data-name="Grupo 1950" transform="translate(44.127 60.938)">
    <g id="escaner-de-codigo-de-barras">
      <path id="Trazado_1140" data-name="Trazado 1140" d="M332.736,312.042H69.863A10.863,10.863,0,0,1,59,301.18V141.863A10.863,10.863,0,0,1,69.863,131H332.736A10.863,10.863,0,0,1,343.6,141.863V301.18A10.863,10.863,0,0,1,332.736,312.042Z" transform="translate(-16.274 -75.239)" fill="#e1e3e8"/>
      <path id="Trazado_1141" data-name="Trazado 1141" d="M387.074,131H256V312.042H387.074a10.863,10.863,0,0,0,10.863-10.863V141.863A10.863,10.863,0,0,0,387.074,131Z" transform="translate(-70.613 -75.239)" fill="#cbced7"/>
      <path id="Trazado_1142" data-name="Trazado 1142" d="M475.486,121.348a10.863,10.863,0,0,1-10.863-10.863V75.725H429.867a10.863,10.863,0,0,1,0-21.725h45.62a10.863,10.863,0,0,1,10.862,10.863v45.623A10.863,10.863,0,0,1,475.486,121.348Z" transform="translate(-115.575 -54)" fill="#278252"/>
      <path id="Trazado_1143" data-name="Trazado 1143" d="M56.482,432.348H10.863A10.863,10.863,0,0,1,0,421.485V375.863a10.863,10.863,0,1,1,21.725,0v34.76H56.482a10.863,10.863,0,0,1,0,21.725Z" transform="translate(0 -139.784)" fill="#19d289"/>
      <path id="Trazado_1144" data-name="Trazado 1144" d="M475.486,432.348h-45.62a10.863,10.863,0,0,1,0-21.725h34.757v-34.76a10.863,10.863,0,1,1,21.725,0v45.623A10.863,10.863,0,0,1,475.486,432.348Z" transform="translate(-115.575 -139.784)" fill="#278252"/>
      <path id="Trazado_1145" data-name="Trazado 1145" d="M189.864,327.608A10.863,10.863,0,0,1,179,316.745v-2.933a10.863,10.863,0,1,1,21.725,0v2.933A10.863,10.863,0,0,1,189.864,327.608Z" transform="translate(-49.374 -122.668)" fill="#404d60"/>
      <path id="Trazado_1146" data-name="Trazado 1146" d="M249.864,327.608A10.863,10.863,0,0,1,239,316.745v-2.933a10.863,10.863,0,1,1,21.725,0v2.933A10.863,10.863,0,0,1,249.864,327.608Z" transform="translate(-65.924 -122.668)" fill="#404d60"/>
      <path id="Trazado_1147" data-name="Trazado 1147" d="M309.863,327.608A10.863,10.863,0,0,1,299,316.745v-2.933a10.863,10.863,0,1,1,21.725,0v2.933A10.863,10.863,0,0,1,309.863,327.608Z" transform="translate(-82.474 -122.668)" fill="#212cbb"/>
      <path id="Trazado_1148" data-name="Trazado 1148" d="M10.867,121.348A10.863,10.863,0,0,1,0,110.485V64.863A10.863,10.863,0,0,1,10.867,54h45.62a10.863,10.863,0,0,1,0,21.725H21.729v34.76A10.863,10.863,0,0,1,10.867,121.348Z" transform="translate(-0.001 -54)" fill="#19d289"/>
      <path id="Trazado_1149" data-name="Trazado 1149" d="M119,131V268.693a10.863,10.863,0,0,0,21.725,0V131Z" transform="translate(-32.824 -75.239)" fill="#404d60"/>
      <path id="Trazado_1150" data-name="Trazado 1150" d="M179,131v98.487a10.863,10.863,0,1,0,21.725,0V131Z" transform="translate(-49.374 -75.239)" fill="#404d60"/>
      <path id="Trazado_1151" data-name="Trazado 1151" d="M239,131v98.487a10.863,10.863,0,1,0,21.725,0V131Z" transform="translate(-65.924 -75.239)" fill="#404d60"/>
      <path id="Trazado_1152" data-name="Trazado 1152" d="M320.726,131H299v98.487a10.863,10.863,0,1,0,21.725,0Z" transform="translate(-82.474 -75.239)" fill="#212cbb"/>
      <path id="Trazado_1153" data-name="Trazado 1153" d="M380.727,131H359V268.693a10.863,10.863,0,0,0,21.725,0Z" transform="translate(-99.024 -75.239)" fill="#212cbb"/>
      <path id="Trazado_1154" data-name="Trazado 1154" d="M352.963,247.725H26.363a10.863,10.863,0,0,1,0-21.725h326.6a10.863,10.863,0,1,1,0,21.725Z" transform="translate(-4.275 -101.443)" fill="#19d289"/>
      <path id="Trazado_1155" data-name="Trazado 1155" d="M309.863,327.608A10.863,10.863,0,0,1,299,316.745v-2.933a10.863,10.863,0,1,1,21.725,0v2.933A10.863,10.863,0,0,1,309.863,327.608Z" transform="translate(-82.474 -122.668)" fill="#273244"/>
      <path id="Trazado_1156" data-name="Trazado 1156" d="M320.726,131H299v98.487a10.863,10.863,0,1,0,21.725,0Z" transform="translate(-82.474 -75.239)" fill="#273244"/>
      <path id="Trazado_1157" data-name="Trazado 1157" d="M380.727,131H359V268.693a10.863,10.863,0,0,0,21.725,0Z" transform="translate(-99.024 -75.239)" fill="#273244"/>
      <path id="Trazado_1158" data-name="Trazado 1158" d="M256,131V240.242a10.857,10.857,0,0,0,9.415-10.755V131Z" transform="translate(-70.613 -75.239)" fill="#273244"/>
      <path id="Trazado_1159" data-name="Trazado 1159" d="M256,303.1v24.443a10.857,10.857,0,0,0,9.415-10.755v-2.933A10.856,10.856,0,0,0,256,303.1Z" transform="translate(-70.613 -122.709)" fill="#273244"/>
      <path id="Trazado_1160" data-name="Trazado 1160" d="M419.3,226H256v21.725H419.3a10.863,10.863,0,0,0,0-21.725Z" transform="translate(-70.613 -101.443)" fill="#278252"/>
    </g>
  </g>
</svg>
