{
	"info": {
		"_postman_id": "5bcdc4a1-101a-4434-9d1c-d7618595de89",
		"name": "QAGorestPost",
		"schema": "https://schema.getpostman.com/json/collection/v2.1.0/collection.json",
		"_exporter_id": "25558714"
	},
	"item": [
		{
			"name": "New Request",
			"request": {
				"auth": {
					"type": "bearer",
					"bearer": [
						{
							"key": "token",
							"value": "7ab49ac21928c10cd5f2ef87b509b6337a2edafb0098424af8bee885f2a3920a",
							"type": "string"
						}
					]
				},
				"method": "GET",
				"header": [],
				"url": {
					"raw": "https://gorest.co.in/public/v2/posts/{{id}}",
					"protocol": "https",
					"host": [
						"gorest",
						"co",
						"in"
					],
					"path": [
						"public",
						"v2",
						"posts",
						"{{id}}"
					]
				}
			},
			"response": []
		},
		{
			"name": "New Request",
			"event": [
				{
					"listen": "prerequest",
					"script": {
						"exec": [
							""
						],
						"type": "text/javascript"
					}
				},
				{
					"listen": "test",
					"script": {
						"exec": [
							"pm.test(\"validatestatus code\", function() {",
							"    pm.response.to.have.status(201);",
							"})",
							""
						],
						"type": "text/javascript"
					}
				}
			],
			"request": {
				"auth": {
					"type": "bearer",
					"bearer": [
						{
							"key": "token",
							"value": "7ab49ac21928c10cd5f2ef87b509b6337a2edafb0098424af8bee885f2a3920a",
							"type": "string"
						}
					]
				},
				"method": "POST",
				"header": [],
				"body": {
					"mode": "raw",
					"raw": "{\"id\":15409,\n\"user_id\":193546,\n\"title\":\"PostmanPractice\",\n\"body\":\"create account and send your first api request\"}",
					"options": {
						"raw": {
							"language": "json"
						}
					}
				},
				"url": {
					"raw": "https://gorest.co.in/public/v2/posts",
					"protocol": "https",
					"host": [
						"gorest",
						"co",
						"in"
					],
					"path": [
						"public",
						"v2",
						"posts"
					]
				}
			},
			"response": []
		},
		{
			"name": "New Request",
			"request": {
				"auth": {
					"type": "bearer",
					"bearer": [
						{
							"key": "token",
							"value": "7ab49ac21928c10cd5f2ef87b509b6337a2edafb0098424af8bee885f2a3920a",
							"type": "string"
						}
					]
				},
				"method": "PUT",
				"header": [],
				"body": {
					"mode": "raw",
					"raw": "{\n    \"id\": 15414,\n    \"user_id\": 193546,\n    \"title\": \"PostmanPractice with put method\",\n    \"body\": \"create account and send your first api request\"\n}",
					"options": {
						"raw": {
							"language": "json"
						}
					}
				},
				"url": {
					"raw": "https://gorest.co.in/public/v2/posts/{{id}}",
					"protocol": "https",
					"host": [
						"gorest",
						"co",
						"in"
					],
					"path": [
						"public",
						"v2",
						"posts",
						"{{id}}"
					]
				}
			},
			"response": []
		},
		{
			"name": "New Request",
			"request": {
				"auth": {
					"type": "bearer",
					"bearer": [
						{
							"key": "token",
							"value": "7ab49ac21928c10cd5f2ef87b509b6337a2edafb0098424af8bee885f2a3920a",
							"type": "string"
						}
					]
				},
				"method": "DELETE",
				"header": [],
				"url": {
					"raw": "https://gorest.co.in/public/v2/posts/{{id}}",
					"protocol": "https",
					"host": [
						"gorest",
						"co",
						"in"
					],
					"path": [
						"public",
						"v2",
						"posts",
						"{{id}}"
					]
				}
			},
			"response": []
		}
	],
	"event": [
		{
			"listen": "prerequest",
			"script": {
				"type": "text/javascript",
				"exec": [
					""
				]
			}
		},
		{
			"listen": "test",
			"script": {
				"type": "text/javascript",
				"exec": [
					""
				]
			}
		}
	],
	"variable": [
		{
			"key": "id",
			"value": "15409",
			"type": "string"
		}
	]
}