<?xml version="1.0" encoding="iso-8859-1"?>
<!-- Generator: Adobe Illustrator 16.0.0, SVG Export Plug-In . SVG Version: 6.00 Build 0)  -->
<!DOCTYPE svg PUBLIC "-//W3C//DTD SVG 1.1//EN" "http://www.w3.org/Graphics/SVG/1.1/DTD/svg11.dtd">
<svg version="1.1" id="Capa_1" xmlns="http://www.w3.org/2000/svg" xmlns:xlink="http://www.w3.org/1999/xlink" x="0px" y="0px"
	 width="612.011px" height="612.011px" viewBox="0 0 612.011 612.011" style="enable-background:new 0 0 612.011 612.011;"
	 xml:space="preserve">
<g>
	<path d="M372.151,103.533l0.021-29.93l-132.368,0.155l0.022,29.775H372.151z M601.319,337.82l-1.702,0.576l-2.3,0.773
		c-1.936,0.641-3.837,1.293-5.771,1.891c-3.328,1.094-6.767,2.145-10.194,3.184l-2.477,0.775l-5.904,1.812
		c-3.417,1.027-6.844,1.979-10.25,2.93l-3.327,0.951c-1.78,0.52-3.594,1.027-5.396,1.537c-2.312,0.607-4.6,1.193-6.889,1.779
		l-3.328,0.863l-2.433,0.652c-2.211,0.574-4.434,1.148-6.655,1.703c-2.665,0.662-5.385,1.293-8.116,1.934l-2.09,0.486l-2.155,0.51
		c-2.399,0.574-4.776,1.148-7.176,1.658c-2.422,0.553-4.865,1.061-7.342,1.592l-2.896,0.619l-3.45,0.73
		c-2.045,0.408-4.112,0.861-6.158,1.281c-2.477,0.477-4.942,0.939-7.408,1.404l-2.952,0.553l-2.841,0.531
		c-2.311,0.441-4.61,0.885-6.91,1.283c-2.698,0.475-5.462,0.916-8.227,1.381l-2.3,0.365l-3.106,0.52
		c-2.223,0.387-4.445,0.74-6.679,1.096c-2.919,0.453-5.838,0.873-8.745,1.281l-2.034,0.277l-3.583,0.52
		c-2.067,0.32-4.168,0.598-6.269,0.885c-2.565,0.342-5.152,0.652-7.751,0.961l-3.173,0.354l-2.543,0.322
		c-2.443,0.309-4.888,0.607-7.331,0.873c-3.007,0.309-5.937,0.607-8.878,0.885l-2.123,0.199l-3.284,0.33
		c-2.267,0.223-4.544,0.453-6.833,0.664c-2.267,0.199-4.5,0.354-6.744,0.52l-3.837,0.277l-2.963,0.23
		c-2.609,0.199-5.219,0.41-7.828,0.588c-2.012,0.143-4.068,0.221-6.136,0.354l-3.55,0.199l-4.224,0.221
		c-1.459,0.1-2.94,0.166-4.378,0.266v32.627c-0.044,15.844-12.925,28.758-28.758,28.779H288.1
		c-15.855-0.021-28.769-12.936-28.78-28.768v-32.629c-1.515-0.088-3.052-0.166-4.566-0.266l-3.272-0.197l-2.952-0.133
		c-2.543-0.133-5.064-0.256-7.574-0.432c-2.123-0.154-4.257-0.299-6.369-0.477l-3.604-0.275l-3.726-0.287
		c-2.543-0.178-5.097-0.377-7.64-0.586c-2.388-0.211-4.732-0.465-7.076-0.686l-2.521-0.277l-3.207-0.299
		c-2.775-0.266-5.54-0.529-8.292-0.828c-2.101-0.221-4.201-0.498-6.313-0.73l-3.162-0.375l-3.693-0.443
		c-2.576-0.332-5.164-0.619-7.707-0.961c-2.211-0.287-4.489-0.619-6.745-0.939l-2.665-0.398l-3.737-0.531
		c-2.477-0.332-4.953-0.686-7.396-1.072c-2.156-0.332-4.279-0.686-6.413-1.051l-3.074-0.498l-2.432-0.408
		c-2.819-0.453-5.661-0.906-8.458-1.416c-2.477-0.453-4.887-0.906-7.353-1.371l-2.112-0.408l-2.521-0.465
		c-2.709-0.498-5.407-0.994-8.083-1.537c-2.41-0.486-4.776-0.984-7.143-1.504l-2.311-0.496l-3.306-0.709
		c-2.355-0.486-4.732-0.973-7.076-1.514c-2.488-0.531-4.975-1.139-7.474-1.725l-1.891-0.453l-2.609-0.619
		c-2.521-0.586-5.02-1.162-7.529-1.781c-1.847-0.465-3.66-0.928-5.451-1.404l-3.748-0.984l-2.233-0.574
		c-2.621-0.664-5.229-1.338-7.817-2.035c-1.88-0.529-3.704-1.049-5.562-1.568l-3.417-0.951l-2.089-0.598
		c-2.654-0.752-5.296-1.504-7.906-2.299c-2.455-0.697-4.876-1.482-7.319-2.223l-1.382-0.443l-2.112-0.652
		c-2.609-0.818-5.219-1.613-7.784-2.443c-2.83-0.895-5.617-1.846-8.403-2.797c-3.284-1.094-6.645-2.201-9.951-3.35
		c-0.752-0.254-1.438-0.498-2.145-0.752v201.184c0,1.637,1.393,3.041,3.074,3.041h605.875c1.614,0,3.029-1.404,3.029-3.051V334.171
		l-2.045,0.73C607.058,335.919,604.194,336.869,601.319,337.82z M608.926,129.272H3.062c-1.647,0-3.062,1.404-3.062,3.062V306.83
		c3.405,1.248,6.778,2.486,10.227,3.703c1.106,0.387,2.211,0.752,3.317,1.129l2.277,0.75l3.162,1.084
		c2.963,1.006,5.926,2.023,8.934,2.986l3.87,1.205l2.267,0.695c3.98,1.25,7.905,2.5,11.886,3.672
		c1.327,0.408,2.72,0.785,4.069,1.184l2.853,0.807l2.421,0.686c2.985,0.861,5.981,1.713,9,2.543c1.713,0.486,3.46,0.928,5.196,1.381
		l2.709,0.686l2.587,0.686c2.72,0.697,5.417,1.428,8.182,2.102c1.614,0.408,3.295,0.795,4.986,1.205l3.848,0.895l3.395,0.797
		c2.233,0.541,4.456,1.072,6.7,1.582c2.255,0.52,4.533,0.982,6.789,1.459l3.03,0.629l3.096,0.652
		c2.101,0.465,4.212,0.918,6.357,1.35c2.587,0.52,5.197,0.996,7.795,1.492l2.996,0.564l2.499,0.465
		c2.079,0.408,4.146,0.807,6.236,1.172c2.786,0.486,5.595,0.939,8.414,1.414l3.394,0.555l3.229,0.529l4.832,0.773
		c3.162,0.521,6.379,0.963,9.586,1.404l3.306,0.465l2.499,0.377c1.526,0.209,3.074,0.43,4.61,0.629
		c4.047,0.553,8.06,1.018,12.096,1.494l1.725,0.197l2.875,0.355c1.228,0.166,2.455,0.287,3.682,0.441
		c4.533,0.508,9.122,0.918,13.677,1.359l3.062,0.299l3.892,0.365c3.383,0.311,6.789,0.564,10.205,0.818l3.372,0.232l3.284,0.254
		c1.305,0.121,2.643,0.221,3.947,0.299c2.864,0.188,5.738,0.332,8.646,0.475l3.45,0.166l2.642,0.188
		c0.741,0.012,1.459,0.078,2.223,0.111l0.011-25.121c0-15.844,12.914-28.735,28.747-28.779h35.834
		c15.821,0.033,28.714,12.926,28.769,28.746v25.154c0.066,0,0.122,0,0.177,0l3.594-0.211l3.914-0.209
		c3.106-0.166,6.181-0.32,9.254-0.531c1.194-0.076,2.333-0.166,3.45-0.266l2.676-0.199c4.92-0.33,9.851-0.695,14.749-1.139
		l2.665-0.232l2.94-0.309c5.131-0.475,10.095-0.93,14.981-1.471l3.096-0.387l2.267-0.266c5.054-0.574,10.062-1.16,15.016-1.812
		l2.853-0.41l2.853-0.408l1.99-0.277c4.157-0.574,8.292-1.172,12.405-1.801c1.216-0.199,2.354-0.389,3.516-0.576l2.985-0.52
		l3.351-0.531c3.306-0.541,6.645-1.082,9.962-1.668c1.614-0.289,3.184-0.586,4.743-0.885l2.477-0.486l1.935-0.344
		c3.482-0.652,6.966-1.293,10.404-1.99c1.504-0.287,2.93-0.607,4.4-0.918l3.505-0.74l2.023-0.432
		c3.14-0.652,6.258-1.314,9.354-2.012c2.179-0.486,4.346-1.006,6.513-1.525l1.901-0.465l1.936-0.432
		c2.863-0.686,5.771-1.338,8.612-2.057c2.2-0.562,4.356-1.148,6.534-1.703l2.532-0.662l3.151-0.807
		c2.167-0.576,4.312-1.141,6.435-1.703c2.798-0.764,5.573-1.559,8.337-2.355l1.194-0.342l2.3-0.664
		c2.178-0.607,4.378-1.227,6.557-1.869c2.255-0.686,4.5-1.371,6.711-2.066l3.118-0.975l2.443-0.762
		c1.924-0.586,3.848-1.172,5.738-1.791c2.599-0.83,5.142-1.703,7.706-2.555l2.322-0.807l2.643-0.873
		c1.691-0.576,3.395-1.15,5.063-1.715c2.765-0.961,5.506-1.979,8.248-2.984l1.78-0.652l0.011-174.505
		C612,130.677,610.596,129.272,608.926,129.272z M323.911,419.074c1.604,0,3.019-1.426,3.019-3.051v-31.775
		c-7.353,0.176-14.252,0.264-20.93,0.264c-6.534,0-13.356-0.1-20.941-0.275v31.799c0,1.646,1.382,3.039,3.051,3.039H323.911z"/>
</g>
<g>
</g>
<g>
</g>
<g>
</g>
<g>
</g>
<g>
</g>
<g>
</g>
<g>
</g>
<g>
</g>
<g>
</g>
<g>
</g>
<g>
</g>
<g>
</g>
<g>
</g>
<g>
</g>
<g>
</g>
</svg>
