{
    "codeToName": {
        "0": "NULL",
        "13": "CR",
        "32": "space",
        "33": "exclam",
        "34": "quotedbl",
        "35": "numbersign",
        "36": "dollar",
        "37": "percent",
        "38": "ampersand",
        "39": "quotesingle",
        "40": "parenleft",
        "41": "parenright",
        "42": "asterisk",
        "43": "plus",
        "44": "comma",
        "45": "hyphen",
        "46": "period",
        "47": "slash",
        "48": "zero",
        "49": "one",
        "50": "two",
        "51": "three",
        "52": "four",
        "53": "five",
        "54": "six",
        "55": "seven",
        "56": "eight",
        "57": "nine",
        "58": "colon",
        "59": "semicolon",
        "60": "less",
        "61": "equal",
        "62": "greater",
        "63": "question",
        "64": "at",
        "65": "A",
        "66": "B",
        "67": "C",
        "68": "D",
        "69": "E",
        "70": "F",
        "71": "G",
        "72": "H",
        "73": "I",
        "74": "J",
        "75": "K",
        "76": "L",
        "77": "M",
        "78": "N",
        "79": "O",
        "80": "P",
        "81": "Q",
        "82": "R",
        "83": "S",
        "84": "T",
        "85": "U",
        "86": "V",
        "87": "W",
        "88": "X",
        "89": "Y",
        "90": "Z",
        "91": "bracketleft",
        "92": "backslash",
        "93": "bracketright",
        "94": "asciicircum",
        "95": "underscore",
        "96": "grave",
        "97": "a",
        "98": "b",
        "99": "c",
        "100": "d",
        "101": "e",
        "102": "f",
        "103": "g",
        "104": "h",
        "105": "i",
        "106": "j",
        "107": "k",
        "108": "l",
        "109": "m",
        "110": "n",
        "111": "o",
        "112": "p",
        "113": "q",
        "114": "r",
        "115": "s",
        "116": "t",
        "117": "u",
        "118": "v",
        "119": "w",
        "120": "x",
        "121": "y",
        "122": "z",
        "123": "braceleft",
        "124": "bar",
        "125": "braceright",
        "126": "asciitilde",
        "160": "uni00A0",
        "161": "exclamdown",
        "162": "cent",
        "163": "sterling",
        "164": "currency",
        "165": "yen",
        "166": "brokenbar",
        "167": "section",
        "168": "dieresis",
        "169": "copyright",
        "170": "ordfeminine",
        "171": "guillemotleft",
        "172": "logicalnot",
        "173": "uni00AD",
        "174": "registered",
        "175": "macron",
        "176": "degree",
        "177": "plusminus",
        "178": "uni00B2",
        "179": "uni00B3",
        "180": "acute",
        "181": "uni00B5",
        "182": "paragraph",
        "183": "periodcentered",
        "184": "cedilla",
        "185": "uni00B9",
        "186": "ordmasculine",
        "187": "guillemotright",
        "188": "onequarter",
        "189": "onehalf",
        "190": "threequarters",
        "191": "questiondown",
        "192": "Agrave",
        "193": "Aacute",
        "194": "Acircumflex",
        "195": "Atilde",
        "196": "Adieresis",
        "197": "Aring",
        "198": "AE",
        "199": "Ccedilla",
        "200": "Egrave",
        "201": "Eacute",
        "202": "Ecircumflex",
        "203": "Edieresis",
        "204": "Igrave",
        "205": "Iacute",
        "206": "Icircumflex",
        "207": "Idieresis",
        "208": "Eth",
        "209": "Ntilde",
        "210": "Ograve",
        "211": "Oacute",
        "212": "Ocircumflex",
        "213": "Otilde",
        "214": "Odieresis",
        "215": "multiply",
        "216": "Oslash",
        "217": "Ugrave",
        "218": "Uacute",
        "219": "Ucircumflex",
        "220": "Udieresis",
        "221": "Yacute",
        "222": "Thorn",
        "223": "germandbls",
        "224": "agrave",
        "225": "aacute",
        "226": "acircumflex",
        "227": "atilde",
        "228": "adieresis",
        "229": "aring",
        "230": "ae",
        "231": "ccedilla",
        "232": "egrave",
        "233": "eacute",
        "234": "ecircumflex",
        "235": "edieresis",
        "236": "igrave",
        "237": "iacute",
        "238": "icircumflex",
        "239": "idieresis",
        "240": "eth",
        "241": "ntilde",
        "242": "ograve",
        "243": "oacute",
        "244": "ocircumflex",
        "245": "otilde",
        "246": "odieresis",
        "247": "divide",
        "248": "oslash",
        "249": "ugrave",
        "250": "uacute",
        "251": "ucircumflex",
        "252": "udieresis",
        "253": "yacute",
        "254": "thorn",
        "255": "ydieresis",
        "256": "Amacron",
        "257": "amacron",
        "258": "Abreve",
        "259": "abreve",
        "260": "Aogonek",
        "261": "aogonek",
        "262": "Cacute",
        "263": "cacute",
        "264": "Ccircumflex",
        "265": "ccircumflex",
        "266": "Cdotaccent",
        "267": "cdotaccent",
        "268": "Ccaron",
        "269": "ccaron",
        "270": "Dcaron",
        "271": "dcaron",
        "272": "Dcroat",
        "273": "dmacron",
        "274": "Emacron",
        "275": "emacron",
        "276": "Ebreve",
        "277": "ebreve",
        "278": "Edotaccent",
        "279": "edotaccent",
        "280": "Eogonek",
        "281": "eogonek",
        "282": "Ecaron",
        "283": "ecaron",
        "284": "Gcircumflex",
        "285": "gcircumflex",
        "286": "Gbreve",
        "287": "gbreve",
        "288": "Gdotaccent",
        "289": "gdotaccent",
        "290": "uni0122",
        "291": "uni0123",
        "292": "Hcircumflex",
        "293": "hcircumflex",
        "294": "Hbar",
        "295": "hbar",
        "296": "Itilde",
        "297": "itilde",
        "298": "Imacron",
        "299": "imacron",
        "300": "Ibreve",
        "301": "ibreve",
        "302": "Iogonek",
        "303": "iogonek",
        "304": "Idot",
        "305": "dotlessi",
        "306": "IJ",
        "307": "ij",
        "308": "Jcircumflex",
        "309": "jcircumflex",
        "310": "uni0136",
        "311": "uni0137",
        "312": "kgreenlandic",
        "313": "Lacute",
        "314": "lacute",
        "315": "uni013B",
        "316": "uni013C",
        "317": "Lcaron",
        "318": "lcaron",
        "319": "Ldot",
        "320": "ldot",
        "321": "Lslash",
        "322": "lslash",
        "323": "Nacute",
        "324": "nacute",
        "325": "uni0145",
        "326": "uni0146",
        "327": "Ncaron",
        "328": "ncaron",
        "329": "napostrophe",
        "330": "Eng",
        "331": "eng",
        "332": "Omacron",
        "333": "omacron",
        "334": "Obreve",
        "335": "obreve",
        "336": "Ohungarumlaut",
        "337": "ohungarumlaut",
        "338": "OE",
        "339": "oe",
        "340": "Racute",
        "341": "racute",
        "342": "uni0156",
        "343": "uni0157",
        "344": "Rcaron",
        "345": "rcaron",
        "346": "Sacute",
        "347": "sacute",
        "348": "Scircumflex",
        "349": "scircumflex",
        "350": "Scedilla",
        "351": "scedilla",
        "352": "Scaron",
        "353": "scaron",
        "354": "uni0162",
        "355": "uni0163",
        "356": "Tcaron",
        "357": "tcaron",
        "358": "Tbar",
        "359": "tbar",
        "360": "Utilde",
        "361": "utilde",
        "362": "Umacron",
        "363": "umacron",
        "364": "Ubreve",
        "365": "ubreve",
        "366": "Uring",
        "367": "uring",
        "368": "Uhungarumlaut",
        "369": "uhungarumlaut",
        "370": "Uogonek",
        "371": "uogonek",
        "372": "Wcircumflex",
        "373": "wcircumflex",
        "374": "Ycircumflex",
        "375": "ycircumflex",
        "376": "Ydieresis",
        "377": "Zacute",
        "378": "zacute",
        "379": "Zdotaccent",
        "380": "zdotaccent",
        "381": "Zcaron",
        "382": "zcaron",
        "383": "longs",
        "399": "uni018F",
        "402": "florin",
        "416": "Ohorn",
        "417": "ohorn",
        "431": "Uhorn",
        "432": "uhorn",
        "439": "uni01B7",
        "452": "uni01C4",
        "453": "uni01C5",
        "454": "uni01C6",
        "455": "uni01C7",
        "456": "uni01C8",
        "457": "uni01C9",
        "458": "uni01CA",
        "459": "uni01CB",
        "460": "uni01CC",
        "461": "uni01CD",
        "462": "uni01CE",
        "467": "uni01D3",
        "468": "uni01D4",
        "484": "uni01E4",
        "485": "uni01E5",
        "486": "Gcaron",
        "487": "gcaron",
        "488": "uni01E8",
        "489": "uni01E9",
        "490": "uni01EA",
        "491": "uni01EB",
        "494": "uni01EE",
        "495": "uni01EF",
        "497": "uni01F1",
        "498": "uni01F2",
        "499": "uni01F3",
        "500": "uni01F4",
        "501": "uni01F5",
        "506": "Aringacute",
        "507": "aringacute",
        "508": "AEacute",
        "509": "aeacute",
        "510": "Oslashacute",
        "511": "oslashacute",
        "512": "uni0200",
        "513": "uni0201",
        "514": "uni0202",
        "515": "uni0203",
        "516": "uni0204",
        "517": "uni0205",
        "518": "uni0206",
        "519": "uni0207",
        "520": "uni0208",
        "521": "uni0209",
        "522": "uni020A",
        "523": "uni020B",
        "524": "uni020C",
        "525": "uni020D",
        "526": "uni020E",
        "527": "uni020F",
        "528": "uni0210",
        "529": "uni0211",
        "530": "uni0212",
        "531": "uni0213",
        "532": "uni0214",
        "533": "uni0215",
        "534": "uni0216",
        "535": "uni0217",
        "536": "uni0218",
        "537": "uni0219",
        "538": "uni021A",
        "539": "uni021B",
        "542": "uni021E",
        "543": "uni021F",
        "554": "uni022A",
        "555": "uni022B",
        "556": "uni022C",
        "557": "uni022D",
        "560": "uni0230",
        "561": "uni0231",
        "562": "uni0232",
        "563": "uni0233",
        "567": "uni0237",
        "601": "uni0259",
        "658": "uni0292",
        "700": "uni02BC",
        "710": "circumflex",
        "711": "caron",
        "713": "uni02C9",
        "728": "breve",
        "729": "dotaccent",
        "730": "ring",
        "731": "ogonek",
        "732": "tilde",
        "733": "hungarumlaut",
        "768": "gravecomb",
        "769": "acutecomb",
        "770": "uni0302",
        "771": "tildecomb",
        "772": "uni0304",
        "774": "uni0306",
        "775": "uni0307",
        "776": "uni0308",
        "777": "hookabovecomb",
        "778": "uni030A",
        "779": "uni030B",
        "780": "uni030C",
        "783": "uni030F",
        "785": "uni0311",
        "786": "uni0312",
        "795": "uni031B",
        "803": "dotbelowcomb",
        "804": "uni0324",
        "806": "uni0326",
        "807": "uni0327",
        "808": "uni0328",
        "814": "uni032E",
        "817": "uni0331",
        "821": "uni0335",
        "928": "Pi",
        "960": "pi",
        "1024": "uni0400",
        "1025": "uni0401",
        "1026": "uni0402",
        "1027": "uni0403",
        "1028": "uni0404",
        "1029": "uni0405",
        "1030": "uni0406",
        "1031": "uni0407",
        "1032": "uni0408",
        "1033": "uni0409",
        "1034": "uni040A",
        "1035": "uni040B",
        "1036": "uni040C",
        "1037": "uni040D",
        "1038": "uni040E",
        "1039": "uni040F",
        "1040": "uni0410",
        "1041": "uni0411",
        "1042": "uni0412",
        "1043": "uni0413",
        "1044": "uni0414",
        "1045": "uni0415",
        "1046": "uni0416",
        "1047": "uni0417",
        "1048": "uni0418",
        "1049": "uni0419",
        "1050": "uni041A",
        "1051": "uni041B",
        "1052": "uni041C",
        "1053": "uni041D",
        "1054": "uni041E",
        "1055": "uni041F",
        "1056": "uni0420",
        "1057": "uni0421",
        "1058": "uni0422",
        "1059": "uni0423",
        "1060": "uni0424",
        "1061": "uni0425",
        "1062": "uni0426",
        "1063": "uni0427",
        "1064": "uni0428",
        "1065": "uni0429",
        "1066": "uni042A",
        "1067": "uni042B",
        "1068": "uni042C",
        "1069": "uni042D",
        "1070": "uni042E",
        "1071": "uni042F",
        "1072": "uni0430",
        "1073": "uni0431",
        "1074": "uni0432",
        "1075": "uni0433",
        "1076": "uni0434",
        "1077": "uni0435",
        "1078": "uni0436",
        "1079": "uni0437",
        "1080": "uni0438",
        "1081": "uni0439",
        "1082": "uni043A",
        "1083": "uni043B",
        "1084": "uni043C",
        "1085": "uni043D",
        "1086": "uni043E",
        "1087": "uni043F",
        "1088": "uni0440",
        "1089": "uni0441",
        "1090": "uni0442",
        "1091": "uni0443",
        "1092": "uni0444",
        "1093": "uni0445",
        "1094": "uni0446",
        "1095": "uni0447",
        "1096": "uni0448",
        "1097": "uni0449",
        "1098": "uni044A",
        "1099": "uni044B",
        "1100": "uni044C",
        "1101": "uni044D",
        "1102": "uni044E",
        "1103": "uni044F",
        "1104": "uni0450",
        "1105": "uni0451",
        "1106": "uni0452",
        "1107": "uni0453",
        "1108": "uni0454",
        "1109": "uni0455",
        "1110": "uni0456",
        "1111": "uni0457",
        "1112": "uni0458",
        "1113": "uni0459",
        "1114": "uni045A",
        "1115": "uni045B",
        "1116": "uni045C",
        "1117": "uni045D",
        "1118": "uni045E",
        "1119": "uni045F",
        "1122": "uni0462",
        "1123": "uni0463",
        "1130": "uni046A",
        "1131": "uni046B",
        "1168": "uni0490",
        "1169": "uni0491",
        "1170": "uni0492",
        "1171": "uni0493",
        "1174": "uni0496",
        "1175": "uni0497",
        "1178": "uni049A",
        "1179": "uni049B",
        "1186": "uni04A2",
        "1187": "uni04A3",
        "1198": "Ustraitcy",
        "1199": "ustraitcy",
        "1200": "Ustraitstrokecy",
        "1201": "ustraitstrokecy",
        "1210": "uni04BA",
        "1211": "uni04BB",
        "1225": "uni04C9",
        "1226": "uni04CA",
        "1240": "uni04D8",
        "1241": "uni04D9",
        "1256": "uni04E8",
        "1257": "uni04E9",
        "7682": "uni1E02",
        "7683": "uni1E03",
        "7690": "uni1E0A",
        "7691": "uni1E0B",
        "7710": "uni1E1E",
        "7711": "uni1E1F",
        "7744": "uni1E40",
        "7745": "uni1E41",
        "7766": "uni1E56",
        "7767": "uni1E57",
        "7776": "uni1E60",
        "7777": "uni1E61",
        "7786": "uni1E6A",
        "7787": "uni1E6B",
        "7808": "Wgrave",
        "7809": "wgrave",
        "7810": "Wacute",
        "7811": "wacute",
        "7812": "Wdieresis",
        "7813": "wdieresis",
        "7838": "uni1E9E",
        "7840": "uni1EA0",
        "7841": "uni1EA1",
        "7842": "uni1EA2",
        "7843": "uni1EA3",
        "7844": "uni1EA4",
        "7845": "uni1EA5",
        "7846": "uni1EA6",
        "7847": "uni1EA7",
        "7848": "uni1EA8",
        "7849": "uni1EA9",
        "7850": "uni1EAA",
        "7851": "uni1EAB",
        "7852": "uni1EAC",
        "7853": "uni1EAD",
        "7854": "uni1EAE",
        "7855": "uni1EAF",
        "7856": "uni1EB0",
        "7857": "uni1EB1",
        "7858": "uni1EB2",
        "7859": "uni1EB3",
        "7860": "uni1EB4",
        "7861": "uni1EB5",
        "7862": "uni1EB6",
        "7863": "uni1EB7",
        "7864": "uni1EB8",
        "7865": "uni1EB9",
        "7866": "uni1EBA",
        "7867": "uni1EBB",
        "7868": "uni1EBC",
        "7869": "uni1EBD",
        "7870": "uni1EBE",
        "7871": "uni1EBF",
        "7872": "uni1EC0",
        "7873": "uni1EC1",
        "7874": "uni1EC2",
        "7875": "uni1EC3",
        "7876": "uni1EC4",
        "7877": "uni1EC5",
        "7878": "uni1EC6",
        "7879": "uni1EC7",
        "7880": "uni1EC8",
        "7881": "uni1EC9",
        "7882": "uni1ECA",
        "7883": "uni1ECB",
        "7884": "uni1ECC",
        "7885": "uni1ECD",
        "7886": "uni1ECE",
        "7887": "uni1ECF",
        "7888": "uni1ED0",
        "7889": "uni1ED1",
        "7890": "uni1ED2",
        "7891": "uni1ED3",
        "7892": "uni1ED4",
        "7893": "uni1ED5",
        "7894": "uni1ED6",
        "7895": "uni1ED7",
        "7896": "uni1ED8",
        "7897": "uni1ED9",
        "7898": "uni1EDA",
        "7899": "uni1EDB",
        "7900": "uni1EDC",
        "7901": "uni1EDD",
        "7902": "uni1EDE",
        "7903": "uni1EDF",
        "7904": "uni1EE0",
        "7905": "uni1EE1",
        "7906": "uni1EE2",
        "7907": "uni1EE3",
        "7908": "uni1EE4",
        "7909": "uni1EE5",
        "7910": "uni1EE6",
        "7911": "uni1EE7",
        "7912": "uni1EE8",
        "7913": "uni1EE9",
        "7914": "uni1EEA",
        "7915": "uni1EEB",
        "7916": "uni1EEC",
        "7917": "uni1EED",
        "7918": "uni1EEE",
        "7919": "uni1EEF",
        "7920": "uni1EF0",
        "7921": "uni1EF1",
        "7922": "Ygrave",
        "7923": "ygrave",
        "7924": "uni1EF4",
        "7925": "uni1EF5",
        "7926": "uni1EF6",
        "7927": "uni1EF7",
        "7928": "uni1EF8",
        "7929": "uni1EF9",
        "8208": "uni2010",
        "8211": "endash",
        "8212": "emdash",
        "8216": "quoteleft",
        "8217": "quoteright",
        "8218": "quotesinglbase",
        "8220": "quotedblleft",
        "8221": "quotedblright",
        "8222": "quotedblbase",
        "8224": "dagger",
        "8225": "daggerdbl",
        "8226": "bullet",
        "8230": "ellipsis",
        "8240": "perthousand",
        "8242": "minute",
        "8243": "second",
        "8249": "guilsinglleft",
        "8250": "guilsinglright",
        "8260": "fraction",
        "8274": "uni2052",
        "8308": "uni2074",
        "8353": "colonmonetary",
        "8355": "franc",
        "8356": "lira",
        "8358": "uni20A6",
        "8359": "peseta",
        "8361": "uni20A9",
        "8363": "dong",
        "8364": "Euro",
        "8365": "uni20AD",
        "8369": "uni20B1",
        "8370": "uni20B2",
        "8373": "uni20B5",
        "8377": "uni20B9",
        "8378": "uni20BA",
        "8380": "uni20BC",
        "8381": "uni20BD",
        "8467": "uni2113",
        "8470": "uni2116",
        "8482": "trademark",
        "8490": "uni212A",
        "8491": "uni212B",
        "8494": "estimated",
        "8706": "partialdiff",
        "8709": "emptyset",
        "8719": "product",
        "8721": "summation",
        "8722": "minus",
        "8725": "uni2215",
        "8729": "uni2219",
        "8730": "radical",
        "8734": "infinity",
        "8747": "integral",
        "8776": "approxequal",
        "8800": "notequal",
        "8804": "lessequal",
        "8805": "greaterequal",
        "9674": "lozenge",
        "10216": "uni27E8",
        "10217": "uni27E9",
        "64257": "fi",
        "64258": "fl"
    },
    "isUnicode": true,
    "EncodingScheme": "FontSpecific",
    "FontName": "Oswald",
    "FullName": "Oswald Regular",
    "Version": "Version 4.102",
    "PostScriptName": "Oswald-Regular",
    "Weight": "Medium",
    "ItalicAngle": "0",
    "IsFixedPitch": "false",
    "UnderlineThickness": "50",
    "UnderlinePosition": "-100",
    "FontHeightOffset": "0",
    "Ascender": "1193",
    "Descender": "-289",
    "FontBBox": [
        "-197",
        "-287",
        "1223",
        "1297"
    ],
    "StartCharMetrics": "753",
    "C": {
        "0": 0,
        "13": 229,
        "32": 229,
        "33": 208,
        "34": 266,
        "35": 486,
        "36": 491,
        "37": 891,
        "38": 606,
        "39": 127,
        "40": 298,
        "41": 260,
        "42": 398,
        "43": 415,
        "44": 187,
        "45": 321,
        "46": 188,
        "47": 369,
        "48": 517,
        "49": 396,
        "50": 478,
        "51": 477,
        "52": 483,
        "53": 476,
        "54": 503,
        "55": 386,
        "56": 499,
        "57": 502,
        "58": 197,
        "59": 215,
        "60": 373,
        "61": 415,
        "62": 373,
        "63": 487,
        "64": 904,
        "65": 492,
        "66": 524,
        "67": 515,
        "68": 527,
        "69": 407,
        "70": 391,
        "71": 535,
        "72": 561,
        "73": 248,
        "74": 301,
        "75": 495,
        "76": 397,
        "77": 660,
        "78": 528,
        "79": 539,
        "80": 480,
        "81": 541,
        "82": 519,
        "83": 473,
        "84": 413,
        "85": 543,
        "86": 505,
        "87": 729,
        "88": 482,
        "89": 481,
        "90": 417,
        "91": 340,
        "92": 369,
        "93": 310,
        "94": 443,
        "95": 344,
        "96": 278,
        "97": 426,
        "98": 447,
        "99": 411,
        "100": 442,
        "101": 421,
        "102": 287,
        "103": 435,
        "104": 445,
        "105": 229,
        "106": 230,
        "107": 429,
        "108": 229,
        "109": 680,
        "110": 439,
        "111": 425,
        "112": 446,
        "113": 443,
        "114": 321,
        "115": 374,
        "116": 308,
        "117": 440,
        "118": 385,
        "119": 588,
        "120": 389,
        "121": 392,
        "122": 347,
        "123": 300,
        "124": 239,
        "125": 321,
        "126": 447,
        "160": 229,
        "161": 208,
        "162": 388,
        "163": 398,
        "164": 550,
        "165": 457,
        "166": 212,
        "167": 427,
        "168": 400,
        "169": 862,
        "170": 443,
        "171": 455,
        "172": 387,
        "173": 344,
        "174": 888,
        "175": 284,
        "176": 453,
        "177": 368,
        "178": 422,
        "179": 426,
        "180": 277,
        "181": 441,
        "182": 492,
        "183": 176,
        "184": 352,
        "185": 340,
        "186": 443,
        "187": 481,
        "188": 945,
        "189": 945,
        "190": 874,
        "191": 487,
        "192": 492,
        "193": 492,
        "194": 492,
        "195": 492,
        "196": 492,
        "197": 492,
        "198": 635,
        "199": 515,
        "200": 407,
        "201": 407,
        "202": 407,
        "203": 407,
        "204": 248,
        "205": 248,
        "206": 248,
        "207": 248,
        "208": 518,
        "209": 528,
        "210": 539,
        "211": 539,
        "212": 539,
        "213": 539,
        "214": 539,
        "215": 383,
        "216": 540,
        "217": 543,
        "218": 543,
        "219": 543,
        "220": 543,
        "221": 481,
        "222": 503,
        "223": 515,
        "224": 426,
        "225": 426,
        "226": 426,
        "227": 426,
        "228": 426,
        "229": 426,
        "230": 651,
        "231": 411,
        "232": 421,
        "233": 421,
        "234": 421,
        "235": 421,
        "236": 224,
        "237": 224,
        "238": 224,
        "239": 224,
        "240": 471,
        "241": 439,
        "242": 425,
        "243": 425,
        "244": 425,
        "245": 425,
        "246": 425,
        "247": 346,
        "248": 424,
        "249": 440,
        "250": 440,
        "251": 440,
        "252": 440,
        "253": 392,
        "254": 447,
        "255": 392,
        "256": 492,
        "257": 426,
        "258": 492,
        "259": 426,
        "260": 492,
        "261": 426,
        "262": 515,
        "263": 411,
        "264": 515,
        "265": 411,
        "266": 515,
        "267": 411,
        "268": 515,
        "269": 411,
        "270": 527,
        "271": 526,
        "272": 529,
        "273": 454,
        "274": 407,
        "275": 421,
        "276": 407,
        "277": 421,
        "278": 407,
        "279": 421,
        "280": 407,
        "281": 421,
        "282": 407,
        "283": 421,
        "284": 535,
        "285": 435,
        "286": 535,
        "287": 435,
        "288": 535,
        "289": 435,
        "290": 535,
        "291": 435,
        "292": 561,
        "293": 445,
        "294": 561,
        "295": 445,
        "296": 248,
        "297": 224,
        "298": 248,
        "299": 224,
        "300": 248,
        "301": 224,
        "302": 248,
        "303": 229,
        "304": 248,
        "305": 224,
        "306": 549,
        "307": 459,
        "308": 301,
        "309": 230,
        "310": 495,
        "311": 429,
        "312": 430,
        "313": 397,
        "314": 229,
        "315": 397,
        "316": 229,
        "317": 397,
        "318": 309,
        "319": 397,
        "320": 284,
        "321": 397,
        "322": 267,
        "323": 528,
        "324": 439,
        "325": 528,
        "326": 439,
        "327": 528,
        "328": 439,
        "329": 501,
        "330": 531,
        "331": 388,
        "332": 539,
        "333": 425,
        "334": 539,
        "335": 425,
        "336": 539,
        "337": 425,
        "338": 683,
        "339": 685,
        "340": 519,
        "341": 321,
        "342": 519,
        "343": 321,
        "344": 519,
        "345": 321,
        "346": 473,
        "347": 374,
        "348": 473,
        "349": 374,
        "350": 473,
        "351": 374,
        "352": 473,
        "353": 374,
        "354": 400,
        "355": 308,
        "356": 400,
        "357": 331,
        "358": 400,
        "359": 244,
        "360": 543,
        "361": 440,
        "362": 543,
        "363": 440,
        "364": 543,
        "365": 440,
        "366": 543,
        "367": 440,
        "368": 543,
        "369": 440,
        "370": 543,
        "371": 440,
        "372": 729,
        "373": 588,
        "374": 481,
        "375": 392,
        "376": 481,
        "377": 417,
        "378": 347,
        "379": 417,
        "380": 347,
        "381": 417,
        "382": 347,
        "383": 287,
        "399": 535,
        "402": 380,
        "416": 539,
        "417": 425,
        "431": 543,
        "432": 440,
        "439": 456,
        "452": 944,
        "453": 874,
        "454": 789,
        "455": 698,
        "456": 627,
        "457": 459,
        "458": 829,
        "459": 758,
        "460": 669,
        "461": 492,
        "462": 426,
        "467": 543,
        "468": 440,
        "484": 535,
        "485": 435,
        "486": 535,
        "487": 435,
        "488": 495,
        "489": 429,
        "490": 539,
        "491": 425,
        "494": 456,
        "495": 458,
        "497": 944,
        "498": 874,
        "499": 789,
        "500": 535,
        "501": 435,
        "506": 492,
        "507": 426,
        "508": 635,
        "509": 651,
        "510": 540,
        "511": 424,
        "512": 492,
        "513": 426,
        "514": 492,
        "515": 426,
        "516": 407,
        "517": 421,
        "518": 407,
        "519": 421,
        "520": 248,
        "521": 224,
        "522": 248,
        "523": 224,
        "524": 539,
        "525": 425,
        "526": 539,
        "527": 425,
        "528": 519,
        "529": 321,
        "530": 519,
        "531": 321,
        "532": 543,
        "533": 440,
        "534": 543,
        "535": 440,
        "536": 473,
        "537": 374,
        "538": 400,
        "539": 308,
        "542": 561,
        "543": 445,
        "554": 539,
        "555": 425,
        "556": 539,
        "557": 425,
        "560": 539,
        "561": 425,
        "562": 481,
        "563": 392,
        "567": 230,
        "601": 421,
        "658": 458,
        "700": 366,
        "710": 343,
        "711": 337,
        "713": 284,
        "728": 348,
        "729": 172,
        "730": 289,
        "731": 353,
        "732": 424,
        "733": 400,
        "768": 0,
        "769": 0,
        "770": 0,
        "771": 0,
        "772": 0,
        "774": 0,
        "775": 0,
        "776": 0,
        "777": 0,
        "778": 0,
        "779": 0,
        "780": 0,
        "783": 0,
        "785": 0,
        "786": 0,
        "795": 0,
        "803": 0,
        "804": 0,
        "806": 0,
        "807": 0,
        "808": 0,
        "814": 0,
        "817": 0,
        "821": 0,
        "928": 558,
        "960": 527,
        "1024": 407,
        "1025": 407,
        "1026": 547,
        "1027": 386,
        "1028": 503,
        "1029": 473,
        "1030": 248,
        "1031": 248,
        "1032": 301,
        "1033": 836,
        "1034": 782,
        "1035": 568,
        "1036": 508,
        "1037": 545,
        "1038": 452,
        "1039": 547,
        "1040": 492,
        "1041": 494,
        "1042": 524,
        "1043": 386,
        "1044": 627,
        "1045": 407,
        "1046": 676,
        "1047": 480,
        "1048": 545,
        "1049": 545,
        "1050": 508,
        "1051": 581,
        "1052": 660,
        "1053": 561,
        "1054": 539,
        "1055": 572,
        "1056": 480,
        "1057": 515,
        "1058": 413,
        "1059": 452,
        "1060": 662,
        "1061": 482,
        "1062": 622,
        "1063": 550,
        "1064": 750,
        "1065": 790,
        "1066": 567,
        "1067": 728,
        "1068": 494,
        "1069": 519,
        "1070": 719,
        "1071": 545,
        "1072": 426,
        "1073": 438,
        "1074": 415,
        "1075": 290,
        "1076": 496,
        "1077": 421,
        "1078": 579,
        "1079": 375,
        "1080": 457,
        "1081": 457,
        "1082": 415,
        "1083": 485,
        "1084": 529,
        "1085": 459,
        "1086": 425,
        "1087": 444,
        "1088": 446,
        "1089": 411,
        "1090": 346,
        "1091": 392,
        "1092": 606,
        "1093": 389,
        "1094": 485,
        "1095": 433,
        "1096": 625,
        "1097": 664,
        "1098": 480,
        "1099": 623,
        "1100": 415,
        "1101": 412,
        "1102": 573,
        "1103": 432,
        "1104": 421,
        "1105": 421,
        "1106": 457,
        "1107": 290,
        "1108": 397,
        "1109": 374,
        "1110": 229,
        "1111": 224,
        "1112": 230,
        "1113": 659,
        "1114": 630,
        "1115": 457,
        "1116": 415,
        "1117": 457,
        "1118": 392,
        "1119": 446,
        "1122": 530,
        "1123": 429,
        "1130": 655,
        "1131": 530,
        "1168": 377,
        "1169": 296,
        "1170": 409,
        "1171": 372,
        "1174": 705,
        "1175": 597,
        "1178": 525,
        "1179": 438,
        "1186": 570,
        "1187": 485,
        "1198": 481,
        "1199": 388,
        "1200": 477,
        "1201": 393,
        "1210": 550,
        "1211": 445,
        "1225": 570,
        "1226": 485,
        "1240": 535,
        "1241": 421,
        "1256": 540,
        "1257": 424,
        "7682": 524,
        "7683": 447,
        "7690": 527,
        "7691": 442,
        "7710": 391,
        "7711": 287,
        "7744": 660,
        "7745": 680,
        "7766": 480,
        "7767": 446,
        "7776": 473,
        "7777": 374,
        "7786": 400,
        "7787": 308,
        "7808": 729,
        "7809": 588,
        "7810": 729,
        "7811": 588,
        "7812": 729,
        "7813": 588,
        "7838": 539,
        "7840": 492,
        "7841": 426,
        "7842": 492,
        "7843": 426,
        "7844": 492,
        "7845": 426,
        "7846": 492,
        "7847": 426,
        "7848": 492,
        "7849": 426,
        "7850": 492,
        "7851": 426,
        "7852": 492,
        "7853": 426,
        "7854": 492,
        "7855": 426,
        "7856": 492,
        "7857": 426,
        "7858": 492,
        "7859": 426,
        "7860": 492,
        "7861": 426,
        "7862": 492,
        "7863": 426,
        "7864": 407,
        "7865": 421,
        "7866": 407,
        "7867": 421,
        "7868": 407,
        "7869": 421,
        "7870": 407,
        "7871": 421,
        "7872": 407,
        "7873": 421,
        "7874": 407,
        "7875": 421,
        "7876": 407,
        "7877": 421,
        "7878": 407,
        "7879": 421,
        "7880": 248,
        "7881": 224,
        "7882": 248,
        "7883": 229,
        "7884": 539,
        "7885": 425,
        "7886": 539,
        "7887": 425,
        "7888": 539,
        "7889": 425,
        "7890": 539,
        "7891": 425,
        "7892": 539,
        "7893": 425,
        "7894": 539,
        "7895": 425,
        "7896": 539,
        "7897": 425,
        "7898": 539,
        "7899": 425,
        "7900": 539,
        "7901": 425,
        "7902": 539,
        "7903": 425,
        "7904": 539,
        "7905": 425,
        "7906": 539,
        "7907": 425,
        "7908": 543,
        "7909": 440,
        "7910": 543,
        "7911": 440,
        "7912": 543,
        "7913": 440,
        "7914": 543,
        "7915": 440,
        "7916": 543,
        "7917": 440,
        "7918": 543,
        "7919": 440,
        "7920": 543,
        "7921": 440,
        "7922": 481,
        "7923": 392,
        "7924": 481,
        "7925": 392,
        "7926": 481,
        "7927": 392,
        "7928": 481,
        "7929": 392,
        "8208": 600,
        "8211": 494,
        "8212": 965,
        "8216": 208,
        "8217": 208,
        "8218": 208,
        "8220": 384,
        "8221": 384,
        "8222": 384,
        "8224": 376,
        "8225": 381,
        "8226": 363,
        "8230": 553,
        "8240": 1260,
        "8242": 172,
        "8243": 323,
        "8249": 275,
        "8250": 292,
        "8260": 183,
        "8274": 486,
        "8308": 434,
        "8353": 515,
        "8355": 391,
        "8356": 398,
        "8358": 528,
        "8359": 1112,
        "8361": 729,
        "8363": 454,
        "8364": 497,
        "8365": 600,
        "8369": 600,
        "8370": 535,
        "8373": 515,
        "8377": 508,
        "8378": 527,
        "8380": 544,
        "8381": 501,
        "8467": 500,
        "8470": 958,
        "8482": 735,
        "8490": 495,
        "8491": 492,
        "8494": 629,
        "8706": 477,
        "8709": 445,
        "8719": 558,
        "8721": 406,
        "8722": 389,
        "8725": 369,
        "8729": 176,
        "8730": 511,
        "8734": 632,
        "8747": 324,
        "8776": 448,
        "8800": 417,
        "8804": 389,
        "8805": 387,
        "9674": 466,
        "10216": 363,
        "10217": 363,
        "64257": 491,
        "64258": 515
    },
    "CIDtoGID_Compressed": true,
    "CIDtoGID": "eJzt3Hm01dMbx\/HP5xEVGjRRmohoRkQppUmKSqWJSqEylWigWSpDKoWK0kShNJuKIiUKjUghUZnnefY767isUvd20yXW7\/1aa+\/93fvZe3+ffb7rnPPXOfGZUhHXphbZYVaPaBRXR4voG9NiZnSNVtE6msdtUT8ujLOjZZwalaNKnBZVo1qcHtWjRtSMBtEw7orRcWc0iRmyCqmIjlZZ1VRt1VcjtdWFaq9OulLXaLTu0lhN0jTN1jI9qxf0ol6JtnFetItJ0TE2a6O+0Xf6xfu7oAu7uEu6kqv4dNdxXTdyF3d1N\/fyQN\/siZ7kqb7Ps6NNPBoXxIT0nHA3578mGkevGBp9Yng8FrNjU8zx49E5JsZFMTfejofi7qgdZ8SGuD9mRdN4PWr5ibgy6kXdOCvOVW6FDlQBHaLDdLiOVGWV0wmqqPPURE3VXMeqhwbrWvXS7RoQd2ikHtMcPaRHtFJ3eoA+0mvaoi\/1gT7XV\/rRuX2Aszqny7u0y\/o4\/epzfIEb+1x38vkxypd7pId4mG\/1\/b7a05RPn2o\/va5D9ZmK6nsV0086Sj\/rCP2gEpZK2qrqfDrOmVXJh6iaD9XxzqK6PlJ1XFRn+SjVczGd4xJq4GN0gSuqtU\/WuS6jNj5FLVxKjV1B7VxZF7uqq6mjq+tS19QlrqHLXEtX+Axd5Xrq6vq62mf7LHVzA93qS9XTTTTMHTXKV2qcu2u8r9Hd7qHJ7q0p7qd73Vf3uI9m+AY96MGa7kF6xhP0tMdprm\/RUo\/XU75LS3y3lvserfIDWq31nqMNnqdXPdfX7+bxPpB8xtelMeNGt0sjusC379CvnurMY1TGmdRBl7u2uqi7Gyqr3v4jOs9Dd5Pp2T5aZ\/oIXeTTNMKXJcdq+PBEXVylvZ\/OcJE\/5ubXFyqor3Wbr1BOva+8+kSnOIdOc141czm18km6zudpuC\/RBF+rie6phz1ciz1WU91fM31jcp+GPnaXuVzvVrrDnZPXA91aL3nmbwGfuptTpIPz7\/0ee3jHAhm\/Zyzaxdgb8VqifjLNdRvjzdgaW2JbvJUheTwdS2JZrIjnE9fPxeJ4Kl6I5bE0nk1GX0yUlbFqp1Wr\/9RfE2sT9bp4KV7ebvSVZL0+pfdqRuT7bxMn7+X6UzImj7\/Kz3iZP\/Zib\/NWv+v3\/L7f9hZ\/4Bf9vNd7kxd6kZ\/0U17ipX7Wz3m5V\/gFr\/Qqr\/Yar\/U6v+SX\/Ypf9Qa\/5o1+3W94s9\/ym37HH\/oj\/+Af\/ZN\/DoUjU+wfB0TmyBoHxcGRLbJHjsgZh0SuyB15I18cFodG\/igQhaJwFIxicWyUiIj9oqR\/iSPjiDgqjo7iUSSKxjFxYGSJPHF48gyfRKkdzvRplM6w1+dp\/+rPokzy+vMom2y\/iHI7zPkyjtvl2q\/ieH8dJ+w0\/k2UT+OO38aJaUS\/i5PSzPf7qJBWHAAAAAAAAAAAAAAAAAAAAAAAAP9BhfXtDv1SjnStq+VCe33vzj4z3XPH+Kqdxu7zzr\/OnOWb0r3n856i5zxZK3xvutf87v5EyaUPlUcf6yBtVTa9o+x6Vzn0ng7WNmXSGzpAbyqzNiuL3tL+2qRTnUtVnEen+zCV94E6yQergrPpZGfXiT5I5\/tEtfQJGuQ2usFt1dtN1dfN1c8t1N8t1cfNdJMv1BBfrFvcXkPdQTf7Ij3qEZrv2\/S479BCj9Yij9GTvlNPeJTW+kGt8XSt8wy97Fl7fE7834oOyfriaJ\/SvyI6xSWJ9rK4PC5NtPPj8WiWEjtnF+unJ8rD8ch2I11i53exIo1PgRjxV7Pfbo86e79HKjv3TpQBMShR3xiJz50Ylij9on8MTInfHMlfmUfPlP4tMThR3xBD\/q6MMl4sSNZPpBKd96d+paiYbBf+vVkhY8Rv\/3IweReRKYkyNZL\/YRAjU8ZujftSru5Jdcc9\/y79feX4PZw\/JqUdF2P\/6j0BAPg3iAf3dQYA\/ouiW3Tf1zkAAAAAAAAAAAAAAAAAAAAAAAAAAAAAAAAAAAAAAAAAAAAAAAAAAAAAAAAAAAAAAAAAAAAAAAAAAAAAAAAAAAAAAAAAAAAAAAAAAAAAAAAAAAAAAAAAAAAAAAAAAAAAAAAAAAAAAAAAAAAAAAAAAAAAAAAAAAAAAAAAAAAAAAAAAAAAAAAAAAAAAAAAAAAAAAAAAAAAAAAAAAAAAAAA\/xzP94J9nQMAAAD+Kf8Dnbxkww==",
    "_version_": 6
}