{
  "title": "GitLab DevOps",
  "description": "Usando GitLab para DevOps",
  "difficulty": "Beginner",
  "time": "60 minutes",
  "details": {
    "steps": [
      {
        "title": "Step 1",
        "text": "step1.md"
      },
      {
        "title": "Step 2",
        "text": "step2.md"
      },
      {
        "title": "Step 3",
        "text": "step3.md"
      },
      {
        "title": "Step 4",
        "text": "step4.md"
      },
      {
        "title": "Step 5",
        "text": "step5.md"
      },
      {
        "title": "Step 6",
        "text": "step6.md"
      }
    ],
    "intro": {
      "text": "intro.md"
    },
    "finish": {
      "text": "finish.md"
    }
  },
  "environment": {
    "uilayout": "editor-terminal"
  },
  "backend": {
    "imageid": "ubuntu"
  }
}