<svg width="37" height="36" viewBox="0 0 37 36" fill="none" xmlns="http://www.w3.org/2000/svg">
<rect x="0.90625" width="36" height="36" rx="6" fill="white"/>
<path d="M15.1312 24V14.6562H12.225V24H15.1312ZM13.6625 13.4062C14.6 13.4062 15.35 12.625 15.35 11.6875C15.35 10.7812 14.6 10.0312 13.6625 10.0312C12.7562 10.0312 12.0062 10.7812 12.0062 11.6875C12.0062 12.625 12.7562 13.4062 13.6625 13.4062ZM25.975 24H26.0062V18.875C26.0062 16.375 25.4437 14.4375 22.5062 14.4375C21.1 14.4375 20.1625 15.2188 19.7562 15.9375H19.725V14.6562H16.9437V24H19.85V19.375C19.85 18.1562 20.0687 17 21.5687 17C23.0687 17 23.1 18.375 23.1 19.4688V24H25.975Z" fill="#0E1133"/>
</svg>
