{
  "log": {
    "level": 4
  },
  "common": {
    "outputName": "android",
    "mainBundleCompressionType": "merge_dep",
    "platform": "android",
    "startScene": "f43dc201-d674-4067-bfbe-44dad2e11bd8",
    "scenes": [
      {
        "url": "db://assets/scenes/main.scene",
        "uuid": "f43dc201-d674-4067-bfbe-44dad2e11bd8",
        "inBundle": false
      }
    ],
    "md5Cache": false,
    "replaceSplashScreen": true,
    "sourceMaps": true
  },
  "BuildTaskManager": {
    "taskMap": {
      "1650604229849": {
        "id": "1650604229849",
        "progress": 1,
        "state": "success",
        "message": "4-22-2022 12:29 make package D:\\StrikeBall\\build\\android success!",
        "options": {
          "name": "StrikeBall",
          "platform": "android",
          "buildPath": "project://build",
          "debug": false,
          "md5Cache": false,
          "sourceMaps": true,
          "replaceSplashScreen": true,
          "mainBundleCompressionType": "merge_dep",
          "mainBundleIsRemote": false,
          "mergeStartScene": false,
          "experimentalEraseModules": false,
          "compressTexture": true,
          "packAutoAtlas": true,
          "startScene": "f43dc201-d674-4067-bfbe-44dad2e11bd8",
          "scenes": [
            {
              "url": "db://assets/scenes/main.scene",
              "uuid": "f43dc201-d674-4067-bfbe-44dad2e11bd8",
              "inBundle": false
            }
          ],
          "outputName": "android",
          "packages": {
            "android": {
              "packageName": "com.strikeball",
              "orientation": {
                "portrait": true,
                "upsideDown": false,
                "landscapeRight": false,
                "landscapeLeft": false
              },
              "apiLevel": "android-32",
              "appABIs": [
                "arm64-v8a"
              ],
              "useDebugKeystore": true,
              "keystorePath": "",
              "keystorePassword": "",
              "keystoreAlias": "",
              "keystoreAliasPassword": "",
              "appBundle": false,
              "androidInstant": false,
              "remoteUrl": "",
              "sdkPath": "",
              "ndkPath": "",
              "renderBackEnd": {
                "vulkan": false,
                "gles3": true,
                "gles2": true
              }
            },
            "native": {
              "polyfills": {
                "asyncFunctions": true
              },
              "encrypted": false,
              "xxteaKey": "1bsUg7Ei5Oqb+5zW",
              "compressZip": false,
              "makeAfterBuild": false,
              "JobSystem": "tbb",
              "remoteServerAddress": ""
            },
            "cocos-service": {
              "configID": "750815",
              "services": []
            }
          }
        },
        "time": "4-22-2022 12:10",
        "dirty": false
      }
    }
  }
}
