[
  {
    "__type__": "cc.AnimationClip",
    "_name": "Idle",
    "_objFlags": 0,
    "_native": "",
    "sample": 60,
    "speed": 1,
    "wrapMode": 2,
    "enableTrsBlending": false,
    "_duration": 0.85,
    "_hash": 500763545,
    "_tracks": [
      {
        "__id__": 1
      }
    ],
    "_exoticAnimation": null,
    "_events": []
  },
  {
    "__type__": "cc.animation.ObjectTrack",
    "_binding": {
      "__type__": "cc.animation.TrackBinding",
      "path": {
        "__id__": 2
      }
    },
    "_channel": {
      "__id__": 4
    }
  },
  {
    "__type__": "cc.animation.TrackPath",
    "_paths": [
      {
        "__id__": 3
      },
      "spriteFrame"
    ]
  },
  {
    "__type__": "cc.animation.ComponentPath",
    "component": "cc.Sprite"
  },
  {
    "__type__": "cc.animation.Channel",
    "_curve": {
      "__id__": 5
    }
  },
  {
    "__type__": "cc.ObjectCurve",
    "_times": [
      0,
      0.08333333333333333,
      0.16666666666666666,
      0.25,
      0.3333333333333333,
      0.4166666666666667,
      0.5,
      0.5833333333333334,
      0.6666666666666666,
      0.75,
      0.8333333333333334
    ],
    "_values": [
      {
        "__uuid__": "4f4f8d1f-55ac-46b8-85e7-d40ecfc12e46@f9941",
        "__expectedType__": "cc.SpriteFrame"
      },
      {
        "__uuid__": "862651de-c759-4539-bfa2-70b0b7949d4c@f9941",
        "__expectedType__": "cc.SpriteFrame"
      },
      {
        "__uuid__": "8ab39add-f43d-4a19-b4cc-5035082ea44e@f9941",
        "__expectedType__": "cc.SpriteFrame"
      },
      {
        "__uuid__": "d292e285-464f-4b3f-b25c-7639c59eb803@f9941",
        "__expectedType__": "cc.SpriteFrame"
      },
      {
        "__uuid__": "e3e8867d-f4ac-4f3e-a0f0-7e1b49833a9c@f9941",
        "__expectedType__": "cc.SpriteFrame"
      },
      {
        "__uuid__": "1f1c9f45-d6c3-4e54-8163-8ad612e00e72@f9941",
        "__expectedType__": "cc.SpriteFrame"
      },
      {
        "__uuid__": "31b79245-54e9-4653-a11b-8024275c80ee@f9941",
        "__expectedType__": "cc.SpriteFrame"
      },
      {
        "__uuid__": "3a93d4a3-bbba-432d-971f-e765dde973f8@f9941",
        "__expectedType__": "cc.SpriteFrame"
      },
      {
        "__uuid__": "06a100e0-2e30-4b81-ab69-c59e9d7db4a5@f9941",
        "__expectedType__": "cc.SpriteFrame"
      },
      {
        "__uuid__": "1dfaf6f5-7350-4880-951a-44486be1ad8f@f9941",
        "__expectedType__": "cc.SpriteFrame"
      },
      {
        "__uuid__": "40726592-7ff5-4c29-b304-e954b5c35ae6@f9941",
        "__expectedType__": "cc.SpriteFrame"
      }
    ]
  }
]