[
  {
    "__type__": "cc.AnimationClip",
    "_name": "health",
    "_objFlags": 0,
    "_native": "",
    "sample": 60,
    "speed": 2,
    "wrapMode": 1,
    "enableTrsBlending": false,
    "_duration": 1.7,
    "_hash": 500763545,
    "_tracks": [
      {
        "__id__": 1
      }
    ],
    "_exoticAnimation": null,
    "_events": []
  },
  {
    "__type__": "cc.animation.ObjectTrack",
    "_binding": {
      "__type__": "cc.animation.TrackBinding",
      "path": {
        "__id__": 2
      }
    },
    "_channel": {
      "__id__": 5
    }
  },
  {
    "__type__": "cc.animation.TrackPath",
    "_paths": [
      {
        "__id__": 3
      },
      {
        "__id__": 4
      },
      "spriteFrame"
    ]
  },
  {
    "__type__": "cc.animation.HierarchyPath",
    "path": "health"
  },
  {
    "__type__": "cc.animation.ComponentPath",
    "component": "cc.Sprite"
  },
  {
    "__type__": "cc.animation.Channel",
    "_curve": {
      "__id__": 6
    }
  },
  {
    "__type__": "cc.ObjectCurve",
    "_times": [
      0.1,
      0.18333333333333332,
      0.26666666666666666,
      0.35,
      0.43333333333333335,
      0.5166666666666667,
      0.6,
      0.6833333333333333,
      0.7666666666666667,
      0.85,
      0.9333333333333333,
      1.0166666666666666,
      1.1,
      1.1833333333333333,
      1.2666666666666666,
      1.35,
      1.4333333333333333,
      1.5166666666666666,
      1.6,
      1.6833333333333333
    ],
    "_values": [
      {
        "__uuid__": "bca6f895-7f02-47fd-afb5-7f39610caf21@f9941",
        "__expectedType__": "cc.SpriteFrame"
      },
      {
        "__uuid__": "fc9a5ea4-76ee-45b9-a033-c222e8e03d97@f9941",
        "__expectedType__": "cc.SpriteFrame"
      },
      {
        "__uuid__": "1e78c565-c2d8-4421-b9af-83d35bc56af8@f9941",
        "__expectedType__": "cc.SpriteFrame"
      },
      {
        "__uuid__": "74269a6d-94a3-47ad-84a3-6e975cc82ab2@f9941",
        "__expectedType__": "cc.SpriteFrame"
      },
      {
        "__uuid__": "046f32ee-b766-4c28-8232-4dcc177eeed1@f9941",
        "__expectedType__": "cc.SpriteFrame"
      },
      {
        "__uuid__": "eab294bf-e73f-43c3-a2b3-050f98971e61@f9941",
        "__expectedType__": "cc.SpriteFrame"
      },
      {
        "__uuid__": "16e9f7f4-c4c7-46f1-ad71-a2979c63403a@f9941",
        "__expectedType__": "cc.SpriteFrame"
      },
      {
        "__uuid__": "2c69e54a-ce96-48ce-8b5d-eebe28ac3d6a@f9941",
        "__expectedType__": "cc.SpriteFrame"
      },
      {
        "__uuid__": "e8632746-974d-4efc-8261-30cf2a3a3c08@f9941",
        "__expectedType__": "cc.SpriteFrame"
      },
      {
        "__uuid__": "8f32b15b-ebe2-48e6-bbb0-a8827bc2b3c9@f9941",
        "__expectedType__": "cc.SpriteFrame"
      },
      {
        "__uuid__": "18b7cdff-0682-4e0e-9ca2-8d777d3d637f@f9941",
        "__expectedType__": "cc.SpriteFrame"
      },
      {
        "__uuid__": "a6e111c3-6a5f-4e15-9ce0-3dfced56e638@f9941",
        "__expectedType__": "cc.SpriteFrame"
      },
      {
        "__uuid__": "b6212432-3053-4130-94a3-157391179b1a@f9941",
        "__expectedType__": "cc.SpriteFrame"
      },
      {
        "__uuid__": "ef361f89-df9a-4797-afcd-acfbb48c5c9a@f9941",
        "__expectedType__": "cc.SpriteFrame"
      },
      {
        "__uuid__": "3413848c-ab57-484b-881f-9187336f5c10@f9941",
        "__expectedType__": "cc.SpriteFrame"
      },
      {
        "__uuid__": "1a42e888-726f-4f7d-a6c4-6c5d435b1539@f9941",
        "__expectedType__": "cc.SpriteFrame"
      },
      {
        "__uuid__": "b071bc1c-7dc9-4cc8-9378-f3961b9ad294@f9941",
        "__expectedType__": "cc.SpriteFrame"
      },
      {
        "__uuid__": "113c8616-986e-45ab-940e-9d4d21cef924@f9941",
        "__expectedType__": "cc.SpriteFrame"
      },
      {
        "__uuid__": "5171605b-e8cf-477b-933c-47471b904850@f9941",
        "__expectedType__": "cc.SpriteFrame"
      },
      {
        "__uuid__": "e1292768-40d7-4668-b886-24696ff5d42f@f9941",
        "__expectedType__": "cc.SpriteFrame"
      }
    ]
  }
]