{
  "splash-setting": {
    "url": "",
    "totalTime": 0,
    "displayWatermark": false
  },
  "textureCompressConfig": {
    "userPreset": {
      "54dq+tl7ZH+7UdxaU1cHDy": {
        "name": "web",
        "options": {
          "web": {
            "png": 80
          }
        }
      }
    }
  },
  "__version__": "1.3.2"
}
