[
  {
    "__type__": "cc.AnimationClip",
    "_name": "Run",
    "_objFlags": 0,
    "_native": "",
    "sample": 60,
    "speed": 1,
    "wrapMode": 2,
    "enableTrsBlending": false,
    "_duration": 0.9333333333333333,
    "_hash": 500763545,
    "_tracks": [
      {
        "__id__": 1
      }
    ],
    "_exoticAnimation": null,
    "_events": []
  },
  {
    "__type__": "cc.animation.ObjectTrack",
    "_binding": {
      "__type__": "cc.animation.TrackBinding",
      "path": {
        "__id__": 2
      }
    },
    "_channel": {
      "__id__": 4
    }
  },
  {
    "__type__": "cc.animation.TrackPath",
    "_paths": [
      {
        "__id__": 3
      },
      "spriteFrame"
    ]
  },
  {
    "__type__": "cc.animation.ComponentPath",
    "component": "cc.Sprite"
  },
  {
    "__type__": "cc.animation.Channel",
    "_curve": {
      "__id__": 5
    }
  },
  {
    "__type__": "cc.ObjectCurve",
    "_times": [
      0,
      0.08333333333333333,
      0.16666666666666666,
      0.25,
      0.3333333333333333,
      0.4166666666666667,
      0.5,
      0.5833333333333334,
      0.6666666666666666,
      0.75,
      0.8333333333333334,
      0.9166666666666666
    ],
    "_values": [
      {
        "__uuid__": "1d8f5730-fab8-4142-b3a1-8ae0361c91de@f9941",
        "__expectedType__": "cc.SpriteFrame"
      },
      {
        "__uuid__": "5e827eca-c46f-476e-bd20-ece9576a0836@f9941",
        "__expectedType__": "cc.SpriteFrame"
      },
      {
        "__uuid__": "0efc3679-87f4-4b94-b16e-7997ae50be24@f9941",
        "__expectedType__": "cc.SpriteFrame"
      },
      {
        "__uuid__": "24a24cd8-edb1-4322-aaf0-79449411e91f@f9941",
        "__expectedType__": "cc.SpriteFrame"
      },
      {
        "__uuid__": "46e48e6d-39bb-4818-843c-f45900a161f6@f9941",
        "__expectedType__": "cc.SpriteFrame"
      },
      {
        "__uuid__": "66cad16f-f47c-410c-a543-08213f8c9799@f9941",
        "__expectedType__": "cc.SpriteFrame"
      },
      {
        "__uuid__": "c4581bfd-4789-496b-a41e-dd4cc9492c0b@f9941",
        "__expectedType__": "cc.SpriteFrame"
      },
      {
        "__uuid__": "3d9e146f-468f-4bb4-a4b1-473ea2313931@f9941",
        "__expectedType__": "cc.SpriteFrame"
      },
      {
        "__uuid__": "767e44fd-2449-494f-a687-b95c238ad2ac@f9941",
        "__expectedType__": "cc.SpriteFrame"
      },
      {
        "__uuid__": "4e941cbb-899c-49cd-a3fc-3a957cee67b8@f9941",
        "__expectedType__": "cc.SpriteFrame"
      },
      {
        "__uuid__": "3209ecdb-5b10-436e-9780-854cde648587@f9941",
        "__expectedType__": "cc.SpriteFrame"
      },
      {
        "__uuid__": "df06b397-d36d-409f-9f71-bedb2b3571a0@f9941",
        "__expectedType__": "cc.SpriteFrame"
      }
    ]
  }
]