[
  {
    "__type__": "cc.AnimationClip",
    "_name": "shield",
    "_objFlags": 0,
    "_native": "",
    "sample": 60,
    "speed": 5,
    "wrapMode": 1,
    "enableTrsBlending": false,
    "_duration": 4.133333333333334,
    "_hash": 500763545,
    "_tracks": [
      {
        "__id__": 1
      }
    ],
    "_exoticAnimation": null,
    "_events": []
  },
  {
    "__type__": "cc.animation.ObjectTrack",
    "_binding": {
      "__type__": "cc.animation.TrackBinding",
      "path": {
        "__id__": 2
      }
    },
    "_channel": {
      "__id__": 5
    }
  },
  {
    "__type__": "cc.animation.TrackPath",
    "_paths": [
      {
        "__id__": 3
      },
      {
        "__id__": 4
      },
      "spriteFrame"
    ]
  },
  {
    "__type__": "cc.animation.HierarchyPath",
    "path": "shield"
  },
  {
    "__type__": "cc.animation.ComponentPath",
    "component": "cc.Sprite"
  },
  {
    "__type__": "cc.animation.Channel",
    "_curve": {
      "__id__": 6
    }
  },
  {
    "__type__": "cc.ObjectCurve",
    "_times": [
      0.03333333333333333,
      0.11666666666666667,
      0.2,
      0.2833333333333333,
      0.36666666666666664,
      0.45,
      0.5333333333333333,
      0.6166666666666667,
      0.7,
      0.7833333333333333,
      0.8666666666666667,
      0.95,
      1.0333333333333334,
      1.1166666666666667,
      1.2,
      1.2833333333333334,
      1.3666666666666667,
      1.45,
      1.5333333333333334,
      1.6166666666666667,
      1.7,
      1.7833333333333334,
      1.8666666666666667,
      1.95,
      2.033333333333333,
      2.1166666666666667,
      2.2,
      2.283333333333333,
      2.3666666666666667,
      2.45,
      2.533333333333333,
      2.6166666666666667,
      2.7,
      2.783333333333333,
      2.8666666666666667,
      2.95,
      3.033333333333333,
      3.1166666666666667,
      3.2,
      3.283333333333333,
      3.3666666666666667,
      3.45,
      3.533333333333333,
      3.6166666666666667,
      3.7,
      3.783333333333333,
      3.8666666666666667,
      3.95,
      4.033333333333333,
      4.116666666666666
    ],
    "_values": [
      {
        "__uuid__": "8d6923c2-b05b-4cba-80c4-cd5ad798d068@f9941",
        "__expectedType__": "cc.SpriteFrame"
      },
      {
        "__uuid__": "0866b6e9-b15b-4417-ba69-1b2e4fb21efc@f9941",
        "__expectedType__": "cc.SpriteFrame"
      },
      {
        "__uuid__": "8aa6d026-ef07-4779-81d3-f2bf24866fa4@f9941",
        "__expectedType__": "cc.SpriteFrame"
      },
      {
        "__uuid__": "fb82fcc1-7cce-4535-ab1b-404585723b32@f9941",
        "__expectedType__": "cc.SpriteFrame"
      },
      {
        "__uuid__": "95599be8-a10a-43d7-b1b3-7a4318bc6e13@f9941",
        "__expectedType__": "cc.SpriteFrame"
      },
      {
        "__uuid__": "54c8ce10-7e79-495a-971d-3741ff03ac84@f9941",
        "__expectedType__": "cc.SpriteFrame"
      },
      {
        "__uuid__": "306b92b4-3158-4799-b690-d412417d7778@f9941",
        "__expectedType__": "cc.SpriteFrame"
      },
      {
        "__uuid__": "d4bf5687-d25f-4680-99f3-60995999e968@f9941",
        "__expectedType__": "cc.SpriteFrame"
      },
      {
        "__uuid__": "6025dc61-4619-486e-897c-afa032c8ab8e@f9941",
        "__expectedType__": "cc.SpriteFrame"
      },
      {
        "__uuid__": "9532ad0a-5e09-44cf-8401-90c4feca40fd@f9941",
        "__expectedType__": "cc.SpriteFrame"
      },
      {
        "__uuid__": "9fcc3bda-2546-495c-a274-311b33886115@f9941",
        "__expectedType__": "cc.SpriteFrame"
      },
      {
        "__uuid__": "32c6dcf8-a800-4eb2-ac67-54484ae512e7@f9941",
        "__expectedType__": "cc.SpriteFrame"
      },
      {
        "__uuid__": "c78fc5f6-1b9e-4d69-bae7-2a9fe640757d@f9941",
        "__expectedType__": "cc.SpriteFrame"
      },
      {
        "__uuid__": "025c5363-8652-48cc-8e28-a8eef08e54a6@f9941",
        "__expectedType__": "cc.SpriteFrame"
      },
      {
        "__uuid__": "3bf629f4-156a-4bc4-a096-e1cc10757613@f9941",
        "__expectedType__": "cc.SpriteFrame"
      },
      {
        "__uuid__": "6d162180-aabb-4c7f-8153-3f30bb0621cb@f9941",
        "__expectedType__": "cc.SpriteFrame"
      },
      {
        "__uuid__": "34ee668a-94fd-4549-a7f1-928e86566bec@f9941",
        "__expectedType__": "cc.SpriteFrame"
      },
      {
        "__uuid__": "58bd4174-1dad-4cab-972e-dcfa719fa02e@f9941",
        "__expectedType__": "cc.SpriteFrame"
      },
      {
        "__uuid__": "b04349bb-4755-4fc1-aa47-240b363367c9@f9941",
        "__expectedType__": "cc.SpriteFrame"
      },
      {
        "__uuid__": "9f3ef0ee-3abe-4f0a-b346-52cade32c80d@f9941",
        "__expectedType__": "cc.SpriteFrame"
      },
      {
        "__uuid__": "8362bcd1-1077-44e9-8608-916acfc67231@f9941",
        "__expectedType__": "cc.SpriteFrame"
      },
      {
        "__uuid__": "d84ee025-4c78-4a02-8afa-5b7262bf9c9c@f9941",
        "__expectedType__": "cc.SpriteFrame"
      },
      {
        "__uuid__": "172a9d0a-fc98-410c-93ce-4e91b380f77c@f9941",
        "__expectedType__": "cc.SpriteFrame"
      },
      {
        "__uuid__": "fb1b9a3b-2bbe-44e7-a222-b4561eb0faeb@f9941",
        "__expectedType__": "cc.SpriteFrame"
      },
      {
        "__uuid__": "266c4677-3917-4b91-9198-aa3844f35c2b@f9941",
        "__expectedType__": "cc.SpriteFrame"
      },
      {
        "__uuid__": "44afdb13-6727-46ed-ac59-7a7fb3dde1b9@f9941",
        "__expectedType__": "cc.SpriteFrame"
      },
      {
        "__uuid__": "2aa905e9-32dc-4c3a-b65c-e7b28f2fdcaf@f9941",
        "__expectedType__": "cc.SpriteFrame"
      },
      {
        "__uuid__": "e2f893bb-e5e1-41d8-ba04-7f74323af0ba@f9941",
        "__expectedType__": "cc.SpriteFrame"
      },
      {
        "__uuid__": "1da4c5d9-a4f1-47b7-966b-ab2b036c02c1@f9941",
        "__expectedType__": "cc.SpriteFrame"
      },
      {
        "__uuid__": "69adf22c-119b-480b-acdf-1eba09819cd7@f9941",
        "__expectedType__": "cc.SpriteFrame"
      },
      {
        "__uuid__": "02f21bba-a21c-4e5a-b406-fb4d10dbc614@f9941",
        "__expectedType__": "cc.SpriteFrame"
      },
      {
        "__uuid__": "d477e44d-ddd8-497d-9111-fccfe7281b36@f9941",
        "__expectedType__": "cc.SpriteFrame"
      },
      {
        "__uuid__": "ec7343d9-b3c0-4cc3-9aa0-df723250292d@f9941",
        "__expectedType__": "cc.SpriteFrame"
      },
      {
        "__uuid__": "f6bfff1d-77f9-4ba7-9069-39f243d5767e@f9941",
        "__expectedType__": "cc.SpriteFrame"
      },
      {
        "__uuid__": "af5d5552-7f3a-477a-9613-0c3b81156a12@f9941",
        "__expectedType__": "cc.SpriteFrame"
      },
      {
        "__uuid__": "0ba0c908-c6a1-4c1b-a9e1-ce43411ea17f@f9941",
        "__expectedType__": "cc.SpriteFrame"
      },
      {
        "__uuid__": "a763915a-82fd-4b82-b86e-811c16c94f3b@f9941",
        "__expectedType__": "cc.SpriteFrame"
      },
      {
        "__uuid__": "0d792af2-56ce-4d85-9163-cf5fc385f1e3@f9941",
        "__expectedType__": "cc.SpriteFrame"
      },
      {
        "__uuid__": "0d0f40d2-43a2-46eb-9887-bc839a2e83dc@f9941",
        "__expectedType__": "cc.SpriteFrame"
      },
      {
        "__uuid__": "ebbf2e56-732e-4b69-b9c2-0d0e50b112f1@f9941",
        "__expectedType__": "cc.SpriteFrame"
      },
      {
        "__uuid__": "c93cbc99-9b35-42f4-bb35-d89e97a36c3e@f9941",
        "__expectedType__": "cc.SpriteFrame"
      },
      {
        "__uuid__": "900b91fc-e9b9-4b88-b314-266acd2e7bff@f9941",
        "__expectedType__": "cc.SpriteFrame"
      },
      {
        "__uuid__": "f0267af4-6f57-496c-a04a-0cd4bb87343d@f9941",
        "__expectedType__": "cc.SpriteFrame"
      },
      {
        "__uuid__": "a389f904-9d86-4c95-aa62-85b5fcea9b8a@f9941",
        "__expectedType__": "cc.SpriteFrame"
      },
      {
        "__uuid__": "6a492f8b-9a3a-4355-8ea6-5c599d4be8ed@f9941",
        "__expectedType__": "cc.SpriteFrame"
      },
      {
        "__uuid__": "96eb2005-6e98-41e9-a812-9e5b00fcf89d@f9941",
        "__expectedType__": "cc.SpriteFrame"
      },
      {
        "__uuid__": "d27dde4d-ab9e-43e7-af48-d3baa765809d@f9941",
        "__expectedType__": "cc.SpriteFrame"
      },
      {
        "__uuid__": "448a4b11-fa5f-45b4-8765-6595226036f6@f9941",
        "__expectedType__": "cc.SpriteFrame"
      },
      {
        "__uuid__": "9db7ff64-490d-45e9-8419-1a8811f2b329@f9941",
        "__expectedType__": "cc.SpriteFrame"
      },
      {
        "__uuid__": "fa5eb4a9-80e3-41d9-8edf-73d373331916@f9941",
        "__expectedType__": "cc.SpriteFrame"
      }
    ]
  }
]