<svg xmlns="http://www.w3.org/2000/svg" width="98" height="98" fill="none" viewBox="0 0 98 98">
    <circle cx="49" cy="49" r="49" fill="#F7D235"/>
    <path fill="#fff" fill-opacity=".7" d="M45 24h11v4H45z"/>
    <ellipse cx="47.5" cy="52.5" fill="#fff" fill-opacity=".7" rx="11.5" ry="14.5"/>
    <path fill="#0D4072" d="M70.9 50.406a20.604 20.604 0 0 0-5.908-12.487A20.385 20.385 0 0 0 54.959 32.4v-2.585A3.46 3.46 0 0 0 54.125 23h-7.312a3.46 3.46 0 0 0-.833 6.816v2.592a20.384 20.384 0 0 0-10.002 5.51 20.633 20.633 0 0 0-1.724 1.961.98.98 0 0 0-.078-.004H26.94a1.017 1.017 0 0 0 0 2.035h5.932a20.407 20.407 0 0 0-1.802 3.91H20.016a1.017 1.017 0 0 0 0 2.035h10.48a20.714 20.714 0 0 0-.505 3.91h-4.49a1.017 1.017 0 0 0 0 2.035h4.523c.085 1.317.297 2.627.634 3.91h-6.58a1.016 1.016 0 0 0 0 2.035h7.228a20.436 20.436 0 0 0 4.672 7.237A20.54 20.54 0 0 0 48.457 72.9a20.54 20.54 0 0 0 13.21-3.215c.47-.307.602-.938.296-1.408a1.015 1.015 0 0 0-1.405-.298c-7.268 4.74-17.001 3.716-23.144-2.437-7.207-7.22-7.207-18.966 0-26.186 7.207-7.219 18.934-7.219 26.142 0 6.134 6.145 7.163 15.887 2.446 23.163a1.018 1.018 0 0 0 .298 1.407c.471.306 1.1.172 1.405-.299A20.643 20.643 0 0 0 70.9 50.406zM45.39 26.459c0-.785.638-1.424 1.422-1.424h7.313a1.425 1.425 0 0 1 0 2.848H46.813a1.425 1.425 0 0 1-1.422-1.424zm2.62 5.599v-2.14h4.917v2.136a20.658 20.658 0 0 0-4.917.004z"/>
    <path fill="#0D4072" d="M64.274 65.245a1.02 1.02 0 0 0-1.015 1.017 1.016 1.016 0 1 0 1.734-.72 1.025 1.025 0 0 0-.719-.297zM50.485 36.668c-8.688 0-15.756 7.08-15.756 15.782 0 8.703 7.068 15.782 15.756 15.782S66.24 61.152 66.24 52.45s-7.067-15.782-15.755-15.782zm0 29.53c-7.568 0-13.724-6.167-13.724-13.748 0-7.58 6.156-13.747 13.724-13.747 7.568 0 13.724 6.167 13.724 13.747s-6.156 13.748-13.724 13.748z"/>
    <path fill="#0D4072" d="M56.91 44.576l-5.031 5.04a3.132 3.132 0 0 0-2.788 0l-2.252-2.256a1.015 1.015 0 0 0-1.436 0 1.019 1.019 0 0 0 0 1.439l2.252 2.255a3.162 3.162 0 0 0 2.83 4.558 3.162 3.162 0 0 0 2.83-4.558l4.883-4.891.148-.148a1.019 1.019 0 0 0 0-1.439 1.014 1.014 0 0 0-1.436 0zm-6.425 9.001a1.127 1.127 0 0 1 0-2.253 1.127 1.127 0 0 1 0 2.253zM61.344 51.445h-.94a1.016 1.016 0 0 0 0 2.035h.94a1.017 1.017 0 0 0 0-2.035zM40.567 51.42h-.941a1.017 1.017 0 0 0 0 2.035h.94a1.017 1.017 0 0 0 0-2.035zM50.497 43.532c.561 0 1.016-.455 1.016-1.017v-.942a1.016 1.016 0 1 0-2.031 0v.942c0 .562.455 1.017 1.015 1.017zM50.472 61.368c-.56 0-1.015.456-1.015 1.017v.943a1.016 1.016 0 1 0 2.031 0v-.943c0-.561-.455-1.017-1.016-1.017zM20.016 57.71c-.267 0-.53.11-.718.298-.19.19-.298.452-.298.72 0 .268.109.53.298.719.189.19.45.298.718.298.267 0 .529-.109.718-.298.188-.19.297-.452.297-.72 0-.267-.108-.53-.297-.718a1.022 1.022 0 0 0-.718-.299z"/>
</svg>
