<svg xmlns="http://www.w3.org/2000/svg" width="53" height="53" fill="none" viewBox="0 0 53 53">
    <path fill="#F7D235" d="M39.51 2.89h6.526a6 6 0 0 1 6 6v33.4a3 3 0 0 1-3 3H39.51V2.89z"/>
    <ellipse cx="5.782" cy="8.673" fill="#002D58" rx="1.927" ry="1.927"/>
    <ellipse cx="21.2" cy="8.673" fill="#002D58" rx="1.927" ry="1.927"/>
    <path fill="#002D58" d="M29.267 20h21.806c.73 0 1.321-.594 1.321-1.327s-.591-1.327-1.321-1.327H29.267c-.73 0-1.322.594-1.322 1.327S28.537 20 29.267 20zM2.285 20h14.537c.73 0 1.322-.594 1.322-1.327s-.592-1.327-1.322-1.327H2.285c-.73 0-1.321.594-1.321 1.327S1.555 20 2.285 20z"/>
    <path fill="#ADB6BF" d="M53 14.215V6.506c0-2.538-1.987-4.579-4.43-4.579H4.43C1.987 1.927 0 3.968 0 6.507v35.585c0 2.539 1.987 4.638 4.43 4.638h21.438l.854 1.503a4.754 4.754 0 0 0 4.17 2.427h4.591a4.747 4.747 0 0 0 4.707-3.93h8.38c2.443 0 4.43-2.1 4.43-4.638v-27.86-.008-.01zM4.43 3.724h44.14c1.452 0 2.633 1.235 2.633 2.782v6.875H1.797V6.506c0-1.547 1.18-2.782 2.633-2.782zm31.053 45.14h-4.591a2.973 2.973 0 0 1-2.601-1.524l-3.716-6.665a1.24 1.24 0 0 1 1.576.238l1.146 1.316a.898.898 0 0 0 1.575-.59c-.002-3.22-.002-7.434.003-9.59a.27.27 0 0 1 .295-.253h.44a.267.267 0 0 1 .297.254c0 .52-.032 7.526-.032 7.596 0 .04-.006.082-.006.12v.368a.898.898 0 0 0 1.796 0v-2.159a.14.14 0 0 1 .133-.116h.895c.058.006.1.058.095.116v2.862a.898.898 0 0 0 1.797 0v-2.159c0-.058.066-.145.124-.145h.888c.058 0 .11.087.11.145v2.159a.898.898 0 0 0 1.797 0v-.323a.342.342 0 0 1 .07-.234.152.152 0 0 1 .122-.04l.47.002a.28.28 0 0 1 .296.278c.005 1.85.031 1.884.03 2.792-.001.47.023 1.176.023 2.482v.11c0 1.645-1.392 2.96-3.032 2.96zM21.53 35.614c-.474 0-.926-.201-1.243-.554a1.428 1.428 0 0 1-.354-1.108l1.137-9.904h.939v2.36a.898.898 0 0 0 1.796 0v-2.36h5.614v2.36a.898.898 0 0 0 1.797 0v-2.36h.774l1.137 9.899c.044.398-.084.796-.353 1.093-.28.308-.664.5-1.079.537.005-1.675.009-3.288.008-3.532A2.053 2.053 0 0 0 29.61 30h-.44a2.063 2.063 0 0 0-2.092 2.057l-.004 3.558H21.53zm7.89-13.363h-5.615v-.846c0-1.437 1.262-2.606 2.807-2.606 1.546 0 2.808 1.17 2.808 2.606v.846zm19.15 22.683h-8.311l.002-1.6c.002-.912.002-.955-.003-2.81a2.09 2.09 0 0 0-2.092-2.075l-.471-.003c-.071 0-.14-.017-.21-.01a1.923 1.923 0 0 0-1.888-1.7h-.887a1.903 1.903 0 0 0-.491.084 1.86 1.86 0 0 0-.344-.343 3.19 3.19 0 0 0 1.037-2.721l-1.228-10.693a.912.912 0 0 0-.893-.812h-1.575v-.846c0-2.427-2.068-4.402-4.604-4.402s-4.603 1.975-4.603 4.402v.846h-1.74a.914.914 0 0 0-.892.813L18.148 33.75c-.1.91.19 1.819.798 2.502a3.473 3.473 0 0 0 2.584 1.158h5.544v1.933a3.043 3.043 0 0 0-3.8.074l-.41.311a.92.92 0 0 0-.238 1.166l2.241 4.04H4.43c-1.452 0-2.633-1.295-2.633-2.842V15.177h49.406v26.915c0 1.547-1.181 2.842-2.633 2.842z"/>
    <path fill="#ADB6BF" d="M13.846 11.933c1.794 0 3.253-1.511 3.253-3.369 0-1.858-1.46-3.368-3.253-3.368-1.793 0-3.252 1.511-3.252 3.369 0 1.857 1.459 3.368 3.252 3.368zm0-4.94c.803 0 1.456.705 1.456 1.572 0 .866-.653 1.572-1.456 1.572-.803 0-1.456-.705-1.456-1.572 0-.868.653-1.572 1.456-1.572zM21.497 11.933c1.794 0 3.253-1.511 3.253-3.369 0-1.858-1.459-3.368-3.253-3.368-1.793 0-3.252 1.511-3.252 3.369 0 1.857 1.459 3.368 3.252 3.368zm0-4.94c.803 0 1.456.705 1.456 1.572 0 .866-.653 1.572-1.456 1.572-.803 0-1.456-.705-1.456-1.572 0-.868.654-1.572 1.456-1.572zM6.195 11.933c1.794 0 3.253-1.511 3.253-3.369 0-1.858-1.46-3.368-3.253-3.368-1.793 0-3.252 1.511-3.252 3.369 0 1.857 1.459 3.368 3.252 3.368zm0-4.94c.803 0 1.456.705 1.456 1.572 0 .866-.653 1.572-1.456 1.572-.803 0-1.456-.705-1.456-1.572 0-.868.653-1.572 1.456-1.572z"/>
</svg>
