<svg xmlns="http://www.w3.org/2000/svg" width="98" height="98" fill="none" viewBox="0 0 98 98">
    <circle cx="49" cy="49" r="49" fill="#F7D235"/>
    <circle cx="48.5" cy="44.5" r="8.5" fill="#fff" fill-opacity=".7"/>
    <path fill="#0D4072" d="M49.328 27.916c-3.09 0-6.122.797-8.77 2.306a.96.96 0 0 0-.358 1.34c.285.466.908.62 1.39.346a15.652 15.652 0 0 1 7.738-2.034c8.4 0 15.234 6.588 15.234 14.685 0 6.015-3.737 11.36-9.521 13.617a.98.98 0 0 0-.635.908v1.335H44.25v-1.335a.98.98 0 0 0-.635-.908c-5.784-2.257-9.521-7.602-9.521-13.617 0-2.628.73-5.207 2.11-7.458a.96.96 0 0 0-.358-1.34 1.037 1.037 0 0 0-1.391.344 16.17 16.17 0 0 0-2.392 8.454c0 3.38 1.045 6.634 3.023 9.41a17.116 17.116 0 0 0 7.133 5.76v.859c-1.182.404-2.032 1.492-2.032 2.768 0 .752.295 1.438.779 1.958a2.866 2.866 0 0 0-.779 1.958c0 1.304.886 2.41 2.107 2.794.413 2.302 2.498 4.06 5.003 4.06h4.062c2.505 0 4.59-1.758 5.003-4.06 1.221-.383 2.107-1.49 2.107-2.794 0-.751-.295-1.438-.779-1.958.484-.52.779-1.206.779-1.958 0-1.276-.85-2.364-2.032-2.768v-.859a17.115 17.115 0 0 0 7.133-5.76 16.134 16.134 0 0 0 3.024-9.41c0-9.177-7.746-16.643-17.266-16.643zm7.11 35.44c0 .54-.456.98-1.016.98H43.234c-.56 0-1.015-.44-1.015-.98s.455-.979 1.015-.979h12.188c.56 0 1.016.44 1.016.98zm0 3.916c0 .54-.456.98-1.016.98H43.234c-.56 0-1.015-.44-1.015-.98s.455-.979 1.015-.979h12.188c.56 0 1.016.44 1.016.98zm-5.079 4.895h-4.062c-1.324 0-2.453-.818-2.872-1.958h9.807c-.42 1.14-1.549 1.958-2.873 1.958zM49.328 25.958c.561 0 1.016-.438 1.016-.98 0-.54-.455-.978-1.016-.978-.561 0-1.016.438-1.016.979 0 .54.456.979 1.017.979zM58.952 28.436c.166.099.35.145.532.145.34 0 .674-.165.866-.466a.959.959 0 0 0-.333-1.347 1.038 1.038 0 0 0-1.398.32.96.96 0 0 0 .333 1.348zM67.813 34.305a1.035 1.035 0 0 0-1.375-.398.962.962 0 0 0-.413 1.327c.184.328.534.515.895.515.163 0 .328-.038.48-.117a.961.961 0 0 0 .413-1.327zM69.64 43.58c-.56 0-1.015.439-1.015.98 0 .54.455.979 1.016.979.56 0 1.015-.439 1.015-.98 0-.54-.454-.979-1.015-.979zM67.4 53.487a1.036 1.036 0 0 0-1.375.398.961.961 0 0 0 .412 1.327c.154.079.319.117.481.117.362 0 .712-.187.895-.515v-.001a.96.96 0 0 0-.412-1.326zM39.173 28.581c.194 0 .39-.053.563-.164a.957.957 0 0 0 .281-1.358 1.04 1.04 0 0 0-1.408-.271.957.957 0 0 0-.282 1.357c.196.283.518.436.846.436zM31.205 35.603c.166.098.35.145.53.145.342 0 .675-.166.867-.466a.959.959 0 0 0-.333-1.347 1.038 1.038 0 0 0-1.397.32v.001a.959.959 0 0 0 .333 1.347zM29.016 43.58c-.561 0-1.016.438-1.016.979 0 .541.455.979 1.016.979.56 0 1.015-.439 1.015-.98 0-.54-.454-.978-1.015-.978zM31.483 53.064a.959.959 0 0 0-.332 1.347 1.04 1.04 0 0 0 1.397.32.96.96 0 0 0 .333-1.346 1.038 1.038 0 0 0-1.398-.321z"/>
    <path fill="#0D4072" d="M58.413 49.048c.522.198 1.112-.05 1.317-.553.51-1.254.77-2.578.77-3.936 0-5.938-5.012-10.769-11.172-10.769-6.16 0-11.172 4.831-11.172 10.77 0 5.937 5.012 10.768 11.172 10.768 1.409 0 2.782-.25 4.083-.742a.968.968 0 0 0 .574-1.27c-.205-.502-.795-.75-1.317-.552a9.397 9.397 0 0 1-3.34.606c-5.04 0-9.14-3.952-9.14-8.81 0-4.86 4.1-8.812 9.14-8.812 5.04 0 9.14 3.953 9.14 8.811a8.491 8.491 0 0 1-.629 3.22.968.968 0 0 0 .574 1.269zM37.837 34.462c.26 0 .52-.096.719-.287a.954.954 0 0 0 0-1.384 1.043 1.043 0 0 0-1.436 0 .954.954 0 0 0 0 1.384c.198.191.458.287.718.287z"/>
    <path fill="#0D4072" d="M56.51 52.461c.26 0 .52-.096.718-.287a.955.955 0 0 0 0-1.385 1.043 1.043 0 0 0-1.436 0 .954.954 0 0 0 0 1.385c.198.191.458.287.718.287zM48.312 41.693c0-1.62-1.366-2.938-3.046-2.938-1.68 0-3.047 1.318-3.047 2.938s1.367 2.937 3.047 2.937c1.68 0 3.046-1.318 3.046-2.937zm-3.046.979c-.56 0-1.016-.44-1.016-.98s.456-.978 1.016-.978 1.015.439 1.015.979-.456.979-1.015.979zM45.773 50.494a1.04 1.04 0 0 0 1.388-.358l6.093-10.174a.96.96 0 0 0-.371-1.337 1.037 1.037 0 0 0-1.388.358l-6.093 10.174a.96.96 0 0 0 .371 1.337zM53.39 50.363c1.68 0 3.048-1.318 3.048-2.937 0-1.62-1.367-2.937-3.047-2.937-1.68 0-3.047 1.317-3.047 2.937 0 1.62 1.367 2.937 3.047 2.937zm0-3.916c.56 0 1.016.439 1.016.979s-.455.979-1.015.979c-.56 0-1.016-.44-1.016-.98 0-.539.456-.978 1.016-.978z"/>
</svg>
