<?xml version="1.0" standalone="no"?>
<!DOCTYPE svg PUBLIC "-//W3C//DTD SVG 1.1//EN" "http://www.w3.org/Graphics/SVG/1.1/DTD/svg11.dtd" >
<!--
2016-10-18: Created.
-->
<svg xmlns="http://www.w3.org/2000/svg">
<metadata>
Created by FontForge 20120731 at Tue Oct 18 14:33:03 2016
 By Apache
Created by Apache with FontForge 2.0 (http://fontforge.sf.net)
</metadata>
<defs>
<font id="Flaticon" horiz-adv-x="512" >
  <font-face 
    font-family="Flaticon"
    font-weight="500"
    font-stretch="normal"
    units-per-em="512"
    panose-1="2 0 6 3 0 0 0 0 0 0"
    ascent="448"
    descent="-64"
    bbox="-0.000626564 -64.001 512 448"
    underline-thickness="25.6"
    underline-position="-51.2"
    unicode-range="U+0020-F118"
  />
    <missing-glyph />
    <glyph glyph-name="space" unicode=" " horiz-adv-x="200" 
 />
    <glyph glyph-name="uniF10D" unicode="&#xf10d;" 
d="M308.97 333.485c0.625977 40.9258 33.9482 73.9404 75.0273 73.9531c41.4746 0 75.0908 -33.6152 75.0908 -75.0908c0 -41.4688 -33.6162 -75.084 -75.0908 -75.084c-11.3613 0 -22.0762 2.59375 -31.7314 7.10547c-3.02148 29.1553 -19.6221 54.2734 -43.2959 69.1162z
M259.776 179.738c-41.4688 0 -75.1035 33.6162 -75.1035 75.084c0 41.4688 33.6348 75.0908 75.1035 75.0908s75.0908 -33.6152 75.0908 -75.084s-33.6162 -75.0908 -75.0908 -75.0908zM291.629 174.62c53.0146 0 96.1445 -43.1357 96.125 -96.1504v-77.9346h-0.537109
l-5.01562 -2.53711c-2.52344 -1.28418 -43.4814 -21.4307 -114.144 -21.4307c-36.1787 0 -80.1328 5.27148 -130.726 21.0801l-5.36719 1.67969l-0.198242 1.2207v77.9219c0 53.0146 43.1299 96.1504 96.1445 96.1504h63.7178zM415.861 252.139
c53.0088 0 96.1387 -43.1299 96.1387 -96.1377v-77.9473h-0.537109l-5.01562 -2.54297c-2.37012 -1.18848 -38.3438 -18.8809 -100.771 -21.1689v24.0127c0 51.6152 -34.4785 95.3135 -81.6016 109.326c17.0791 16.3828 27.8779 39.1621 28.5615 64.458h63.2246z
M128.016 257.251c-41.4814 0 -75.0908 33.6221 -75.0908 75.0781c0 41.4746 33.6094 75.0908 75.0908 75.0908c41.4561 0 75.0781 -33.6162 75.0781 -75.0908c0 -1.41895 -0.133789 -2.81152 -0.210938 -4.21777c-18.3828 -14.2871 -31.251 -35.2637 -34.9316 -59.2695
c-11.5781 -7.30371 -25.2451 -11.5908 -39.9355 -11.5908zM195.452 187.681c-47.1367 -14.0254 -81.6016 -57.7109 -81.6143 -109.326v-23.5332c-31.4629 1.83984 -67.6855 7.68066 -108.272 20.3506l-5.36719 1.69336l-0.198242 1.20117v77.9346
c0 53.0078 43.1299 96.1377 96.1445 96.1377h63.7109c2.38965 0 4.70898 -0.18457 7.05371 -0.357422c0.786133 -25.1436 11.5469 -47.8008 28.543 -64.1006z" />
    <glyph glyph-name="uniF105" unicode="&#xf105;" 
d="M505.757 309.636c4.02148 -4.02441 6.23828 -9.375 6.23828 -15.0684c0 -5.68945 -2.21484 -11.04 -6.23828 -15.0635l-337.268 -337.266c-4.02148 -4.02148 -9.37402 -6.23828 -15.0635 -6.23828c-5.69141 0 -11.042 2.21484 -15.0664 6.23828l-132.126 132.126
c-8.30566 8.30859 -8.30371 21.8232 0 30.1299l337.268 337.265c4.02246 4.02441 9.375 6.24121 15.0664 6.24121s11.042 -2.2168 15.0654 -6.24316zM445.819 329.54l-17.0811 17.082l-21.4609 -21.4609l17.082 -17.082zM317.49 270.413l-17.0811 17.082l-21.4609 -21.4609
l17.0811 -17.082zM316.505 303.589l17.082 -17.082l21.4609 21.4609l-17.082 17.082zM279.934 232.856l-17.082 17.0811l-21.46 -21.4609l17.0811 -17.0811zM242.377 195.299l-17.082 17.082l-21.4609 -21.4609l17.082 -17.0811zM204.819 157.742l-17.0811 17.082
l-21.4609 -21.4609l17.0811 -17.082zM167.263 120.186l-17.082 17.0811l-21.4609 -21.4609l17.082 -17.0811zM165.839 83.7246l-21.4609 -21.4609l17.082 -17.0811l21.46 21.4609zM181.936 99.8184l17.0811 -17.0811l21.4609 21.4609l-17.082 17.0811zM219.492 137.376
l17.0811 -17.082l21.4609 21.4609l-17.0811 17.082zM257.049 174.933l17.082 -17.0811l21.4609 21.4609l-17.082 17.0811zM294.606 212.49l17.0811 -17.082l21.4609 21.4609l-17.0811 17.0811zM332.163 250.047l17.082 -17.082l21.4609 21.4609l-17.082 17.082z
M369.721 287.604l17.0811 -17.0811l21.4609 21.4609l-17.0811 17.0811zM411.438 364.359l-17.0811 17.0811l-40.2949 -40.2949l17.0811 -17.0811zM358.88 416.48l-21.4609 -21.4609l17.0811 -17.082l21.4609 21.4609zM321.323 378.923l-21.4609 -21.4609l17.0811 -17.0811
l21.4609 21.4609zM283.766 341.366l-21.4609 -21.4609l17.082 -17.0811l21.4609 21.46zM246.209 303.809l-21.4609 -21.46l17.0811 -17.082l21.4609 21.4609zM208.651 266.252l-21.4609 -21.4609l17.082 -17.0811l21.4609 21.4609zM171.095 228.695l-21.4609 -21.4609
l17.0811 -17.082l21.4609 21.4609zM133.537 191.138l-21.46 -21.4609l17.0811 -17.0811l21.4609 21.4609zM95.9805 153.581l-21.4609 -21.4609l17.082 -17.082l21.46 21.4609zM35.2119 92.8125l17.082 -17.0811l21.4609 21.4609l-17.082 17.0811zM70.4697 57.5557
l17.0811 -17.082l38.6895 38.6895l-17.0811 17.0811zM122.152 5.87305l21.4609 21.4609l-17.082 17.0811l-21.4609 -21.4609zM157.627 -29.6045l21.4609 21.4609l-17.0811 17.0811l-21.4609 -21.4609zM196.938 9.70508l21.46 21.4609l-17.0811 17.0811l-21.4609 -21.4609z
M234.348 47.1152l134.096 134.094l-17.0811 17.082l-134.097 -134.095zM384.72 197.488l21.4609 21.46l-17.0811 17.082l-21.4609 -21.4609zM422.277 235.047l21.4609 21.4609l-17.082 17.082l-21.4609 -21.4609zM459.834 272.604l21.4609 21.4609l-17.0811 17.0811
l-21.4609 -21.4609z" />
    <glyph glyph-name="uniF104" unicode="&#xf104;" 
d="M41.3408 53.0625c-22.8154 0 -41.3408 18.5254 -41.3408 41.3418v290.015c0 22.8154 18.5254 41.3408 41.3408 41.3408h429.318c22.8154 0 41.3408 -18.5254 41.3408 -41.3408v-290.015c0 -22.8164 -18.5254 -41.3418 -41.3408 -41.3418h-168.399v-46.1553h32.8633
c5.54785 0 9.94336 -4.5 9.94336 -9.94238v-28.7812c0 -5.54785 -4.50098 -9.94336 -9.94336 -9.94336h-158.246c-5.54785 0 -9.94336 4.50098 -9.94336 9.94336v28.7812c0 5.54688 4.50098 9.94238 9.94336 9.94238h32.8633v46.1553h-168.399zM56.4121 369.348v-259.559
h399.176v259.559h-399.176z" />
    <glyph glyph-name="uniF115" unicode="&#xf115;" 
d="M314.363 0.579102v-14.959c0 -11.9053 -8.74316 -21.8076 -20.1211 -23.4932l-3.6875 -13.5898c-2.00195 -7.375 -8.63867 -12.5371 -16.3291 -12.5371h-36.5566c-7.69043 0 -14.3271 5.16211 -16.3291 12.5371l-3.58203 13.5898
c-11.4834 1.79102 -20.2266 11.5879 -20.2266 23.5977v14.96c0 8.00684 6.42578 14.4336 14.4326 14.4336h87.9668c8.00684 -0.105469 14.4326 -6.53223 14.4326 -14.5391zM382.104 202.219c0 -34.0273 -13.4844 -64.8955 -35.3975 -87.5459
c-16.6455 -17.2773 -27.3906 -39.2949 -30.9727 -62.7881c-1.58008 -10.1133 -10.3242 -17.5938 -20.6484 -17.5938h-78.2754c-10.2188 0 -19.0684 7.375 -20.543 17.4883c-3.6875 23.4932 -14.5381 45.8271 -31.1836 62.999
c-21.4912 22.334 -34.8711 52.6748 -35.1865 86.0713c-0.737305 70.1631 55.0977 126.946 125.261 127.473c70.0576 0.527344 126.946 -56.1514 126.946 -126.104zM270.223 278.598c0 7.7959 -6.32129 14.2217 -14.2227 14.2217
c-50.1465 0 -91.0225 -40.7695 -91.0225 -91.0215c0 -7.7959 6.32129 -14.2227 14.2227 -14.2227c7.7959 0 14.2217 6.32129 14.2217 14.2227c0 34.5547 28.1289 62.5771 62.5781 62.5771c7.90137 0 14.2227 6.32129 14.2227 14.2227zM256 369.725
c-7.7959 0 -14.2227 6.32129 -14.2227 14.2227v49.8301c0 7.90137 6.32129 14.2227 14.2227 14.2227s14.2227 -6.42676 14.2227 -14.2227v-49.8301c0 -7.90137 -6.42676 -14.2227 -14.2227 -14.2227zM88.5996 202.324c0 -7.90137 -6.32129 -14.2217 -14.2227 -14.2217
h-49.8301c-7.90137 0 -14.2227 6.42578 -14.2227 14.2217c0 7.90137 6.42676 14.2227 14.2227 14.2227h49.8301c7.90137 0 14.2227 -6.42676 14.2227 -14.2227zM487.453 216.547c7.90137 0 14.2227 -6.42676 14.2227 -14.2227
c0 -7.90137 -6.42676 -14.2217 -14.2227 -14.2217h-49.8301c-7.90137 0 -14.2227 6.42578 -14.2227 14.2217c0 7.90137 6.42676 14.2227 14.2227 14.2227h49.8301zM117.57 83.9111c5.47852 5.58398 14.5381 5.58398 20.0166 0c5.58301 -5.58398 5.58301 -14.5381 0 -20.1221
l-35.292 -35.292c-2.73926 -2.73926 -6.42676 -4.1084 -10.0088 -4.1084s-7.26855 1.36914 -10.0078 4.1084c-5.58398 5.58398 -5.58398 14.5381 0 20.1221zM384.422 316.523c-3.6875 0 -7.26953 1.36914 -10.1143 4.1084c-5.58301 5.58398 -5.58301 14.5381 0 20.1221
l35.292 35.292c5.58398 5.58398 14.5391 5.58398 20.1221 0c5.58398 -5.58301 5.58398 -14.5381 0 -20.1221l-35.292 -35.292c-2.73926 -2.73926 -6.42676 -4.1084 -10.0078 -4.1084zM117.57 320.737l-35.3975 35.292c-5.58398 5.58398 -5.58398 14.5391 0 20.1221
c5.58398 5.58398 14.5381 5.58398 20.1221 0l35.292 -35.292c5.58301 -5.58398 5.58301 -14.5381 0 -20.1221c-2.73926 -2.73926 -6.42676 -4.1084 -10.0088 -4.1084c-3.58105 0 -7.26855 1.36914 -10.0078 4.1084zM394.43 83.9111l35.1865 -35.292
c5.58398 -5.58398 5.58398 -14.5381 0 -20.1221c-2.73926 -2.73926 -6.42578 -4.1084 -10.0078 -4.1084s-7.26953 1.36914 -10.0088 4.1084l-35.292 35.292c-5.58301 5.58398 -5.58301 14.5381 0 20.1221c5.58398 5.58301 14.5381 5.58301 20.1221 0z" />
    <glyph glyph-name="uniF10A" unicode="&#xf10a;" 
d="M502.391 308.072l-246.391 -140.77l-246.391 140.77l246.391 139.928zM256 143.079l166.139 94.9189l80.252 -45.5771l-246.391 -140.77l-246.391 140.77l80.2627 45.5771zM256 27.4277l166.139 94.9189l80.252 -45.5781l-246.391 -140.769l-246.391 140.769
l80.2627 45.5781z" />
    <glyph glyph-name="uniF116" unicode="&#xf116;" 
d="M442.024 164.989c21.918 -1.00195 38.9111 -19.873 37.9561 -42.1729c-1.01465 -22.3008 -19.5557 -39.5664 -41.4883 -38.6025l-13.1016 0.608398c21.8623 -1.06934 39.9238 -16.7842 39.9238 -39.0664c0 -26.8711 -21.6504 -42.6719 -43.585 -41.6719l-24.71 1.10547
c-0.423828 0.0175781 -0.28418 -0.177734 -0.496094 -0.25c7.78418 -2.59082 21.5234 -10.8203 20.5127 -33.5488c0.0341797 -0.697266 -0.194336 -5.8584 -0.408203 -7.08887c-1.31641 -7.94531 -4.39258 -12.0176 -7.3418 -14.8203
c-7.74805 -7.37305 -18.4854 -13.4795 -31.8516 -13.4795c0 0 -43.6602 0.0527344 -57.7363 0.0527344c-80.4893 0 -127.214 8.13574 -158.501 18.9756c-22.8408 8.01465 -37.791 18.96 -56.8818 18.96h-37.9199c-27.1621 0 -37.9307 8.87695 -37.9307 35.1973
l0.0078125 173.367c0 23.46 13.0342 37.9199 37.9199 37.9199c12.4072 0 41.5439 -1.91016 60.2451 16.791c1.11816 2.23047 2.25684 4.35645 3.41309 6.48145c0.657227 1.35547 1.40234 2.37207 2.02539 3.83887c0.514648 1.23047 1.04688 2.10547 1.61719 2.73047
c6.98242 11.8203 14.1484 21.4268 19.4805 27.2461c30.2168 33.0479 56.0986 29.5664 75.1035 66.6689c16.9766 33.1025 21.8623 51.0811 25.6143 71.6689h0.0341797s4.46191 32.1055 21.0322 32.0996c21.0635 0 56.8799 -6.74609 56.8799 -56.8799
c0 -75.207 -30.3457 -125.967 -30.3457 -125.967l145.617 -18.2842c21.9346 -0.963867 37.3457 -21.0127 36.3857 -43.3135c-0.959961 -22.3018 -19.5527 -39.5664 -41.4707 -38.5664z" />
    <glyph glyph-name="uniF117" unicode="&#xf117;" 
d="M410.404 374.315h101.596v-16.7363c0 -3.82422 -0.645508 -94.0303 -56.3184 -143.445c-23.2266 -20.627 -52.1973 -30.9736 -86.332 -31.0068c-5.16504 0 -10.4795 0.331055 -15.8926 0.793945c-19.4023 -26.5693 -41.834 -45.1768 -67.0293 -54.4473v-73.585h74.0146
v-46.0879h24.4678v-25.8252h-128.132h-1.55664h-128.132v25.8408h24.4512v46.0889h74.0146v73.585c-25.2119 9.27051 -47.627 27.8779 -67.0293 54.4473c-5.37988 -0.462891 -10.6943 -0.810547 -15.8594 -0.810547c-34.1514 0.0166016 -63.1221 10.3799 -86.3486 30.9902
c-55.6729 49.415 -56.3184 139.621 -56.3184 143.445v16.7529h101.596c-0.331055 15.6943 0.248047 25.6104 0.248047 25.6104l153.378 0.115234v0h0.77832h0.77832v0l153.361 -0.115234s0.595703 -9.91602 0.264648 -25.6104zM78.667 239.098
c15.793 -13.9551 35.7578 -21.3555 59.4814 -22.2656c-3.1123 5.89355 -6.15918 11.9189 -9.05566 18.2764c-15.8096 34.6484 -22.6631 74.0645 -25.5771 105.7h-68.834c2.78125 -25.3945 12.1846 -73.5684 43.9854 -101.711zM433.333 239.098
c31.8174 28.1592 41.2041 76.333 43.9854 101.711h-68.834c-2.89746 -31.6357 -9.75098 -71.0518 -25.5605 -105.7c-2.89648 -6.35742 -5.94336 -12.3994 -9.05566 -18.2764c23.707 0.910156 43.6885 8.29395 59.4648 22.2656z" />
    <glyph glyph-name="uniF110" unicode="&#xf110;" 
d="M405.018 395.533c33.166 -31.8447 52.1895 -75.5156 52.1895 -119.814c0 -56.665 -15.7959 -108.263 -44.4746 -145.282c-29.5703 -38.168 -71.582 -59.1895 -118.297 -59.1895c-24.7803 0 -50.248 10.2998 -66.0645 25.5342
c-5.17969 -20.4434 -13.6338 -53.6992 -16.0488 -62.4951c-2.98145 -10.8145 -32.2676 -106.517 -65.0322 -97.7129c-29.1611 7.83496 -11.543 106.099 -8.61816 118.54c5.05762 21.3125 31.7236 134.332 36.2109 153.343
c-2.72461 6.50391 -8.74414 23.4434 -8.74414 46.0918c0 46.1797 27.9023 82.3545 63.5186 82.3545c28.0254 0 46.8574 -20.582 46.8574 -51.2148c0 -17.9092 -6.93555 -40.3555 -14.2725 -64.1221c-4.02246 -13.0127 -8.17969 -26.4727 -11.2275 -39.376
c-2.69824 -11.4209 -0.487305 -22.3789 6.22266 -30.8623c7.10156 -8.97363 18.3574 -14.1201 30.8877 -14.1201c28.9766 0 47.8516 22.293 58.585 40.9941c15.4473 26.915 23.9512 63.4795 23.9512 102.962c0 62.5664 -42.4805 101.434 -110.866 101.434
c-86.1875 0 -132.689 -66.3721 -132.689 -128.823c0 -21.0244 5.37695 -37.1797 16.9229 -50.8418c6.33789 -7.46875 8.68652 -12.6279 5.78027 -23.3535c-1.35742 -5.43066 -4.48047 -17.9414 -5.82812 -23.0127c-2.31152 -8.83984 -8.98438 -14.3506 -17.4062 -14.3506
c-2.64355 0 -5.34082 0.553711 -8.02051 1.65137c-39.9219 16.2744 -63.7607 60.0186 -63.7607 117.012c0 45.3916 19.5625 91.2188 53.6758 125.731c27.6797 28.0049 77.7715 61.3906 159.216 61.3906c53.3174 0 102.09 -18.6338 137.333 -52.4668z" />
    <glyph glyph-name="uniF101" unicode="&#xf101;" 
d="M40.4902 350.019c-14.7402 11.6338 -11.3955 21.1729 7.37012 21.1729h208.148h208.149c18.7471 0 22.0918 -9.53906 7.31445 -21.1729l-184.42 -146.081c-8.36328 -6.63477 -19.8867 -9.55762 -31.0615 -9.00586c-11.1934 -0.551758 -22.7178 2.38965 -31.0801 9.00586z
M484.798 311.477c14.9609 11.3398 27.2021 5.25684 27.2021 -13.5088v-251.047c0 -18.7656 -15.3652 -34.1309 -34.1309 -34.1309h-221.878h-221.86c-18.7656 0 -34.1309 15.3652 -34.1309 34.1309v251.047c0 18.7656 12.2412 24.8486 27.2021 13.5088l201.568 -153.01
c7.53613 -5.64258 17.4053 -8.41797 27.2568 -8.28906c9.83301 -0.128906 19.7031 2.62793 27.2383 8.28906z" />
    <glyph glyph-name="uniF113" unicode="&#xf113;" 
d="M220.446 408.936v-85.4365c0 -11.5869 -9.39258 -20.9756 -20.9795 -20.9756c-41.3408 0 -63.8291 -42.4014 -66.9453 -126.088h66.9453c11.5869 0 20.9795 -9.39746 20.9795 -20.9805v-180.395c0 -11.5811 -9.39258 -20.9717 -20.9795 -20.9717h-178.491
c-11.5918 0 -20.9756 9.39746 -20.9756 20.9717v180.395c0 40.1182 4.03906 76.9326 12.002 109.434c8.16699 33.3252 20.7031 62.4629 37.249 86.6074c17.0254 24.8125 38.3223 44.2832 63.3037 57.8467c25.1494 13.6465 54.3965 20.5684 86.9189 20.5684
c11.5801 0 20.9727 -9.38867 20.9727 -20.9756zM491.019 302.521c-40.7627 0 -62.9219 -42.4014 -65.9922 -126.086h65.9912c11.582 0 20.9727 -9.39941 20.9727 -20.9805v-180.396c0 -11.5732 -9.3916 -20.9707 -20.9727 -20.9707h-178.485
c-11.585 0 -20.9805 9.38965 -20.9805 20.9707v180.396c0 40.0986 4.03906 76.9131 11.998 109.425c8.16797 33.332 20.7041 62.4717 37.2441 86.6152c17.0283 24.8125 38.3369 44.2832 63.3232 57.8477c25.1406 13.6445 54.3916 20.5674 86.9014 20.5674
c11.583 0 20.9814 -9.3877 20.9814 -20.9756v-85.4365c0 -11.5781 -9.40039 -20.9756 -20.9814 -20.9756z" />
    <glyph glyph-name="uniF109" unicode="&#xf109;" 
d="M0 448c282.766 0 512 -229.228 512 -512h-79.7979c0 238.693 -193.502 432.209 -432.202 432.209v79.791zM0 288.418c194.634 0 352.411 -157.784 352.411 -352.418h-79.791c0 150.568 -122.059 272.627 -272.62 272.627v79.791zM76.4561 88.9326
c42.2402 0 76.4766 -34.2432 76.4834 -76.4629c0 -42.2402 -34.2432 -76.4697 -76.4834 -76.4697c-42.2197 0 -76.4561 34.2295 -76.4561 76.4697c0 42.2197 34.2363 76.4629 76.4561 76.4629z" />
    <glyph glyph-name="uniF10E" unicode="&#xf10e;" 
d="M511.756 44.0303c1.08496 -8.3125 -1.44824 -15.5391 -7.58887 -21.6807l-72.0879 -71.5439c-3.25195 -3.61328 -7.49707 -6.6875 -12.7363 -9.21484c-5.24023 -2.53027 -10.3887 -4.15625 -15.4453 -4.87793c-0.361328 0 -1.44824 -0.0927734 -3.25586 -0.273438
c-1.80371 -0.179688 -4.15234 -0.272461 -7.04297 -0.272461c-6.86816 0 -17.9795 1.1748 -33.3369 3.52441s-34.1465 8.13184 -56.3672 17.3447c-22.2266 9.21387 -47.4297 23.0371 -75.6133 41.4639c-28.1846 18.4268 -58.1768 43.7227 -89.9756 75.8828
c-25.2939 24.9326 -46.252 48.7812 -62.874 71.5459c-16.6221 22.7656 -29.9912 43.8135 -40.1094 63.1455s-17.707 36.8574 -22.7656 52.5762s-8.49121 29.2686 -10.2979 40.6514c-1.80664 11.3818 -2.53027 20.3252 -2.16797 26.8301
c0.361328 6.50391 0.541992 10.1172 0.541992 10.8398c0.722656 5.05859 2.34863 10.208 4.87793 15.4473c2.5293 5.24023 5.60059 9.48535 9.21387 12.7383l72.0889 72.0879c5.05859 5.05859 10.8398 7.58887 17.3447 7.58887c4.69727 0 8.85254 -1.35547 12.4658 -4.06543
s6.68555 -6.05273 9.21484 -10.0273l57.9961 -110.03c3.25195 -5.78125 4.15527 -12.1045 2.70996 -18.9707c-1.44531 -6.86523 -4.51758 -12.6465 -9.21484 -17.3438l-26.5586 -26.5596c-0.722656 -0.722656 -1.35547 -1.89648 -1.89746 -3.52246
s-0.8125 -2.98145 -0.8125 -4.06543c1.44531 -7.58789 4.69727 -16.2607 9.75586 -26.0166c4.33594 -8.67285 11.0215 -19.2422 20.0547 -31.708c9.03418 -12.4668 21.8613 -26.8291 38.4834 -43.0898c16.2607 -16.624 30.7148 -29.54 43.3613 -38.7559
c12.6445 -9.21094 23.2178 -15.9893 31.709 -20.3252c8.49219 -4.33594 14.9961 -6.95605 19.5117 -7.85645l6.77344 -1.35645c0.722656 0 1.90039 0.272461 3.52441 0.813477c1.62598 0.542969 2.80078 1.17383 3.52441 1.89746l30.8936 31.4375
c6.50781 5.78027 14.0928 8.6709 22.7656 8.6709c6.14453 0 11.0205 -1.08301 14.6338 -3.25195h0.541016l104.608 -61.79c7.59082 -4.70117 12.1074 -10.6611 13.5537 -17.8877z" />
    <glyph glyph-name="uniF106" unicode="&#xf106;" 
d="M502.751 334.039c6.16113 -6.16699 9.25391 -13.6562 9.24902 -22.4619c0 -8.80957 -3.08789 -16.2979 -9.24902 -22.4648l-239.152 -239.151l-44.9258 -44.9229c-6.16602 -6.16113 -13.6553 -9.24902 -22.4609 -9.24902c-8.80957 0 -16.2988 3.08008 -22.4619 9.24902
l-44.9268 44.9229l-119.574 119.572c-6.16699 6.16406 -9.24902 13.6602 -9.24902 22.4639c0 8.81055 3.08203 16.2998 9.24902 22.4648l44.9229 44.9248c6.16699 6.16602 13.6533 9.24609 22.4648 9.24609c8.80566 0 16.293 -3.08008 22.459 -9.24609l97.1162 -97.4463
l216.694 217.021c6.16016 6.16504 13.6514 9.24805 22.4648 9.24805c8.80566 0 16.2969 -3.08301 22.457 -9.24805z" />
    <glyph glyph-name="uniF108" unicode="&#xf108;" 
d="M512 270.943c0 -83.3555 -71.9766 -138.965 -118.244 -147.439c-7.43066 -15.4238 -16.6963 -29.3809 -27.7344 -41.6455c-6.86035 -7.62402 -14.3125 -14.5371 -22.3467 -20.7432c4.16504 -6.7959 6.56934 -14.7812 6.56934 -23.3184
c0 -24.6836 -20.0811 -44.7646 -44.7637 -44.7646h-195.251c-24.6826 0 -44.7637 20.0811 -44.7637 44.7646c0 8.17773 2.21484 15.8428 6.05957 22.4473c-8.46094 6.43848 -16.2529 13.6465 -23.3428 21.6436c-31.5205 35.5576 -48.1826 86.3008 -48.1826 146.745v130.674
c0 10.9512 6.65723 31.6611 31.8525 31.6611h351.769c25.3848 0 32.0918 -21.2207 32.0918 -32.4414v-8.59082h0.362305c19.2705 0 39.6133 -0.757812 57.8574 -9.80469c17.3652 -8.6123 38.0674 -27.6055 38.0674 -69.1875zM413.14 189.821
c21.6445 15.3965 45.3105 43.1504 45.3105 81.1221c0 20.29 -4.16309 25.4404 -42.376 25.4404h-0.363281v-67.751c0 -13.418 -0.868164 -26.373 -2.57129 -38.8115z" />
    <glyph glyph-name="uniF103" unicode="&#xf103;" 
d="M477.72 320.467c22.8525 -28.0898 34.2803 -58.7109 34.2793 -91.8545c0 -33.1416 -11.4287 -63.7656 -34.2881 -91.8477c-22.8555 -28.0898 -53.9033 -50.2822 -93.1396 -66.5654c-39.2373 -16.291 -82.0977 -24.4355 -128.573 -24.4355
c-13.334 0 -27.1436 0.764648 -41.4268 2.28809c-37.7119 -33.3389 -81.5234 -56.3799 -131.43 -69.1475c-9.33203 -2.67188 -20.1875 -4.75781 -32.5713 -6.28027c-3.23633 -0.387695 -6.14453 0.470703 -8.71484 2.56445
c-2.56934 2.0918 -4.23633 4.85156 -5.00195 8.2832v0.28418c-0.570312 0.764648 -0.619141 1.9082 -0.141602 3.43555c0.476562 1.52148 0.666016 2.47949 0.570312 2.85352c-0.09375 0.373047 0.333984 1.27637 1.28809 2.70898l1.71387 2.56738
s0.668945 0.808594 2.00098 2.4248c1.33301 1.61621 2.09277 2.47949 2.28613 2.56836c1.33203 1.52734 4.28613 4.81055 8.85449 9.8623c4.57422 5.04102 7.86035 8.66602 9.8584 10.8574c2.00098 2.1875 4.95312 5.95117 8.85449 11.2832
c3.9082 5.33301 7 10.1924 9.28809 14.5723c2.28516 4.38086 4.85645 10.0068 7.71289 16.8633c2.8584 6.85254 5.33398 14.0928 7.43164 21.709c-29.9072 16.9521 -53.4756 37.9082 -70.7158 62.8574c-17.2393 24.9521 -25.8555 51.7227 -25.8555 80.292
c0 24.7627 6.76172 48.4307 20.2881 71.001c13.5254 22.5693 31.7119 42.0459 54.5732 58.4277c22.8584 16.3799 50.0947 29.3809 81.7129 38.999c31.6182 9.61914 64.7617 14.4277 99.4297 14.4277c46.4766 0 89.3398 -8.14453 128.572 -24.4287
c39.2334 -16.2852 70.2842 -38.4766 93.1436 -66.5713z" />
    <glyph glyph-name="uniF10C" unicode="&#xf10c;" 
d="M495 -18.2002c8 -7.89941 8 -20.8994 0 -28.7998c-8 -8 -20.9004 -8 -28.9004 0l-117.8 117.7c-35.5996 -29.2002 -81.0996 -46.7002 -130.8 -46.7002c-114.1 0 -206.5 92.5 -206.5 206.5s92.4004 206.5 206.5 206.5c114 0 206.5 -92.5 206.5 -206.5
c0 -49.7002 -17.5996 -95.2998 -46.7998 -130.9zM217.5 65.0996c91.2002 0 165.5 74.2002 165.5 165.4s-74.2998 165.5 -165.5 165.5c-91.2998 0 -165.5 -74.2998 -165.5 -165.5s74.2002 -165.4 165.5 -165.4z" />
    <glyph glyph-name="uniF114" unicode="&#xf114;" 
d="M485.744 417.966c14.4932 0 26.2559 -11.7637 26.2559 -26.2559v-125.501c0 -61.4375 -5.4082 -109.853 -16.2256 -145.351c-10.8174 -35.4971 -30.8232 -67.3184 -60.0205 -95.5166c-23.9443 -23.1055 -53.2979 -42.1143 -88.0605 -57.1318
c-13.0225 -5.61914 -28.0928 0 -34.1846 12.8115l-18.9043 39.9082c-6.30078 13.3389 -0.47168 29.3018 13.0234 35.2354c29.3535 12.9707 51.3027 29.4062 65.7959 49.2559c18.3789 25.1523 28.0938 58.6016 29.0908 100.4h-76.4033
c-14.4932 0 -26.2549 11.7617 -26.2549 26.2559v159.633c0 14.4932 11.7617 26.2559 26.2549 26.2559h159.633zM55.6807 -31.6855c-13.0225 -5.67188 -28.1982 0 -34.29 12.8125l-18.8516 39.8027c-6.30176 13.3389 -0.472656 29.3018 13.0225 35.2354
c29.3535 12.9707 51.3027 29.4062 65.7959 49.2559c18.3789 25.1523 28.0938 58.6016 29.0918 100.4h-76.4033c-14.4932 0 -26.2559 11.7617 -26.2559 26.2559v159.633c0 14.4932 11.7627 26.2549 26.2559 26.2549h159.633c14.4932 0 26.2549 -11.7617 26.2549 -26.2549
v-125.501c0 -61.9102 -5.4082 -110.483 -16.2246 -145.718c-10.8174 -35.2344 -30.9297 -66.9512 -60.3877 -95.1494c-24.1025 -23.0527 -53.2988 -42.0615 -87.6406 -57.0273z" />
    <glyph glyph-name="uniF10B" unicode="&#xf10b;" 
d="M269.741 139.05c6.74219 6.74121 18.2666 4.58301 21.9199 -4.22363c9.91797 -23.9053 5.1748 -52.5098 -14.2344 -71.9189l-107.607 -107.607c-25.6895 -25.6895 -67.4922 -25.6865 -93.1826 -0.000976562l-0.000976562 0.000976562l-57.3369 57.3389
c-25.7314 25.7324 -25.7314 67.4512 0 93.1826l107.604 107.606c19.4092 19.4082 48.0146 24.1514 71.9189 14.2334c8.80859 -3.65332 10.9668 -15.1777 4.22461 -21.9199l-10.6016 -10.6016c-3.30957 -3.31152 -8.11523 -4.81348 -12.6523 -3.65723
c-18.7764 4.78418 -16.9883 0.680664 -131.913 -114.244c-9.69434 -9.69531 -10.3418 -25.6768 0.410156 -36.4287l56.9277 -56.9287c9.93164 -9.93066 26.0908 -9.92969 36.0205 -0.000976562c114.476 114.476 118.866 113.104 114.347 131.625
c-1.13281 4.63477 0.134766 9.52051 3.50977 12.8975zM184.316 120.314c-7.89258 7.89258 -7.89258 20.6895 0 28.582l114.787 114.787c7.8916 7.8916 20.6885 7.8916 28.582 0c7.89258 -7.89258 7.89258 -20.6895 0 -28.582l-114.787 -114.787
c-7.89355 -7.89258 -20.6895 -7.8916 -28.582 0zM492.701 371.362c25.7314 -25.7314 25.7314 -67.4512 -0.00195312 -93.1816l-107.607 -107.607c-19.3467 -19.3467 -47.8721 -24.1504 -71.7842 -14.29c-8.87109 3.65918 -11.1387 15.1963 -4.35352 21.9814l10.5986 10.5977
c3.30957 3.31152 8.11523 4.81348 12.6523 3.65723c18.7764 -4.78418 16.9883 -0.683594 131.913 114.242c9.69043 9.69141 10.3457 25.6729 -0.410156 36.4287l-56.9287 56.9287c-9.92969 9.92871 -26.0879 9.93164 -36.0186 0
c-113.896 -113.896 -118.87 -113.086 -114.347 -131.625c1.13184 -4.63477 -0.134766 -9.52148 -3.50879 -12.8955l-10.6465 -10.6475c-6.74023 -6.74219 -18.2666 -4.58301 -21.9199 4.22363c-9.91797 23.9053 -5.1748 52.5098 14.2344 71.9189l107.606 107.607
c25.6895 25.6885 67.4922 25.6865 93.1826 0.000976562z" />
    <glyph glyph-name="uniF10F" unicode="&#xf10f;" 
d="M492.007 325.601c13.3291 -13.333 19.9971 -29.4209 19.9932 -48.2666v-238.936c0 -18.8467 -6.66797 -34.9365 -19.999 -48.2656c-13.3359 -13.3359 -29.4199 -20.0039 -48.2656 -20.0039h-375.469c-18.8467 0 -34.9326 6.66797 -48.2686 20.0039
c-13.332 13.3291 -19.998 29.4189 -19.998 48.2656v238.936c0 18.8457 6.66602 34.9336 19.998 48.2666c13.335 13.332 29.4209 20 48.2686 20h59.7344l13.5996 36.2646c3.37793 8.70996 9.55371 16.2227 18.5322 22.5361c8.97949 6.31152 18.1797 9.46973 27.6025 9.46973
h136.537c9.42285 0 18.6221 -3.1582 27.6006 -9.46973c8.9834 -6.31348 15.1582 -13.8262 18.5371 -22.5361l13.5977 -36.2646h59.7334c18.8457 0 34.9307 -6.66797 48.2656 -20zM340.401 73.4619c23.3799 23.3779 35.0684 51.5127 35.0684 84.3975
c0 32.8945 -11.6895 61.0254 -35.0684 84.4023c-23.377 23.376 -51.5088 35.0664 -84.4004 35.0664c-32.8906 0 -61.0234 -11.6875 -84.4004 -35.0664c-23.375 -23.3799 -35.0664 -51.5078 -35.0664 -84.4023c0 -32.8848 11.6875 -61.0225 35.0664 -84.3975
c23.3799 -23.3779 51.5088 -35.0703 84.4004 -35.0703c32.8926 0 61.0234 11.6924 84.4004 35.0703zM256.001 234.666c21.1543 0 39.2461 -7.5127 54.2686 -22.5361c15.0225 -15.0244 22.5352 -33.1104 22.5352 -54.2705c0 -21.1543 -7.5127 -39.2422 -22.5352 -54.2656
c-15.0234 -15.0195 -33.1143 -22.5312 -54.2686 -22.5312c-21.1572 0 -39.2451 7.51172 -54.2686 22.5312c-15.0225 15.0234 -22.5342 33.1123 -22.5342 54.2656c0 21.1611 7.51172 39.2471 22.5342 54.2705c15.0234 15.0244 33.1123 22.5361 54.2686 22.5361z" />
    <glyph glyph-name="uniF100" unicode="&#xf100;" 
d="M199.111 291.556c199.111 -28.4443 284.444 -170.667 312.889 -312.889c-71.1113 99.5557 -170.667 145.066 -312.889 145.066v-116.622l-199.111 199.111l199.111 199.11v-113.777z" />
    <glyph glyph-name="uniF111" unicode="&#xf111;" 
d="M382.806 395.479c62.6758 -62.666 70.4648 -180.575 16.6533 -252.302l-143.445 -207.177l-143.659 207.467c-53.5967 71.4365 -45.8076 189.346 16.8682 252.012c33.8672 33.8672 78.8896 52.5215 126.791 52.5215c47.8936 0 92.9248 -18.6543 126.792 -52.5215z
M257.669 204.89c36.083 0 65.4531 29.3691 65.4531 65.4531c0 36.083 -29.3701 65.4521 -65.4531 65.4521s-65.4531 -29.3691 -65.4531 -65.4521c0 -36.084 29.3701 -65.4531 65.4531 -65.4531z" />
    <glyph glyph-name="uniF118" unicode="&#xf118;" 
d="M512 350.738c-14.0459 -21.0518 -31.8975 -39.5439 -52.5332 -54.2627l0.351562 -13.5977c0 -138.789 -105.612 -298.823 -298.823 -298.823c-59.3174 0 -114.507 17.4043 -160.994 47.2549c8.22168 -0.927734 16.5732 -1.43945 25.0508 -1.43945
c49.207 0 94.5107 16.7324 130.439 44.8877c-45.9434 0.832031 -84.7207 31.1943 -98.0938 72.9463c6.43066 -1.2793 12.9902 -1.95117 19.7725 -1.95117c9.59863 0 18.876 1.31152 27.6748 3.67871c-48.0225 9.66309 -84.2402 52.1191 -84.2402 102.989v1.31152
c14.1729 -7.87012 30.3623 -12.6055 47.5752 -13.1807c-28.1553 18.8115 -46.7119 50.9648 -46.7119 87.4072c0 19.2607 5.15137 37.3047 14.2061 52.79c51.7979 -63.541 129.191 -105.356 216.471 -109.74c-1.79199 7.67871 -2.7207 15.71 -2.7207 23.9316
c0 57.9736 47.0312 105.004 105.036 105.004c30.2354 0 57.4941 -12.7334 76.6582 -33.1777c23.9316 4.73535 46.3916 13.4707 66.7402 25.5c-7.87012 -24.4756 -24.4746 -45.0791 -46.167 -58.0693c21.2441 2.52832 41.4639 8.19141 60.3086 16.541z" />
    <glyph glyph-name="uniF112" unicode="&#xf112;" 
d="M411.632 94.6533c-129.007 -129.01 -353.347 -39.0537 -353.347 146.36c0 114.133 92.8535 206.986 206.987 206.986c11.0547 0 20.0176 -8.96289 20.0176 -20.0176c0 -11.0557 -8.96289 -20.0186 -20.0176 -20.0186c-92.0576 0 -166.95 -74.8926 -166.95 -166.95
c0 -149.242 180.772 -222.278 285 -118.051c7.81738 7.81836 20.4941 7.81836 28.3096 0c7.81836 -7.81836 7.81836 -20.4941 0 -28.3096zM353.448 130.746c-1.03516 -0.829102 -2.4668 -0.964844 -3.6377 -0.342773c-24.5898 13.0625 -55.1611 35.9062 -85.9824 64.1045
c-1.49414 1.36719 -1.41992 3.73633 0.138672 5.03027c15.6426 12.9805 29.8174 27.1602 42.7812 42.7812c1.29297 1.55859 3.66211 1.63379 5.03027 0.138672c28.1934 -30.8174 51.0361 -61.3857 64.0986 -85.9746c0.621094 -1.1709 0.487305 -2.60059 -0.339844 -3.63477
c-6.64453 -8.29785 -14.1064 -15.6953 -22.0889 -22.1025zM248.699 212.895c-2.83789 -2.30664 -5.13477 0.883789 -7.83105 3.5752c-38.2803 38.2803 -69.8926 78.4062 -86.1689 109.143c-0.619141 1.16992 -0.484375 2.60156 0.345703 3.63379
c6.50977 8.09961 13.9023 15.4922 21.999 21.9971c1.0332 0.829102 2.46387 0.964844 3.63379 0.345703c30.7285 -16.2656 70.7783 -47.8174 109.136 -86.1748c2.71094 -2.70996 5.87793 -4.99707 3.57617 -7.82812c-13.7383 -16.9053 -28.7549 -31.7412 -44.6904 -44.6914z
M323.312 259.47c-1.06738 1.15234 -1.18359 2.88672 -0.283203 4.17188c17.0068 24.2822 30.6445 50.7881 40.4941 78.7334c45.0205 -43.6816 54.626 -110.046 28.542 -163.436c-1.15527 -2.36719 -4.47656 -2.5127 -5.8457 -0.262695
c-14.8633 24.4072 -36.8672 52.6846 -62.9072 80.793zM203.073 367.817c44.4307 21.8457 99.1982 19.1045 141.928 -10.2598c1.2207 -0.837891 1.73633 -2.40332 1.26562 -3.80859c-8.7793 -26.293 -21.1191 -51.2881 -36.627 -74.2588
c-1.17285 -1.73828 -3.64648 -1.9502 -5.12695 -0.46582c-28.9639 29.0684 -66.5869 61.6387 -101.675 82.9492c-2.24707 1.36621 -2.12598 4.68359 0.235352 5.84375zM327.429 114.191c-52.8418 -25.96 -119.336 -16.9658 -163.519 28.5713
c27.9463 9.84961 54.4512 23.4863 78.7324 40.4932c1.28711 0.901367 3.02051 0.783203 4.17285 -0.283203c28.1348 -26.0645 56.4355 -48.085 80.8604 -62.9482c2.24316 -1.36523 2.11035 -4.67578 -0.24707 -5.83301zM138.471 303.222
c1.16113 2.36035 4.47852 2.48242 5.83984 0.235352c21.3145 -35.083 53.9697 -72.8242 82.9463 -101.683c1.48633 -1.48047 1.27441 -3.9541 -0.463867 -5.12695c-22.9717 -15.5088 -47.9658 -27.8477 -74.2578 -36.6279
c-1.40527 -0.467773 -2.96973 0.046875 -3.80957 1.26758c-29.3936 42.7705 -32.084 97.5469 -10.2549 141.935zM378.876 30.8555c41.2646 0 74.8369 -33.5713 74.8379 -74.8379c0 -11.0547 -8.96289 -20.0176 -20.0176 -20.0176h-336.85
c-11.0547 0 -20.0176 8.96289 -20.0176 20.0176c0 41.2656 33.5723 74.8379 74.8369 74.8379h227.21z" />
    <glyph glyph-name="uniF102" unicode="&#xf102;" 
d="M482.858 363.998c7.23535 -7.23828 10.8516 -15.8086 10.8525 -25.7158v-365.715c0 -9.89648 -3.62012 -18.4727 -10.8594 -25.7119c-7.22949 -7.2373 -15.8086 -10.8564 -25.7129 -10.8564h-402.276c-9.9082 0 -18.4785 3.62012 -25.7158 10.8564
c-7.23828 7.24219 -10.8574 15.8145 -10.8574 25.7119v365.714c0 9.9043 3.61914 18.4785 10.8574 25.7158c7.23828 7.23828 15.8086 10.8574 25.7158 10.8574h36.5684v27.4297c0 12.5693 4.47852 23.333 13.4307 32.2842c8.95312 8.95312 19.7158 13.4316 32.2871 13.4316
h18.2832c12.5742 0 23.3359 -4.47852 32.2871 -13.4316c8.9541 -8.95215 13.4316 -19.7148 13.4316 -32.2842v-27.4297h109.709v27.4297c0 12.5693 4.47559 23.333 13.4316 32.2842c8.95215 8.95312 19.7129 13.4316 32.2871 13.4316h18.2812
c12.5742 0 23.3311 -4.47852 32.2881 -13.4307c8.95117 -8.95215 13.4316 -19.7148 13.4316 -32.2842v-27.4297h36.5664c9.9043 0 18.4824 -3.61914 25.7129 -10.8574zM137.146 -27.4277v82.2891h-82.2832v-82.2891h82.2832zM137.146 73.1416v91.4238h-82.2832v-91.4238
h82.2832zM137.146 182.859v82.2822h-82.2832v-82.2822h82.2832zM130.721 313.571c1.80957 -1.81055 3.95117 -2.71582 6.42773 -2.71387h18.2832c2.47949 0 4.62012 0.90332 6.42773 2.71387c1.80664 1.80859 2.71582 3.94727 2.71582 6.42676v82.2832
c0 2.47559 -0.905273 4.61914 -2.71582 6.42773c-1.80664 1.81055 -3.95117 2.71387 -6.42773 2.71387h-18.2832c-2.47949 0 -4.61816 -0.90332 -6.42773 -2.71387c-1.81055 -1.80762 -2.71387 -3.95215 -2.71387 -6.42773v-82.2832
c0 -2.47852 0.90332 -4.61719 2.71387 -6.42676zM246.859 -27.4277v82.2891h-91.4307v-82.2891h91.4307zM246.859 73.1416v91.4238h-91.4307v-91.4238h91.4307zM246.859 182.859v82.2822h-91.4307v-82.2822h91.4307zM356.578 -27.4277v82.2891h-91.4297v-82.2891h91.4297z
M356.578 73.1416v91.4238h-91.4297v-91.4238h91.4297zM356.578 182.859v82.2822h-91.4297v-82.2822h91.4297zM350.146 313.571c1.80176 -1.81055 3.95312 -2.71582 6.43164 -2.71387h18.2812c2.47949 0 4.62305 0.90332 6.43164 2.71387
c1.80469 1.80859 2.70898 3.94727 2.70898 6.42676v82.2832c0 2.47559 -0.900391 4.61914 -2.70898 6.42773c-1.81152 1.81055 -3.95215 2.71387 -6.43164 2.71387h-18.2812c-2.48047 0 -4.62207 -0.90332 -6.43164 -2.71387
c-1.80859 -1.80762 -2.70898 -3.95215 -2.70898 -6.42773v-82.2832c0 -2.47852 0.900391 -4.61719 2.70898 -6.42676zM457.139 -27.4277v82.2891h-82.2871v-82.2891h82.2871zM457.139 73.1416v91.4238h-82.2871v-91.4238h82.2871zM457.139 182.859v82.2822h-82.2871
v-82.2822h82.2871z" />
    <glyph glyph-name="uniF107" unicode="&#xf107;" 
d="M383.979 447.894c5.75781 -0.0107422 10.4238 -4.68164 10.4238 -10.4404v-78.1602c0 -5.7627 -4.6709 -10.4395 -10.4346 -10.4395l-44.7256 -0.015625c-30.835 0 -36.4756 -12.0166 -36.4756 -35.6875v-49.249h78.0801c2.76953 0 5.43262 -1.10254 7.3877 -3.0625
s3.05762 -4.6123 3.05762 -7.38184l-0.0322266 -84.1748c0 -5.76855 -4.6709 -10.4395 -10.4395 -10.4395h-78.0537v-212.397c0 -5.76367 -4.67188 -10.4404 -10.4404 -10.4404h-87.0977c-5.76855 0 -10.4404 4.67188 -10.4404 10.4404v212.397h-66.7559
c-5.76367 0 -10.4404 4.6709 -10.4404 10.4395v84.1748c0 5.76855 4.67188 10.4443 10.4404 10.4443h66.7559v58.0957c0 76.5469 48.2051 126.003 122.796 126.003z" />
  </font>
</defs></svg>
