{
  "type": "service_account",
  "project_id": "bk-lms",
  "private_key_id": "336d3a10d854cfc489b8b7ef63494b99d5b70f6e",
  "private_key": "-----BEGIN PRIVATE KEY-----\nMIIEvQIBADANBgkqhkiG9w0BAQEFAASCBKcwggSjAgEAAoIBAQChM/XFUVbcfEIl\nWgWfBdlaZbyuXjQHV3RiGnGueq0HdDojbw0WnNsC2V4QPzgaWW9xXqdKbH9oASvQ\neD9XVGtXsN3qWHtVrubc1yAq0jYJr8CAIuPZDFwVyvpoy0wAS8BAyraJaXTiAV4y\nAX8gGmmgyUpudPGiLa3UL9/vqb/juocJ9fBNAiIaoeGdCB805uhCUgpR0jbhpvkq\n8/i2L+1FnRR/e9k0hp7xKMNniXFotOvaY8MzZtHIcVJ7qp77xTYfXW2TUn95+WFt\nrqNlNt6AZGMAIBzaFLSPBO6MRQIVZv8AhssVHJfd5citxND2bZAEsfxi42rUcdqS\nLskFnhmdAgMBAAECggEANqFnTyGLsFkkCYiCkyvmRy5nTSh7tWk79etET38fmIEZ\nGt0NsHYj+skziYoDN1rL273aL+ypGNQcxx+ZR71CS4uTCVJHKfiGIJ1/N0PaMFox\ngLtSQEJiCripOE59STRiyRJp3hOxGs6f346GSJjq5ySQZvKW2QFmAZzf5Va/wyrv\nw3+OOG3QL6m6q7EiRtk9tKHT5FolGXVwbbS89VJIh0r5RRLh9hOOIs/cGr5PjuRQ\nes7YcBMTr/VqWqUsjMMn8xGB6wSw7WEHdIGObnupjI2zJcoDG7vhmu5aaT9kSB8E\nLYblsEw8FN3J57SsGj9eSMBTr8etfzcKs5d+o4rl+QKBgQDS194fNQqf3txk1O2h\ny9LTOXTSNe0wWjgf4OcixbM7r/hC1YbY/1N1B65IyUEuBHlygdGVq9xs1RutrpKA\n4Z7QjSBlWsS/QDCpsqXR0LtzfviGVDKd36RyKAh/ZDL2Ddt3BRmcRujm1dAenJMM\nPzm9RRTad7IB+VkZiXMWgXlNbwKBgQDDumlPrRI4PYwmzUT/17yjEErf7i5FKvB/\nk/1cFQ6wIxnOC0ifvo2kngEG4wsrkHLmX0mAXsQZEn0y0/gnHdGZzlfO1jQ3A+75\nvFweyHEXC5K7dWUPVkrCoo3/FDlzDrj27ay5nWxfqn4D0SujfHJ/Ucimobs/+SDM\n5iD89uHbswKBgDT8lw/UrqTaxxx3/nhI1uTKbbdeYgtiwPQR+0Rb1t1LLeLt8oOa\nNwkUMxKLsVu1OCg0w80PccfQDrKpSpwlF1pl/Rw7oXJG2XPsN4vxHwq5gA+SHV5b\nk+I0eV46eiwn812H5JXHpEROu4zV4IaVZRdRwxncNtoUJfYq+sdPJoL1AoGAF8OJ\nR8A2pxdp7cgcaYezAoVW4etUONemzYaVS1nPJ7mLR4X9Mk/7eJIqg8CLOaXXHXtS\nPEDFRFoHU2WDCpTHPwpbhORjAI78s9uXv7EMcgTYsuPk+kC64PjFjsPQ2dRexrRC\ntWKUpuTXWfVKfBX+/NBcMUcPqgvAXMBQHwaGk5sCgYEAhHoqGinIUhGX8kRuk3A2\nOGwpgPalSGT5oTiTB86DkIabT5at3b8HO2ZKnAjpAbb8gww+5LjBXg9lIl0aBNaT\nd/DOelDPFUZNOhUnvB/Pt/1xcOyqSXVtInKzbPtwX2iTsPGfyou/aa2RIK/hjwNY\nMRiOoLLT6IJ5pkM4oroBfTs=\n-----END PRIVATE KEY-----\n",
  "client_email": "gitlab@bk-lms.iam.gserviceaccount.com",
  "client_id": "110023738285277976806",
  "auth_uri": "https://accounts.google.com/o/oauth2/auth",
  "token_uri": "https://oauth2.googleapis.com/token",
  "auth_provider_x509_cert_url": "https://www.googleapis.com/oauth2/v1/certs",
  "client_x509_cert_url": "https://www.googleapis.com/robot/v1/metadata/x509/gitlab%40bk-lms.iam.gserviceaccount.com"
}
