000000000008685 host1 host2
000023243530000 host1 host3
000000000035663 host1 host4
000045300035663 host2 host1
000295827035663 host2 host3
000000000035663 host2 host4
006232235035663 host3 host1
006978220035663 host3 host2
002527252035663 host3 host4
009815096035663 host4 host1
090175555035663 host4 host2
009992745035663 host4 host3
