<svg width="16" height="16" viewBox="0 0 16 16" fill="none" xmlns="http://www.w3.org/2000/svg">
    <path d="M7.99998 2.66667C5.05446 2.66667 2.66665 5.05448 2.66665 8C2.66665 10.9455 5.05446 13.3333 7.99998 13.3333C10.9455 13.3333 13.3333 10.9455 13.3333 8C13.3333 5.05448 10.9455 2.66667 7.99998 2.66667ZM1.33331 8C1.33331 4.3181 4.31808 1.33334 7.99998 1.33334C11.6819 1.33334 14.6666 4.3181 14.6666 8C14.6666 11.6819 11.6819 14.6667 7.99998 14.6667C4.31808 14.6667 1.33331 11.6819 1.33331 8ZM7.99998 4C8.36817 4 8.66665 4.29848 8.66665 4.66667V7.72386L10.4714 9.5286C10.7317 9.78895 10.7317 10.2111 10.4714 10.4714C10.211 10.7318 9.78892 10.7318 9.52857 10.4714L7.52858 8.47141C7.40355 8.34638 7.33331 8.17681 7.33331 8V4.66667C7.33331 4.29848 7.63179 4 7.99998 4Z" fill="white"/>
</svg>
