%YAML 1.1
%TAG !u! tag:unity3d.com,2011:
--- !u!1045 &1
EditorBuildSettings:
  m_ObjectHideFlags: 0
  serializedVersion: 2
  m_Scenes:
  - enabled: 1
    path: Assets/Test/Test.unity
    guid: 2f0fa99cec0444ec28f11a57ff1506f6
  m_configObjects: {}
