201904210749	1 mn
201904210750	Train a quai
201904210751	7 mn
201904210752	5 mn
201904210753	4 mn
201904210754	2 mn
201904210755	2 mn
201904210756	1 mn
201904210757	Train a l'approche
201904210758	6 mn
201904210759	5 mn
201904210800	4 mn
201904210801	2 mn
201904210802	2 mn
201904210803	0 mn
201904210804	Train a quai
201904210805	5 mn
201904210806	4 mn
201904210807	2 mn
201904210808	2 mn
201904210809	0 mn
201904210810	Train a l'approche
201904210811	5 mn
201904210812	4 mn
201904210813	3 mn
201904210814	2 mn
201904210815	2 mn
201904210816	0 mn
201904210817	Train a l'approche
201904210818	5 mn
201904210819	4 mn
201904210821	3 mn
201904210822	3 mn
201904210823	2 mn
201904210824	0 mn
201904210825	Train a l'approche
201904210826	5 mn
201904210827	4 mn
201904210828	3 mn
201904210829	2 mn
201904210830	2 mn
201904210831	0 mn
201904210832	Train a l'approche
201904210833	5 mn
201904210834	4 mn
201904210835	3 mn
201904210836	2 mn
201904210837	2 mn
201904210838	0 mn
201904210839	Train a quai
201904210840	5 mn
201904210841	4 mn
201904210842	3 mn
201904210843	2 mn
201904210844	2 mn
201904210845	0 mn
201904210846	0 mn
201904210847	5 mn
201904210848	3 mn
