201904210749	2 mn
201904210750	1 mn
201904210751	1 mn
201904210752	Train a quai
201904210753	4 mn
201904210754	3 mn
201904210755	2 mn
201904210756	1 mn
201904210757	Train a l'approche
201904210758	Train a quai
201904210759	4 mn
201904210800	3 mn
201904210801	2 mn
201904210802	1 mn
201904210803	0 mn
201904210804	4 mn
201904210805	3 mn
201904210806	3 mn
201904210807	2 mn
201904210808	1 mn
201904210809	Train a l'approche
201904210810	4 mn
201904210811	3 mn
201904210812	3 mn
201904210813	2 mn
201904210814	1 mn
201904210815	Train a l'approche
201904210816	4 mn
201904210817	4 mn
201904210818	2 mn
201904210819	2 mn
201904210820	1 mn
201904210821	Train a l'approche
201904210822	4 mn
201904210823	3 mn
201904210824	2 mn
201904210825	2 mn
201904210826	1 mn
201904210827	Train a l'approche
201904210828	4 mn
201904210830	3 mn
201904210831	3 mn
201904210832	2 mn
201904210833	2 mn
201904210834	Train a l'approche
201904210835	4 mn
201904210836	3 mn
201904210837	2 mn
201904210838	1 mn
201904210839	1 mn
201904210840	Train a quai
201904210841	4 mn
201904210842	3 mn
201904210843	2 mn
201904210844	1 mn
201904210845	1 mn
201904210846	Train a l'approche
201904210847	Train a l'approche
201904210848	3 mn
