201904210749	2 mn
201904210750	1 mn
201904210751	0 mn
201904210752	Train a quai
201904210753	4 mn
201904210754	3 mn
201904210755	2 mn
201904210756	1 mn
201904210757	0 mn
201904210758	Train a quai
201904210759	4 mn
201904210800	3 mn
201904210801	2 mn
201904210803	0 mn
201904210804	Train a quai
201904210805	4 mn
201904210806	3 mn
201904210807	2 mn
201904210808	1 mn
201904210809	0 mn
201904210810	Train a quai
201904210811	4 mn
201904210812	3 mn
201904210813	3 mn
201904210814	2 mn
201904210815	0 mn
201904210816	4 mn
201904210817	3 mn
201904210818	3 mn
201904210819	1 mn
201904210820	0 mn
201904210821	Train a quai
201904210822	3 mn
201904210823	2 mn
201904210824	1 mn
201904210825	1 mn
201904210826	Train a quai
201904210827	4 mn
201904210828	2 mn
201904210829	1 mn
201904210830	0 mn
201904210831	Train a quai
201904210832	4 mn
201904210833	4 mn
201904210834	2 mn
201904210835	1 mn
201904210836	0 mn
201904210837	Train a quai
201904210838	3 mn
201904210839	2 mn
201904210840	1 mn
201904210841	0 mn
201904210842	Train a l'approche
201904210843	4 mn
201904210844	3 mn
201904210845	2 mn
201904210846	2 mn
201904210847	0 mn
201904210848	Train a quai
