201904210749	1 mn
201904210750	Train a l'approche
201904210751	4 mn
201904210752	3 mn
201904210753	3 mn
201904210754	1 mn
201904210755	0 mn
201904210756	Train a quai
201904210757	3 mn
201904210758	2 mn
201904210759	1 mn
201904210800	1 mn
201904210801	Train a quai
201904210803	4 mn
201904210804	2 mn
201904210805	2 mn
201904210806	1 mn
201904210807	Train a l'approche
201904210808	2 mn
201904210809	2 mn
201904210810	Train a l'approche
201904210811	Train a quai
201904210812	3 mn
201904210813	2 mn
201904210814	1 mn
201904210815	1 mn
201904210816	3 mn
201904210817	2 mn
201904210818	1 mn
201904210819	Train a l'approche
201904210820	4 mn
201904210821	3 mn
201904210822	2 mn
201904210823	1 mn
201904210824	Train a l'approche
201904210825	5 mn
201904210826	4 mn
201904210827	3 mn
201904210828	3 mn
201904210829	2 mn
201904210830	1 mn
201904210831	Train a quai
201904210832	3 mn
201904210833	2 mn
201904210834	1 mn
201904210835	Train a l'approche
201904210836	3 mn
201904210837	2 mn
201904210838	1 mn
201904210839	0 mn
201904210840	4 mn
201904210841	3 mn
201904210842	3 mn
201904210843	3 mn
201904210844	2 mn
201904210845	1 mn
201904210846	Train a l'approche
201904210847	4 mn
201904210848	2 mn
