201904210749	7 mn
201904210750	6 mn
201904210751	5 mn
201904210752	4 mn
201904210753	3 mn
201904210754	2 mn
201904210755	1 mn
201904210756	0 mn
201904210757	7 mn
201904210758	6 mn
201904210759	5 mn
201904210800	4 mn
201904210801	3 mn
201904210802	2 mn
201904210803	1 mn
201904210804	0 mn
201904210805	7 mn
201904210806	6 mn
201904210807	5 mn
201904210808	4 mn
201904210809	3 mn
201904210810	2 mn
201904210811	0 mn
201904210812	0 mn
201904210813	8 mn
201904210814	6 mn
201904210815	5 mn
201904210816	4 mn
201904210817	3 mn
201904210818	2 mn
201904210819	1 mn
201904210820	0 mn
201904210821	7 mn
201904210822	7 mn
201904210823	6 mn
201904210825	5 mn
201904210826	4 mn
201904210827	3 mn
201904210828	6 mn
201904210829	6 mn
201904210830	4 mn
201904210831	3 mn
201904210832	2 mn
201904210833	1 mn
201904210834	4 mn
201904210835	3 mn
201904210836	2 mn
201904210837	1 mn
201904210838	0 mn
201904210839	6 mn
201904210840	3 mn
201904210841	2 mn
201904210842	1 mn
201904210843	0 mn
201904210844	5 mn
201904210845	4 mn
201904210846	3 mn
201904210847	3 mn
201904210848	1 mn
