201904210749	5 mn
201904210750	4 mn
201904210751	3 mn
201904210752	2 mn
201904210753	1 mn
201904210754	0 mn
201904210755	Train a l'approche
201904210756	6 mn
201904210757	5 mn
201904210758	4 mn
201904210759	3 mn
201904210800	3 mn
201904210802	1 mn
201904210803	Train a l'approche
201904210804	6 mn
201904210805	6 mn
201904210806	5 mn
201904210807	4 mn
201904210808	2 mn
201904210809	2 mn
201904210810	1 mn
201904210811	Train a quai
201904210812	7 mn
201904210813	6 mn
201904210814	5 mn
201904210815	4 mn
201904210816	3 mn
201904210817	2 mn
201904210818	1 mn
201904210819	Train a l'approche
201904210820	7 mn
201904210821	7 mn
201904210822	4 mn
201904210823	3 mn
201904210824	2 mn
201904210825	1 mn
201904210826	Train a l'approche
201904210827	Train a quai
201904210828	7 mn
201904210829	6 mn
201904210830	4 mn
201904210831	4 mn
201904210832	2 mn
201904210833	1 mn
201904210834	Train a l'approche
201904210835	Train a quai
201904210836	6 mn
201904210837	5 mn
201904210838	4 mn
201904210839	3 mn
201904210840	2 mn
201904210841	1 mn
201904210842	Train a l'approche
201904210843	Train a quai
201904210844	6 mn
201904210845	5 mn
201904210846	5 mn
201904210847	4 mn
201904210848	2 mn
