201904210749	4 mn
201904210750	3 mn
201904210751	2 mn
201904210752	1 mn
201904210753	0 mn
201904210754	Train a quai
201904210755	3 mn
201904210756	2 mn
201904210757	1 mn
201904210758	0 mn
201904210759	Train a l'approche
201904210800	9 mn
201904210802	7 mn
201904210803	6 mn
201904210804	5 mn
201904210805	4 mn
201904210806	3 mn
201904210807	2 mn
201904210808	1 mn
201904210809	0 mn
201904210810	Train a quai
201904210811	5 mn
201904210812	4 mn
201904210813	3 mn
201904210814	2 mn
201904210815	1 mn
201904210816	0 mn
201904210817	Train a quai
201904210818	7 mn
201904210819	6 mn
201904210820	5 mn
201904210821	5 mn
201904210822	3 mn
201904210823	2 mn
201904210824	1 mn
201904210825	0 mn
201904210826	7 mn
201904210827	6 mn
201904210828	5 mn
201904210829	4 mn
201904210830	3 mn
201904210831	2 mn
201904210832	1 mn
201904210833	0 mn
201904210834	Train a l'approche
201904210835	6 mn
201904210836	5 mn
201904210837	4 mn
201904210838	3 mn
201904210839	2 mn
201904210840	2 mn
201904210841	1 mn
201904210842	Train a l'approche
201904210843	Train a quai
201904210844	4 mn
201904210845	3 mn
201904210846	2 mn
201904210847	1 mn
201904210848	0 mn
