201904210749	Train a l'approche
201904210750	4 mn
201904210751	3 mn
201904210752	2 mn
201904210753	1 mn
201904210754	Train a l'approche
201904210755	5 mn
201904210756	4 mn
201904210757	3 mn
201904210758	2 mn
201904210759	1 mn
201904210800	Train a l'approche
201904210801	5 mn
201904210803	3 mn
201904210804	2 mn
201904210805	1 mn
201904210806	0 mn
201904210807	Train a quai
201904210808	3 mn
201904210809	3 mn
201904210810	3 mn
201904210811	1 mn
201904210812	Train a l'approche
201904210813	6 mn
201904210814	5 mn
201904210815	3 mn
201904210816	2 mn
201904210817	1 mn
201904210818	Train a l'approche
201904210819	4 mn
201904210820	3 mn
201904210821	2 mn
201904210822	1 mn
201904210823	0 mn
201904210824	Train a quai
201904210825	4 mn
201904210826	2 mn
201904210827	1 mn
201904210828	0 mn
201904210829	4 mn
201904210830	3 mn
201904210831	2 mn
201904210832	1 mn
201904210833	Train a l'approche
201904210834	5 mn
201904210835	4 mn
201904210836	3 mn
201904210837	2 mn
201904210838	1 mn
201904210839	Train a l'approche
201904210840	Train a quai
201904210841	3 mn
201904210842	3 mn
201904210843	1 mn
201904210844	1 mn
201904210845	Train a quai
201904210846	5 mn
201904210847	3 mn
201904210848	2 mn
