201904210749	3 mn
201904210750	2 mn
201904210751	1 mn
201904210752	1 mn
201904210753	Train a quai
201904210754	3 mn
201904210755	2 mn
201904210756	1 mn
201904210757	0 mn
201904210758	Train a quai
201904210759	3 mn
201904210800	2 mn
201904210802	1 mn
201904210803	0 mn
201904210804	3 mn
201904210805	2 mn
201904210806	1 mn
201904210807	0 mn
201904210808	4 mn
201904210809	3 mn
201904210810	2 mn
201904210811	1 mn
201904210812	0 mn
201904210813	Train a quai
201904210814	2 mn
201904210815	Train a l'approche
201904210816	4 mn
201904210817	3 mn
201904210818	3 mn
201904210819	1 mn
201904210820	0 mn
201904210821	Train a l'approche
201904210822	0 mn
201904210823	Train a l'approche
201904210824	3 mn
201904210825	2 mn
201904210826	1 mn
201904210827	0 mn
201904210828	Train a quai
201904210829	2 mn
201904210830	1 mn
201904210831	0 mn
201904210832	2 mn
201904210833	1 mn
201904210834	0 mn
201904210835	Train a quai
201904210836	0 mn
201904210837	Train a quai
201904210838	2 mn
201904210839	1 mn
201904210840	0 mn
201904210841	Train a quai
201904210842	1 mn
201904210843	0 mn
201904210844	Train a quai
201904210845	2 mn
201904210846	1 mn
201904210847	0 mn
201904210848	2 mn
