201904210749	Train a quai
201904210750	4 mn
201904210751	3 mn
201904210752	2 mn
201904210753	1 mn
201904210754	Train a l'approche
201904210755	5 mn
201904210756	4 mn
201904210757	2 mn
201904210758	1 mn
201904210759	Train a l'approche
201904210800	3 mn
201904210801	2 mn
201904210802	1 mn
201904210803	Train a l'approche
201904210804	5 mn
201904210805	4 mn
201904210806	2 mn
201904210807	2 mn
201904210808	1 mn
201904210809	0 mn
201904210810	Train a quai
201904210812	2 mn
201904210812	1 mn
201904210813	0 mn
201904210814	Train a quai
201904210815	3 mn
201904210816	2 mn
201904210817	1 mn
201904210818	Train a l'approche
201904210819	4 mn
201904210821	3 mn
201904210822	3 mn
201904210823	1 mn
201904210824	Train a l'approche
201904210825	4 mn
201904210826	3 mn
201904210827	2 mn
201904210828	1 mn
201904210829	0 mn
201904210830	Train a quai
201904210831	2 mn
201904210832	2 mn
201904210833	1 mn
201904210834	1 mn
201904210835	1 mn
201904210836	Train a l'approche
201904210837	Train a quai
201904210838	2 mn
201904210839	1 mn
201904210840	0 mn
201904210841	Train a quai
201904210842	1 mn
201904210843	1 mn
201904210844	Train a quai
201904210845	3 mn
201904210846	2 mn
201904210847	1 mn
201904210848	Train a l'approche
