201904210749	6 mn
201904210750	Train retarde
201904210751	5 mn
201904210752	3 mn
201904210753	2 mn
201904210754	1 mn
201904210755	0 mn
201904210756	Train a quai
201904210757	8 mn
201904210758	7 mn
201904210759	5 mn
201904210800	3 mn
201904210801	2 mn
201904210802	1 mn
201904210803	Train a l'approche
201904210804	8 mn
201904210805	7 mn
201904210806	6 mn
201904210807	5 mn
201904210808	5 mn
201904210809	4 mn
201904210810	2 mn
201904210811	1 mn
201904210812	Train a l'approche
201904210813	8 mn
201904210814	7 mn
201904210815	5 mn
201904210816	3 mn
201904210817	2 mn
201904210818	1 mn
201904210819	0 mn
201904210820	Train a quai
201904210821	7 mn
201904210822	5 mn
201904210823	4 mn
201904210825	3 mn
201904210826	3 mn
201904210827	1 mn
201904210828	Train a l'approche
201904210829	7 mn
201904210830	6 mn
201904210831	5 mn
201904210832	3 mn
201904210833	2 mn
201904210834	2 mn
201904210835	0 mn
201904210836	Train a l'approche
201904210837	6 mn
201904210838	5 mn
201904210839	4 mn
201904210840	3 mn
201904210841	2 mn
201904210842	1 mn
201904210843	Train a l'approche
201904210844	5 mn
201904210845	3 mn
201904210846	2 mn
201904210847	2 mn
201904210848	0 mn
