201904210749	Train retarde
201904210750	5 mn
201904210751	4 mn
201904210752	3 mn
201904210753	2 mn
201904210754	1 mn
201904210755	5 mn
201904210756	4 mn
201904210757	3 mn
201904210758	2 mn
201904210759	1 mn
201904210800	4 mn
201904210801	3 mn
201904210803	2 mn
201904210804	4 mn
201904210805	3 mn
201904210806	2 mn
201904210807	1 mn
201904210808	0 mn
201904210809	0 mn
201904210810	5 mn
201904210811	3 mn
201904210812	2 mn
201904210813	1 mn
201904210814	0 mn
201904210815	4 mn
201904210816	4 mn
201904210817	3 mn
201904210818	2 mn
201904210819	1 mn
201904210820	0 mn
201904210821	4 mn
201904210822	3 mn
201904210823	2 mn
201904210824	1 mn
201904210825	1 mn
201904210826	3 mn
201904210827	3 mn
201904210828	2 mn
201904210829	0 mn
201904210830	3 mn
201904210831	3 mn
201904210832	1 mn
201904210833	1 mn
201904210834	0 mn
201904210835	3 mn
201904210836	2 mn
201904210837	1 mn
201904210838	0 mn
201904210839	0 mn
201904210840	3 mn
201904210841	2 mn
201904210842	2 mn
201904210843	0 mn
201904210844	5 mn
201904210845	3 mn
201904210846	2 mn
201904210847	1 mn
201904210848	0 mn
