201904210749	1 mn
201904210750	Train a l'approche
201904210751	5 mn
201904210752	3 mn
201904210753	3 mn
201904210754	2 mn
201904210755	1 mn
201904210756	0 mn
201904210757	Train a quai
201904210758	2 mn
201904210759	1 mn
201904210800	0 mn
201904210801	4 mn
201904210802	2 mn
201904210804	1 mn
201904210805	0 mn
201904210806	Train a l'approche
201904210807	Train retarde
201904210808	Train retarde
201904210809	3 mn
201904210810	2 mn
201904210811	1 mn
201904210812	1 mn
201904210813	Train a quai
201904210814	4 mn
201904210815	3 mn
201904210816	3 mn
201904210817	2 mn
201904210818	1 mn
201904210819	Train a l'approche
201904210820	3 mn
201904210821	2 mn
201904210822	1 mn
201904210823	Train a l'approche
201904210824	3 mn
201904210825	3 mn
201904210826	2 mn
201904210827	1 mn
201904210828	Train a l'approche
201904210829	4 mn
201904210830	Train retarde
201904210831	Train retarde
201904210832	3 mn
201904210833	3 mn
201904210834	2 mn
201904210835	1 mn
201904210836	Train a l'approche
201904210837	4 mn
201904210838	Train retarde
201904210839	3 mn
201904210840	2 mn
201904210841	1 mn
201904210842	1 mn
201904210843	Train a l'approche
201904210844	5 mn
201904210845	4 mn
201904210846	Train retarde
201904210847	2 mn
201904210848	2 mn
