201904210749	5 mn
201904210750	4 mn
201904210751	3 mn
201904210752	2 mn
201904210753	1 mn
201904210754	0 mn
201904210755	Train a quai
201904210756	3 mn
201904210757	2 mn
201904210758	1 mn
201904210759	0 mn
201904210801	Train a quai
201904210802	2 mn
201904210803	1 mn
201904210804	Train a l'approche
201904210805	Train a quai
201904210806	Train a quai
201904210807	5 mn
201904210808	4 mn
201904210809	4 mn
201904210810	2 mn
201904210811	1 mn
201904210812	Train a l'approche
201904210813	Train a quai
201904210814	7 mn
201904210815	6 mn
201904210816	5 mn
201904210817	4 mn
201904210818	3 mn
201904210819	2 mn
201904210820	0 mn
201904210821	0 mn
201904210822	7 mn
201904210823	5 mn
201904210824	5 mn
201904210825	3 mn
201904210826	2 mn
201904210827	1 mn
201904210828	0 mn
201904210829	0 mn
201904210830	6 mn
201904210831	5 mn
201904210832	4 mn
201904210833	3 mn
201904210834	1 mn
201904210835	0 mn
201904210836	Train a quai
201904210837	8 mn
201904210838	7 mn
201904210839	6 mn
201904210840	5 mn
201904210841	4 mn
201904210842	3 mn
201904210843	2 mn
201904210844	1 mn
201904210845	0 mn
201904210846	0 mn
201904210847	5 mn
201904210848	4 mn
