201904210749	6 mn
201904210750	5 mn
201904210751	4 mn
201904210752	3 mn
201904210753	2 mn
201904210754	2 mn
201904210755	0 mn
201904210756	Train a l'approche
201904210757	7 mn
201904210758	6 mn
201904210759	5 mn
201904210800	4 mn
201904210801	3 mn
201904210802	2 mn
201904210804	0 mn
201904210805	Train a quai
201904210805	7 mn
201904210807	6 mn
201904210808	6 mn
201904210808	4 mn
201904210809	3 mn
201904210810	3 mn
201904210812	1 mn
201904210813	1 mn
201904210814	Train a l'approche
201904210814	8 mn
201904210816	7 mn
201904210817	6 mn
201904210818	4 mn
201904210819	4 mn
201904210820	3 mn
201904210821	2 mn
201904210822	0 mn
201904210823	Train a quai
201904210824	6 mn
201904210825	5 mn
201904210826	4 mn
201904210827	3 mn
201904210828	3 mn
201904210829	2 mn
201904210830	1 mn
201904210831	Train a l'approche
201904210832	7 mn
201904210833	6 mn
201904210834	4 mn
201904210835	3 mn
201904210836	5 mn
201904210837	4 mn
201904210838	3 mn
201904210839	2 mn
201904210840	1 mn
201904210841	0 mn
201904210842	Train a l'approche
201904210843	6 mn
201904210844	5 mn
201904210845	4 mn
201904210846	4 mn
201904210847	3 mn
201904210848	2 mn
