201904210749	Train a quai
201904210750	4 mn
201904210751	3 mn
201904210752	2 mn
201904210753	2 mn
201904210754	0 mn
201904210755	Train a quai
201904210756	3 mn
201904210757	2 mn
201904210758	0 mn
201904210759	Train a l'approche
201904210800	Train a quai
201904210801	3 mn
201904210803	1 mn
201904210804	1 mn
201904210805	0 mn
201904210806	Train a l'approche
201904210807	2 mn
201904210808	1 mn
201904210809	Train a l'approche
201904210810	4 mn
201904210811	4 mn
201904210812	2 mn
201904210813	1 mn
201904210814	0 mn
201904210815	2 mn
201904210816	2 mn
201904210817	0 mn
201904210818	Train a l'approche
201904210819	4 mn
201904210820	3 mn
201904210821	2 mn
201904210822	0 mn
201904210823	Train a l'approche
201904210824	6 mn
201904210825	4 mn
201904210826	3 mn
201904210827	2 mn
201904210828	2 mn
201904210829	0 mn
201904210830	Train a quai
201904210831	4 mn
201904210832	2 mn
201904210833	1 mn
201904210834	Train a l'approche
201904210835	3 mn
201904210836	2 mn
201904210837	1 mn
201904210838	0 mn
201904210839	4 mn
201904210840	3 mn
201904210841	2 mn
201904210842	2 mn
201904210843	2 mn
201904210844	0 mn
201904210845	Train a quai
201904210846	3 mn
201904210847	2 mn
201904210848	1 mn
