201904210749	4 mn
201904210750	3 mn
201904210751	3 mn
201904210752	1 mn
201904210753	1 mn
201904210754	Train a l'approche
201904210755	0 mn
201904210756	Train a quai
201904210757	6 mn
201904210758	5 mn
201904210759	4 mn
201904210800	3 mn
201904210801	2 mn
201904210802	1 mn
201904210804	7 mn
201904210805	7 mn
201904210806	7 mn
201904210807	8 mn
201904210808	6 mn
201904210809	5 mn
201904210810	5 mn
201904210811	5 mn
201904210812	Train retarde
201904210813	4 mn
201904210814	3 mn
201904210815	2 mn
201904210816	1 mn
201904210817	Train a quai
201904210818	4 mn
201904210819	3 mn
201904210820	1 mn
201904210821	1 mn
201904210822	Train a quai
201904210823	5 mn
201904210824	4 mn
201904210825	3 mn
201904210826	3 mn
201904210827	1 mn
201904210828	0 mn
201904210829	9 mn
201904210830	8 mn
201904210831	6 mn
201904210832	5 mn
201904210833	4 mn
201904210834	3 mn
201904210835	3 mn
201904210836	2 mn
201904210837	Train a l'approche
201904210838	3 mn
201904210839	1 mn
201904210840	0 mn
201904210841	Train a quai
201904210842	1 mn
201904210843	Train a l'approche
201904210844	4 mn
201904210845	3 mn
201904210846	3 mn
201904210847	1 mn
201904210848	Train a l'approche
