201904210749	2 mn
201904210750	2 mn
201904210751	0 mn
201904210752	Train a l'approche
201904210753	9 mn
201904210754	9 mn
201904210755	8 mn
201904210756	8 mn
201904210757	6 mn
201904210758	6 mn
201904210759	4 mn
201904210800	3 mn
201904210801	2 mn
201904210802	1 mn
201904210804	Train a l'approche
201904210805	Train a quai
201904210806	4 mn
201904210807	3 mn
201904210808	2 mn
201904210809	1 mn
201904210810	Train a l'approche
201904210811	6 mn
201904210812	5 mn
201904210813	4 mn
201904210814	3 mn
201904210815	2 mn
201904210816	1 mn
201904210817	Train a l'approche
201904210818	6 mn
201904210819	5 mn
201904210820	4 mn
201904210821	3 mn
201904210822	3 mn
201904210823	1 mn
201904210824	Train a l'approche
201904210825	4 mn
201904210826	3 mn
201904210827	2 mn
201904210828	1 mn
201904210829	0 mn
201904210830	5 mn
201904210831	4 mn
201904210832	3 mn
201904210833	2 mn
201904210834	1 mn
201904210835	0 mn
201904210836	Train a quai
201904210837	4 mn
201904210838	3 mn
201904210839	2 mn
201904210840	2 mn
201904210841	1 mn
201904210842	Train a l'approche
201904210843	4 mn
201904210844	3 mn
201904210845	2 mn
201904210846	2 mn
201904210847	0 mn
201904210848	6 mn
