201904210749	5 mn
201904210750	3 mn
201904210751	2 mn
201904210752	2 mn
201904210753	1 mn
201904210754	Train a l'approche
201904210755	6 mn
201904210756	5 mn
201904210757	5 mn
201904210758	3 mn
201904210759	2 mn
201904210800	1 mn
201904210801	Train a l'approche
201904210802	8 mn
201904210803	Train a l'approche
201904210804	Train a l'approche
201904210805	Train a l'approche
201904210806	Train retarde
201904210807	Train retarde
201904210808	Train retarde
201904210809	2 mn
201904210810	0 mn
201904210811	Train a quai
201904210812	4 mn
201904210813	3 mn
201904210814	1 mn
201904210815	Train a l'approche
201904210816	6 mn
201904210817	5 mn
201904210818	3 mn
201904210819	2 mn
201904210820	1 mn
201904210821	1 mn
201904210822	Train a quai
201904210823	5 mn
201904210824	3 mn
201904210826	2 mn
201904210827	1 mn
201904210828	Train a l'approche
201904210829	5 mn
201904210830	3 mn
201904210831	2 mn
201904210832	1 mn
201904210833	Train a l'approche
201904210834	4 mn
201904210835	2 mn
201904210836	2 mn
201904210837	1 mn
201904210838	Train a quai
201904210839	5 mn
201904210840	5 mn
201904210841	3 mn
201904210842	2 mn
201904210843	1 mn
201904210844	Train a l'approche
201904210845	6 mn
201904210846	6 mn
201904210847	5 mn
201904210848	3 mn
