201904210749	3 mn
201904210750	2 mn
201904210751	2 mn
201904210752	0 mn
201904210753	Train a l'approche
201904210754	2 mn
201904210755	2 mn
201904210756	1 mn
201904210757	Train a l'approche
201904210758	3 mn
201904210759	2 mn
201904210801	1 mn
201904210802	0 mn
201904210803	Train a quai
201904210804	0 mn
201904210805	Train a l'approche
201904210806	Train a quai
201904210807	3 mn
201904210808	2 mn
201904210809	1 mn
201904210810	0 mn
201904210811	Train a quai
201904210812	1 mn
201904210813	Train a l'approche
201904210814	Train a quai
201904210815	2 mn
201904210816	1 mn
201904210817	0 mn
201904210818	Train a quai
201904210819	2 mn
201904210820	1 mn
201904210821	0 mn
201904210822	Train a quai
201904210823	1 mn
201904210824	0 mn
201904210825	Train a quai
201904210826	0 mn
201904210827	Train a l'approche
201904210828	2 mn
201904210829	1 mn
201904210830	0 mn
201904210831	Train a quai
201904210832	1 mn
201904210833	0 mn
201904210834	Train a quai
201904210835	2 mn
201904210836	1 mn
201904210837	0 mn
201904210838	Train a quai
201904210839	1 mn
201904210840	1 mn
201904210841	Train a l'approche
201904210842	2 mn
201904210843	1 mn
201904210844	0 mn
201904210845	Train a quai
201904210846	Train a quai
201904210847	2 mn
201904210848	0 mn
