201904210749	6 mn
201904210750	6 mn
201904210751	4 mn
201904210752	3 mn
201904210753	3 mn
201904210754	1 mn
201904210755	1 mn
201904210756	Train a l'approche
201904210757	4 mn
201904210758	3 mn
201904210759	2 mn
201904210800	1 mn
201904210801	Train a l'approche
201904210802	4 mn
201904210804	2 mn
201904210805	1 mn
201904210806	0 mn
201904210807	Train a l'approche
201904210808	3 mn
201904210809	2 mn
201904210810	1 mn
201904210811	0 mn
201904210812	Train a quai
201904210813	9 mn
201904210814	8 mn
201904210815	7 mn
201904210816	7 mn
201904210817	6 mn
201904210818	4 mn
201904210819	4 mn
201904210820	3 mn
201904210821	2 mn
201904210822	1 mn
201904210823	Train a l'approche
201904210824	6 mn
201904210825	5 mn
201904210826	4 mn
201904210827	4 mn
201904210828	2 mn
201904210829	1 mn
201904210830	Train a l'approche
201904210831	7 mn
201904210832	6 mn
201904210833	6 mn
201904210834	4 mn
201904210835	3 mn
201904210836	3 mn
201904210837	1 mn
201904210838	1 mn
201904210839	Train a quai
201904210840	9 mn
201904210841	8 mn
201904210842	8 mn
201904210843	6 mn
201904210844	5 mn
201904210845	4 mn
201904210846	3 mn
201904210847	2 mn
201904210848	1 mn
