201904210749	Train a quai
201904210750	7 mn
201904210751	7 mn
201904210752	6 mn
201904210753	5 mn
201904210754	5 mn
201904210755	3 mn
201904210756	2 mn
201904210757	1 mn
201904210758	1 mn
201904210759	Train a quai
201904210800	6 mn
201904210801	5 mn
201904210802	4 mn
201904210804	2 mn
201904210805	2 mn
201904210806	2 mn
201904210807	Train a l'approche
201904210808	8 mn
201904210809	3 mn
201904210810	2 mn
201904210811	1 mn
201904210812	Train a l'approche
201904210813	3 mn
201904210814	2 mn
201904210815	2 mn
201904210816	1 mn
201904210817	Train a quai
201904210818	7 mn
201904210819	6 mn
201904210820	5 mn
201904210821	4 mn
201904210822	3 mn
201904210823	2 mn
201904210824	1 mn
201904210825	Train a l'approche
201904210826	8 mn
201904210827	6 mn
201904210828	6 mn
201904210829	5 mn
201904210830	4 mn
201904210831	4 mn
201904210832	2 mn
201904210833	1 mn
201904210834	Train a l'approche
201904210835	7 mn
201904210836	6 mn
201904210837	5 mn
201904210838	4 mn
201904210839	3 mn
201904210840	2 mn
201904210841	2 mn
201904210842	1 mn
201904210843	Train a l'approche
201904210844	1 mn
201904210845	0 mn
201904210846	Train a quai
201904210847	5 mn
201904210848	3 mn
