201904210749	Train a quai
201904210750	3 mn
201904210751	2 mn
201904210752	1 mn
201904210753	0 mn
201904210754	Train a quai
201904210755	3 mn
201904210756	2 mn
201904210757	1 mn
201904210758	0 mn
201904210759	Train a quai
201904210800	3 mn
201904210802	1 mn
201904210803	0 mn
201904210804	4 mn
201904210805	4 mn
201904210806	3 mn
201904210807	2 mn
201904210808	0 mn
201904210809	0 mn
201904210810	2 mn
201904210811	1 mn
201904210812	0 mn
201904210813	Train a quai
201904210814	4 mn
201904210815	3 mn
201904210816	2 mn
201904210817	1 mn
201904210818	Train a l'approche
201904210819	1 mn
201904210820	0 mn
201904210821	Train a quai
201904210822	4 mn
201904210823	3 mn
201904210824	2 mn
201904210825	1 mn
201904210826	0 mn
201904210827	Train a quai
201904210828	0 mn
201904210829	Train a quai
201904210830	4 mn
201904210831	2 mn
201904210832	1 mn
201904210833	0 mn
201904210834	2 mn
201904210835	1 mn
201904210836	1 mn
201904210837	Train a quai
201904210838	1 mn
201904210839	0 mn
201904210840	Train a l'approche
201904210841	0 mn
201904210842	Train a l'approche
201904210843	3 mn
201904210844	2 mn
201904210845	1 mn
201904210846	0 mn
201904210847	2 mn
201904210848	1 mn
