201904210749	2 mn
201904210750	1 mn
201904210751	0 mn
201904210752	Train a quai
201904210753	5 mn
201904210754	5 mn
201904210755	3 mn
201904210756	2 mn
201904210757	1 mn
201904210758	0 mn
201904210759	9 mn
201904210800	8 mn
201904210801	7 mn
201904210802	5 mn
201904210804	4 mn
201904210805	3 mn
201904210806	3 mn
201904210807	1 mn
201904210808	0 mn
201904210809	Train a quai
201904210810	0 mn
201904210811	Train a quai
201904210812	6 mn
201904210813	5 mn
201904210814	4 mn
201904210815	3 mn
201904210816	1 mn
201904210817	1 mn
201904210818	Train a l'approche
201904210819	4 mn
201904210820	3 mn
201904210821	3 mn
201904210822	1 mn
201904210823	1 mn
201904210824	Train a quai
201904210825	6 mn
201904210826	4 mn
201904210827	4 mn
201904210828	3 mn
201904210829	1 mn
201904210830	1 mn
201904210831	Train a l'approche
201904210832	5 mn
201904210833	4 mn
201904210834	3 mn
201904210835	2 mn
201904210836	1 mn
201904210837	Train a l'approche
201904210838	7 mn
201904210839	7 mn
201904210840	5 mn
201904210841	4 mn
201904210842	3 mn
201904210843	2 mn
201904210844	1 mn
201904210845	Train a l'approche
201904210846	Train a quai
201904210847	Train a quai
201904210848	2 mn
