201904210749	3 mn
201904210750	1 mn
201904210751	0 mn
201904210752	Train a l'approche
201904210753	3 mn
201904210754	2 mn
201904210755	1 mn
201904210756	0 mn
201904210757	0 mn
201904210758	Train a quai
201904210759	2 mn
201904210800	1 mn
201904210802	0 mn
201904210803	Train a quai
201904210804	3 mn
201904210805	2 mn
201904210806	1 mn
201904210807	0 mn
201904210808	Train a quai
201904210809	2 mn
201904210810	1 mn
201904210811	0 mn
201904210812	4 mn
201904210813	3 mn
201904210814	2 mn
201904210815	1 mn
201904210816	0 mn
201904210817	Train a quai
201904210818	1 mn
201904210819	Train a l'approche
201904210820	5 mn
201904210821	4 mn
201904210822	3 mn
201904210823	2 mn
201904210824	1 mn
201904210825	1 mn
201904210826	0 mn
201904210827	Train a l'approche
201904210828	3 mn
201904210829	2 mn
201904210830	1 mn
201904210831	0 mn
201904210832	Train a quai
201904210833	2 mn
201904210834	1 mn
201904210835	0 mn
201904210836	2 mn
201904210837	1 mn
201904210838	0 mn
201904210839	Train a quai
201904210840	0 mn
201904210841	Train a quai
201904210842	2 mn
201904210843	1 mn
201904210844	0 mn
201904210845	Train a quai
201904210846	2 mn
201904210847	0 mn
201904210848	Train a quai
