201904210749	3 mn
201904210750	1 mn
201904210751	1 mn
201904210752	Train a l'approche
201904210753	8 mn
201904210754	7 mn
201904210755	6 mn
201904210756	5 mn
201904210757	4 mn
201904210758	2 mn
201904210759	1 mn
201904210800	1 mn
201904210801	Train a l'approche
201904210802	6 mn
201904210803	5 mn
201904210804	4 mn
201904210805	3 mn
201904210806	3 mn
201904210807	1 mn
201904210808	0 mn
201904210809	Train a quai
201904210810	7 mn
201904210811	6 mn
201904210812	5 mn
201904210813	4 mn
201904210814	3 mn
201904210815	2 mn
201904210816	1 mn
201904210817	0 mn
201904210818	Train a quai
201904210819	6 mn
201904210820	5 mn
201904210821	4 mn
201904210822	3 mn
201904210823	1 mn
201904210825	1 mn
201904210826	Train a l'approche
201904210827	6 mn
201904210828	5 mn
201904210829	4 mn
201904210830	4 mn
201904210831	2 mn
201904210832	1 mn
201904210833	1 mn
201904210834	Train a quai
201904210835	6 mn
201904210836	5 mn
201904210837	4 mn
201904210838	3 mn
201904210839	2 mn
201904210840	1 mn
201904210841	Train a l'approche
201904210842	Train a quai
201904210843	5 mn
201904210844	4 mn
201904210845	5 mn
201904210846	2 mn
201904210847	1 mn
201904210848	1 mn
