201904210749	1 mn
201904210750	Train a l'approche
201904210751	8 mn
201904210752	7 mn
201904210753	6 mn
201904210754	5 mn
201904210755	4 mn
201904210756	2 mn
201904210757	1 mn
201904210758	1 mn
201904210759	Train a quai
201904210800	8 mn
201904210801	7 mn
201904210802	5 mn
201904210803	4 mn
201904210804	3 mn
201904210805	2 mn
201904210806	1 mn
201904210807	0 mn
201904210808	7 mn
201904210809	5 mn
201904210810	4 mn
201904210811	3 mn
201904210812	1 mn
201904210813	1 mn
201904210814	Train a quai
201904210815	8 mn
201904210816	7 mn
201904210817	5 mn
201904210818	5 mn
201904210819	4 mn
201904210820	2 mn
201904210821	1 mn
201904210822	1 mn
201904210823	Train a quai
201904210824	8 mn
201904210826	7 mn
201904210826	5 mn
201904210828	4 mn
201904210829	4 mn
201904210830	2 mn
201904210831	2 mn
201904210832	1 mn
201904210833	Train a l'approche
201904210834	7 mn
201904210835	7 mn
201904210836	5 mn
201904210837	4 mn
201904210838	3 mn
201904210839	2 mn
201904210840	1 mn
201904210841	Train a l'approche
201904210842	4 mn
201904210843	4 mn
201904210844	2 mn
201904210845	1 mn
201904210846	0 mn
201904210847	0 mn
201904210848	5 mn
