201904210749	1 mn
201904210750	0 mn
201904210751	Train a l'approche
201904210752	Train a quai
201904210753	2 mn
201904210754	1 mn
201904210755	0 mn
201904210756	Train a l'approche
201904210757	Train a quai
201904210758	3 mn
201904210759	2 mn
201904210800	1 mn
201904210802	0 mn
201904210803	Train a quai
201904210804	1 mn
201904210805	0 mn
201904210806	Train a l'approche
201904210807	3 mn
201904210808	2 mn
201904210809	2 mn
201904210810	1 mn
201904210811	Train a l'approche
201904210812	Train a quai
201904210813	0 mn
201904210814	Train a quai
201904210815	4 mn
201904210816	3 mn
201904210817	3 mn
201904210818	1 mn
201904210819	0 mn
201904210820	Train a quai
201904210821	0 mn
201904210822	Train a quai
201904210823	3 mn
201904210824	2 mn
201904210825	1 mn
201904210826	Train a l'approche
201904210827	Train a quai
201904210828	2 mn
201904210829	0 mn
201904210830	Train a l'approche
201904210831	2 mn
201904210832	1 mn
201904210833	Train a l'approche
201904210834	1 mn
201904210835	Train a l'approche
201904210836	Train a quai
201904210837	2 mn
201904210838	1 mn
201904210839	0 mn
201904210840	Train a quai
201904210841	1 mn
201904210842	Train a l'approche
201904210843	Train a quai
201904210844	1 mn
201904210845	0 mn
201904210846	Train a l'approche
201904210847	2 mn
201904210848	1 mn
