201904210749	2 mn
201904210750	1 mn
201904210751	Train a quai
201904210752	3 mn
201904210753	2 mn
201904210754	1 mn
201904210755	1 mn
201904210756	6 mn
201904210757	5 mn
201904210758	3 mn
201904210759	2 mn
201904210800	1 mn
201904210801	1 mn
201904210802	Train a quai
201904210803	1 mn
201904210804	Train a l'approche
201904210805	5 mn
201904210806	3 mn
201904210807	3 mn
201904210808	2 mn
201904210809	1 mn
201904210810	0 mn
201904210812	3 mn
201904210812	2 mn
201904210813	1 mn
201904210814	Train a l'approche
201904210815	5 mn
201904210816	3 mn
201904210817	2 mn
201904210818	1 mn
201904210819	0 mn
201904210821	5 mn
201904210822	4 mn
201904210823	2 mn
201904210824	1 mn
201904210825	Train a l'approche
201904210826	5 mn
201904210827	3 mn
201904210828	2 mn
201904210829	1 mn
201904210830	0 mn
201904210831	5 mn
201904210832	5 mn
201904210833	3 mn
201904210834	2 mn
201904210835	1 mn
201904210836	0 mn
201904210837	1 mn
201904210838	Train a l'approche
201904210839	2 mn
201904210840	1 mn
201904210841	1 mn
201904210842	5 mn
201904210843	5 mn
201904210844	3 mn
201904210845	2 mn
201904210846	1 mn
201904210847	1 mn
201904210848	2 mn
