201904210749	1 mn
201904210750	1 mn
201904210751	Train a quai
201904210752	4 mn
201904210753	4 mn
201904210754	2 mn
201904210755	1 mn
201904210756	1 mn
201904210757	Train a quai
201904210758	4 mn
201904210759	3 mn
201904210800	2 mn
201904210801	1 mn
201904210802	Train a l'approche
201904210804	1 mn
201904210805	1 mn
201904210806	0 mn
201904210807	0 mn
201904210808	0 mn
201904210809	Train a l'approche
201904210810	Train a quai
201904210811	Train a quai
201904210812	4 mn
201904210813	4 mn
201904210814	2 mn
201904210815	1 mn
201904210816	1 mn
201904210817	Train a quai
201904210818	4 mn
201904210819	2 mn
201904210820	1 mn
201904210821	1 mn
201904210822	Train a quai
201904210823	2 mn
201904210824	1 mn
201904210825	1 mn
201904210826	1 mn
201904210827	Train a quai
201904210828	4 mn
201904210829	3 mn
201904210830	3 mn
201904210831	1 mn
201904210832	1 mn
201904210833	5 mn
201904210834	4 mn
201904210835	4 mn
201904210836	2 mn
201904210837	1 mn
201904210838	0 mn
201904210839	Train a l'approche
201904210840	4 mn
201904210841	4 mn
201904210842	2 mn
201904210843	2 mn
201904210844	1 mn
201904210845	1 mn
201904210846	Train a quai
201904210847	Train a quai
201904210848	3 mn
