201904210749	4 mn
201904210750	2 mn
201904210751	1 mn
201904210752	2 mn
201904210753	Train a quai
201904210754	2 mn
201904210755	1 mn
201904210756	0 mn
201904210757	Train a quai
201904210758	5 mn
201904210759	4 mn
201904210800	4 mn
201904210801	2 mn
201904210802	1 mn
201904210804	Train a quai
201904210805	5 mn
201904210806	4 mn
201904210807	5 mn
201904210808	2 mn
201904210809	4 mn
201904210810	2 mn
201904210811	1 mn
201904210812	1 mn
201904210813	Train a quai
201904210814	2 mn
201904210815	1 mn
201904210816	2 mn
201904210817	Train a quai
201904210818	5 mn
201904210819	5 mn
201904210820	4 mn
201904210821	3 mn
201904210822	1 mn
201904210823	0 mn
201904210824	5 mn
201904210825	4 mn
201904210826	4 mn
201904210827	2 mn
201904210828	1 mn
201904210829	0 mn
201904210830	6 mn
201904210831	5 mn
201904210832	4 mn
201904210833	2 mn
201904210834	1 mn
201904210835	1 mn
201904210836	Train a quai
201904210837	5 mn
201904210838	4 mn
201904210839	2 mn
201904210840	1 mn
201904210841	1 mn
201904210842	Train a quai
201904210843	7 mn
201904210844	7 mn
201904210845	5 mn
201904210846	6 mn
201904210847	3 mn
201904210848	2 mn
