201904210749	Train a l'approche
201904210750	7 mn
201904210751	6 mn
201904210752	5 mn
201904210753	4 mn
201904210754	3 mn
201904210755	2 mn
201904210756	0 mn
201904210757	Train a l'approche
201904210758	7 mn
201904210759	6 mn
201904210801	4 mn
201904210802	3 mn
201904210803	2 mn
201904210804	0 mn
201904210805	0 mn
201904210806	8 mn
201904210807	6 mn
201904210808	5 mn
201904210809	4 mn
201904210810	4 mn
201904210811	2 mn
201904210812	1 mn
201904210813	0 mn
201904210814	Train a quai
201904210815	4 mn
201904210816	3 mn
201904210817	2 mn
201904210818	2 mn
201904210819	Train a l'approche
201904210820	2 mn
201904210821	1 mn
201904210822	0 mn
201904210823	Train a quai
201904210824	5 mn
201904210825	4 mn
201904210826	3 mn
201904210827	2 mn
201904210828	1 mn
201904210829	0 mn
201904210830	Train a quai
201904210831	6 mn
201904210832	5 mn
201904210833	4 mn
201904210834	3 mn
201904210835	2 mn
201904210836	0 mn
201904210837	Train a l'approche
201904210838	7 mn
201904210839	6 mn
201904210840	5 mn
201904210841	4 mn
201904210842	3 mn
201904210843	2 mn
201904210844	1 mn
201904210845	Train a l'approche
201904210846	Train a quai
201904210847	6 mn
201904210848	4 mn
