201904210749	2 mn
201904210750	1 mn
201904210751	0 mn
201904210752	Train a quai
201904210753	3 mn
201904210754	1 mn
201904210755	0 mn
201904210756	Train a l'approche
201904210757	3 mn
201904210758	2 mn
201904210759	1 mn
201904210800	1 mn
201904210801	Train a quai
201904210802	2 mn
201904210804	1 mn
201904210804	0 mn
201904210805	5 mn
201904210806	3 mn
201904210808	2 mn
201904210808	1 mn
201904210809	Train a l'approche
201904210810	3 mn
201904210812	2 mn
201904210812	2 mn
201904210813	1 mn
201904210814	Train a quai
201904210816	3 mn
201904210817	2 mn
201904210818	1 mn
201904210819	Train a l'approche
201904210820	3 mn
201904210821	3 mn
201904210822	2 mn
201904210823	1 mn
201904210824	Train a quai
201904210825	2 mn
201904210826	2 mn
201904210827	1 mn
201904210828	Train a quai
201904210829	3 mn
201904210830	2 mn
201904210831	1 mn
201904210832	0 mn
201904210833	Train a quai
201904210834	3 mn
201904210835	2 mn
201904210836	1 mn
201904210837	Train a l'approche
201904210838	4 mn
201904210839	3 mn
201904210840	2 mn
201904210841	1 mn
201904210842	Train a l'approche
201904210843	2 mn
201904210844	1 mn
201904210845	0 mn
201904210846	4 mn
201904210847	3 mn
201904210848	2 mn
