201904210749	3 mn
201904210750	2 mn
201904210751	1 mn
201904210752	Train a l'approche
201904210753	4 mn
201904210754	3 mn
201904210755	2 mn
201904210756	1 mn
201904210757	1 mn
201904210758	5 mn
201904210759	4 mn
201904210800	3 mn
201904210801	2 mn
201904210802	1 mn
201904210803	5 mn
201904210804	4 mn
201904210805	4 mn
201904210806	3 mn
201904210807	2 mn
201904210808	3 mn
201904210809	2 mn
201904210810	1 mn
201904210811	2 mn
201904210812	Train retarde
201904210813	2 mn
201904210814	1 mn
201904210815	Train a l'approche
201904210816	5 mn
201904210817	2 mn
201904210818	1 mn
201904210819	Train a l'approche
201904210820	4 mn
201904210822	3 mn
201904210822	2 mn
201904210823	1 mn
201904210825	1 mn
201904210826	4 mn
201904210827	4 mn
201904210828	2 mn
201904210829	1 mn
201904210830	1 mn
201904210831	4 mn
201904210832	3 mn
201904210833	Train retarde
201904210834	2 mn
201904210835	1 mn
201904210836	5 mn
201904210837	4 mn
201904210838	3 mn
201904210839	2 mn
201904210840	2 mn
201904210841	1 mn
201904210842	Train a l'approche
201904210843	4 mn
201904210844	2 mn
201904210845	2 mn
201904210846	1 mn
201904210847	1 mn
201904210848	4 mn
