201904210749	Train a quai
201904210750	4 mn
201904210751	3 mn
201904210752	2 mn
201904210753	1 mn
201904210754	0 mn
201904210755	Train a quai
201904210756	3 mn
201904210757	3 mn
201904210758	2 mn
201904210759	1 mn
201904210800	Train a l'approche
201904210801	4 mn
201904210803	3 mn
201904210804	1 mn
201904210805	0 mn
201904210806	Train a quai
201904210807	4 mn
201904210808	3 mn
201904210809	2 mn
201904210810	2 mn
201904210811	0 mn
201904210812	5 mn
201904210813	4 mn
201904210814	3 mn
201904210815	1 mn
201904210816	0 mn
201904210817	Train a quai
201904210818	5 mn
201904210819	3 mn
201904210820	2 mn
201904210821	1 mn
201904210822	Train a l'approche
201904210823	5 mn
201904210824	3 mn
201904210825	3 mn
201904210826	1 mn
201904210827	0 mn
201904210828	Train a quai
201904210829	4 mn
201904210830	3 mn
201904210831	2 mn
201904210832	1 mn
201904210833	1 mn
201904210834	Train a quai
201904210835	Train a quai
201904210836	Train a quai
201904210837	Train a quai
201904210838	Train a quai
201904210839	Train a l'approche
201904210840	3 mn
201904210841	2 mn
201904210842	2 mn
201904210843	0 mn
201904210844	Train a quai
201904210845	Train retarde
201904210846	3 mn
201904210847	2 mn
201904210848	1 mn
