201904210749	2 mn
201904210750	0 mn
201904210751	Train a quai
201904210752	5 mn
201904210753	4 mn
201904210754	3 mn
201904210755	2 mn
201904210756	0 mn
201904210757	Train a quai
201904210758	6 mn
201904210759	6 mn
201904210800	4 mn
201904210801	3 mn
201904210802	2 mn
201904210803	0 mn
201904210804	Train a l'approche
201904210805	6 mn
201904210806	5 mn
201904210807	4 mn
201904210808	3 mn
201904210809	2 mn
201904210810	1 mn
201904210811	0 mn
201904210812	Train a quai
201904210813	5 mn
201904210814	5 mn
201904210815	4 mn
201904210816	3 mn
201904210817	2 mn
201904210818	0 mn
201904210819	Train a quai
201904210820	6 mn
201904210822	5 mn
201904210823	4 mn
201904210824	3 mn
201904210825	2 mn
201904210826	1 mn
201904210827	0 mn
201904210828	Train a quai
201904210829	4 mn
201904210830	4 mn
201904210831	3 mn
201904210832	2 mn
201904210833	0 mn
201904210834	Train a quai
201904210835	6 mn
201904210836	5 mn
201904210837	4 mn
201904210838	3 mn
201904210839	2 mn
201904210840	1 mn
201904210841	Train a l'approche
201904210842	5 mn
201904210843	5 mn
201904210844	3 mn
201904210845	2 mn
201904210846	0 mn
201904210847	0 mn
201904210848	5 mn
