201904210749	6 mn
201904210750	5 mn
201904210751	3 mn
201904210752	2 mn
201904210753	2 mn
201904210754	0 mn
201904210755	Train a l'approche
201904210756	Train retarde
201904210757	5 mn
201904210758	4 mn
201904210759	3 mn
201904210800	2 mn
201904210801	1 mn
201904210802	0 mn
201904210804	4 mn
201904210805	3 mn
201904210806	3 mn
201904210807	2 mn
201904210808	0 mn
201904210809	Train a l'approche
201904210810	4 mn
201904210811	3 mn
201904210812	2 mn
201904210813	1 mn
201904210814	Train a l'approche
201904210815	6 mn
201904210816	5 mn
201904210817	3 mn
201904210818	2 mn
201904210819	3 mn
201904210820	1 mn
201904210821	Train a l'approche
201904210822	5 mn
201904210823	4 mn
201904210824	3 mn
201904210825	2 mn
201904210826	2 mn
201904210827	0 mn
201904210828	Train a l'approche
201904210829	5 mn
201904210830	4 mn
201904210831	3 mn
201904210832	3 mn
201904210833	1 mn
201904210834	Train a l'approche
201904210835	6 mn
201904210836	4 mn
201904210837	3 mn
201904210838	2 mn
201904210839	1 mn
201904210840	0 mn
201904210841	Train a l'approche
201904210842	5 mn
201904210843	4 mn
201904210844	2 mn
201904210845	1 mn
201904210846	1 mn
201904210847	0 mn
201904210848	Train a quai
