201904210749	6 mn
201904210750	7 mn
201904210751	5 mn
201904210752	4 mn
201904210753	4 mn
201904210754	3 mn
201904210755	2 mn
201904210756	1 mn
201904210757	1 mn
201904210758	Train a quai
201904210759	2 mn
201904210800	Train a l'approche
201904210801	6 mn
201904210802	5 mn
201904210804	3 mn
201904210805	3 mn
201904210806	1 mn
201904210807	0 mn
201904210808	Train a quai
201904210809	5 mn
201904210810	4 mn
201904210811	3 mn
201904210812	1 mn
201904210813	0 mn
201904210814	Train a quai
201904210815	5 mn
201904210816	5 mn
201904210817	4 mn
201904210818	3 mn
201904210819	1 mn
201904210820	0 mn
201904210821	Train a quai
201904210822	5 mn
201904210823	3 mn
201904210824	2 mn
201904210825	1 mn
201904210826	0 mn
201904210827	Train a l'approche
201904210828	6 mn
201904210829	5 mn
201904210830	4 mn
201904210831	4 mn
201904210832	3 mn
201904210833	1 mn
201904210834	0 mn
201904210835	Train a quai
201904210836	4 mn
201904210837	3 mn
201904210838	1 mn
201904210839	1 mn
201904210840	Train a l'approche
201904210841	5 mn
201904210842	4 mn
201904210843	4 mn
201904210844	2 mn
201904210845	1 mn
201904210846	0 mn
201904210847	0 mn
201904210848	3 mn
