201904210749	2 mn
201904210750	1 mn
201904210751	1 mn
201904210752	Train a quai
201904210753	3 mn
201904210754	2 mn
201904210755	1 mn
201904210756	1 mn
201904210757	Train a quai
201904210758	4 mn
201904210759	3 mn
201904210800	2 mn
201904210801	1 mn
201904210802	0 mn
201904210804	4 mn
201904210805	4 mn
201904210806	4 mn
201904210807	4 mn
201904210808	3 mn
201904210809	2 mn
201904210810	2 mn
201904210811	2 mn
201904210812	1 mn
201904210813	1 mn
201904210814	Train a quai
201904210815	2 mn
201904210816	1 mn
201904210817	Train a quai
201904210818	4 mn
201904210819	3 mn
201904210820	2 mn
201904210821	1 mn
201904210822	Train a l'approche
201904210823	5 mn
201904210824	3 mn
201904210825	2 mn
201904210826	2 mn
201904210827	1 mn
201904210828	Train a quai
201904210829	3 mn
201904210830	2 mn
201904210831	1 mn
201904210832	Train a l'approche
201904210833	5 mn
201904210834	4 mn
201904210835	3 mn
201904210836	2 mn
201904210837	1 mn
201904210838	Train a l'approche
201904210839	6 mn
201904210840	5 mn
201904210841	4 mn
201904210842	3 mn
201904210843	2 mn
201904210844	1 mn
201904210845	Train a l'approche
201904210846	5 mn
201904210847	4 mn
201904210848	2 mn
