201904210749	1 mn
201904210750	1 mn
201904210751	Train a quai
201904210752	3 mn
201904210753	2 mn
201904210754	1 mn
201904210755	0 mn
201904210756	Train a quai
201904210757	3 mn
201904210758	2 mn
201904210759	1 mn
201904210800	0 mn
201904210801	Train a quai
201904210802	3 mn
201904210804	2 mn
201904210804	1 mn
201904210805	0 mn
201904210806	Train a quai
201904210807	3 mn
201904210808	2 mn
201904210809	1 mn
201904210810	0 mn
201904210812	4 mn
201904210812	3 mn
201904210813	2 mn
201904210814	1 mn
201904210816	0 mn
201904210817	Train a quai
201904210817	3 mn
201904210819	2 mn
201904210820	1 mn
201904210821	0 mn
201904210822	4 mn
201904210823	4 mn
201904210824	3 mn
201904210825	1 mn
201904210826	0 mn
201904210827	4 mn
201904210828	2 mn
201904210829	2 mn
201904210830	1 mn
201904210831	Train a l'approche
201904210832	4 mn
201904210833	3 mn
201904210834	2 mn
201904210835	2 mn
201904210836	1 mn
201904210837	Train a l'approche
201904210838	5 mn
201904210839	2 mn
201904210840	2 mn
201904210841	1 mn
201904210842	Train a quai
201904210843	4 mn
201904210844	2 mn
201904210845	2 mn
201904210846	1 mn
201904210847	Train a l'approche
201904210848	3 mn
