201904210749	1 mn
201904210750	Train a quai
201904210751	3 mn
201904210752	2 mn
201904210753	1 mn
201904210754	Train a l'approche
201904210755	5 mn
201904210756	4 mn
201904210757	3 mn
201904210758	2 mn
201904210759	1 mn
201904210800	0 mn
201904210801	2 mn
201904210802	1 mn
201904210803	Train a quai
201904210804	4 mn
201904210805	3 mn
201904210806	2 mn
201904210807	2 mn
201904210808	1 mn
201904210809	Train a l'approche
201904210810	3 mn
201904210812	2 mn
201904210812	1 mn
201904210813	Train a l'approche
201904210814	4 mn
201904210815	3 mn
201904210816	2 mn
201904210817	1 mn
201904210818	Train a l'approche
201904210819	4 mn
201904210821	3 mn
201904210822	3 mn
201904210823	1 mn
201904210824	Train a l'approche
201904210825	4 mn
201904210826	3 mn
201904210827	2 mn
201904210828	1 mn
201904210829	Train a l'approche
201904210830	6 mn
201904210831	4 mn
201904210832	3 mn
201904210833	2 mn
201904210834	1 mn
201904210835	0 mn
201904210836	0 mn
201904210837	Train a quai
201904210838	2 mn
201904210839	1 mn
201904210840	Train a l'approche
201904210841	7 mn
201904210842	4 mn
201904210843	3 mn
201904210844	2 mn
201904210845	1 mn
201904210846	Train a l'approche
201904210847	0 mn
201904210848	1 mn
