201904210749	0 mn
201904210750	Train a quai
201904210751	3 mn
201904210752	3 mn
201904210753	1 mn
201904210754	0 mn
201904210755	Train a quai
201904210756	3 mn
201904210757	2 mn
201904210758	1 mn
201904210759	0 mn
201904210800	Train a quai
201904210802	2 mn
201904210803	1 mn
201904210804	Train a l'approche
201904210805	Train a quai
201904210806	3 mn
201904210807	2 mn
201904210808	1 mn
201904210809	0 mn
201904210810	Train a quai
201904210811	1 mn
201904210812	Train a l'approche
201904210813	4 mn
201904210814	4 mn
201904210815	3 mn
201904210816	1 mn
201904210817	0 mn
201904210818	Train a l'approche
201904210819	1 mn
201904210820	Train a l'approche
201904210821	3 mn
201904210822	2 mn
201904210823	1 mn
201904210824	0 mn
201904210825	Train a quai
201904210826	2 mn
201904210827	1 mn
201904210828	0 mn
201904210829	Train a quai
201904210830	1 mn
201904210831	0 mn
201904210832	Train a quai
201904210833	0 mn
201904210834	Train a quai
201904210835	2 mn
201904210836	1 mn
201904210837	0 mn
201904210838	Train a quai
201904210839	1 mn
201904210840	0 mn
201904210841	Train a quai
201904210842	2 mn
201904210843	1 mn
201904210844	0 mn
201904210845	Train a quai
201904210846	2 mn
201904210847	0 mn
201904210848	Train a quai
