201904210749	1 mn
201904210750	0 mn
201904210751	Train a quai
201904210752	6 mn
201904210753	5 mn
201904210754	5 mn
201904210755	3 mn
201904210756	1 mn
201904210757	0 mn
201904210758	Train a l'approche
201904210759	6 mn
201904210800	6 mn
201904210801	4 mn
201904210802	3 mn
201904210804	1 mn
201904210805	0 mn
201904210806	Train a l'approche
201904210807	4 mn
201904210808	3 mn
201904210809	1 mn
201904210810	0 mn
201904210811	Train a l'approche
201904210812	5 mn
201904210813	4 mn
201904210814	3 mn
201904210815	2 mn
201904210816	1 mn
201904210817	Train a l'approche
201904210818	5 mn
201904210819	4 mn
201904210820	4 mn
201904210821	3 mn
201904210822	1 mn
201904210823	0 mn
201904210824	Train a quai
201904210825	4 mn
201904210826	4 mn
201904210827	3 mn
201904210828	1 mn
201904210829	0 mn
201904210830	Train a quai
201904210831	4 mn
201904210832	4 mn
201904210833	2 mn
201904210834	1 mn
201904210835	0 mn
201904210836	Train a quai
201904210837	4 mn
201904210838	4 mn
201904210839	3 mn
201904210840	1 mn
201904210841	0 mn
201904210842	5 mn
201904210843	4 mn
201904210844	3 mn
201904210845	1 mn
201904210846	0 mn
201904210847	1 mn
201904210848	6 mn
