201904210749	4 mn
201904210750	3 mn
201904210751	2 mn
201904210752	1 mn
201904210753	0 mn
201904210754	Train a quai
201904210755	2 mn
201904210756	1 mn
201904210757	0 mn
201904210758	Train a quai
201904210759	8 mn
201904210800	7 mn
201904210801	6 mn
201904210802	5 mn
201904210804	3 mn
201904210805	3 mn
201904210806	3 mn
201904210807	3 mn
201904210808	3 mn
201904210809	1 mn
201904210810	0 mn
201904210811	Train a quai
201904210812	2 mn
201904210813	2 mn
201904210814	1 mn
201904210815	Train a l'approche
201904210816	7 mn
201904210817	5 mn
201904210818	4 mn
201904210819	3 mn
201904210820	3 mn
201904210821	2 mn
201904210822	1 mn
201904210823	Train a l'approche
201904210824	7 mn
201904210825	5 mn
201904210826	4 mn
201904210827	3 mn
201904210828	2 mn
201904210829	1 mn
201904210830	Train a l'approche
201904210831	4 mn
201904210832	3 mn
201904210833	2 mn
201904210834	1 mn
201904210835	Train a quai
201904210836	2 mn
201904210837	2 mn
201904210838	0 mn
201904210839	Train a quai
201904210840	4 mn
201904210841	3 mn
201904210842	2 mn
201904210843	1 mn
201904210844	Train a l'approche
201904210845	1 mn
201904210846	0 mn
201904210847	Train a quai
201904210848	4 mn
