201904210749	2 mn
201904210750	1 mn
201904210751	Train a l'approche
201904210752	3 mn
201904210753	3 mn
201904210754	1 mn
201904210755	0 mn
201904210756	Train a quai
201904210757	3 mn
201904210758	3 mn
201904210759	1 mn
201904210800	Train a l'approche
201904210801	3 mn
201904210802	2 mn
201904210804	1 mn
201904210805	Train a l'approche
201904210806	4 mn
201904210807	4 mn
201904210808	2 mn
201904210809	1 mn
201904210810	Train a l'approche
201904210811	2 mn
201904210812	1 mn
201904210813	1 mn
201904210814	Train a quai
201904210815	3 mn
201904210816	3 mn
201904210817	1 mn
201904210818	Train a l'approche
201904210819	2 mn
201904210820	1 mn
201904210821	0 mn
201904210822	3 mn
201904210823	2 mn
201904210824	1 mn
201904210825	0 mn
201904210826	Train a quai
201904210827	1 mn
201904210828	0 mn
201904210829	3 mn
201904210830	1 mn
201904210831	1 mn
201904210832	Train a quai
201904210833	4 mn
201904210834	2 mn
201904210835	1 mn
201904210836	Train a l'approche
201904210837	3 mn
201904210838	2 mn
201904210839	1 mn
201904210840	0 mn
201904210841	Train a quai
201904210842	2 mn
201904210843	1 mn
201904210844	Train a l'approche
201904210845	3 mn
201904210846	1 mn
201904210847	1 mn
201904210848	3 mn
