201904210749	6 mn
201904210750	6 mn
201904210751	3 mn
201904210752	3 mn
201904210753	2 mn
201904210754	2 mn
201904210755	1 mn
201904210756	1 mn
201904210757	5 mn
201904210758	3 mn
201904210759	2 mn
201904210800	1 mn
201904210801	0 mn
201904210802	Train a l'approche
201904210804	6 mn
201904210805	5 mn
201904210806	3 mn
201904210807	2 mn
201904210808	2 mn
201904210809	1 mn
201904210810	Train a l'approche
201904210811	6 mn
201904210812	5 mn
201904210813	3 mn
201904210814	2 mn
201904210815	2 mn
201904210816	1 mn
201904210817	Train a l'approche
201904210818	4 mn
201904210819	3 mn
201904210820	2 mn
201904210821	1 mn
201904210822	Train a l'approche
201904210823	5 mn
201904210824	4 mn
201904210825	3 mn
201904210826	2 mn
201904210827	1 mn
201904210828	1 mn
201904210829	6 mn
201904210830	5 mn
201904210831	3 mn
201904210832	2 mn
201904210833	2 mn
201904210834	1 mn
201904210835	Train a quai
201904210836	4 mn
201904210837	4 mn
201904210838	2 mn
201904210839	1 mn
201904210840	0 mn
201904210841	6 mn
201904210842	5 mn
201904210843	4 mn
201904210844	2 mn
201904210845	1 mn
201904210846	1 mn
201904210847	Train a quai
201904210848	4 mn
