201904210749	Train a l'approche
201904210750	2 mn
201904210751	1 mn
201904210752	Train a l'approche
201904210753	5 mn
201904210754	4 mn
201904210755	3 mn
201904210756	2 mn
201904210757	1 mn
201904210758	0 mn
201904210759	Train a quai
201904210800	6 mn
201904210801	4 mn
201904210802	3 mn
201904210804	2 mn
201904210805	1 mn
201904210806	Train a l'approche
201904210807	6 mn
201904210808	5 mn
201904210809	4 mn
201904210810	3 mn
201904210811	2 mn
201904210812	1 mn
201904210813	1 mn
201904210814	Train a quai
201904210815	5 mn
201904210816	2 mn
201904210817	2 mn
201904210818	1 mn
201904210819	Train a l'approche
201904210820	6 mn
201904210821	5 mn
201904210822	4 mn
201904210823	3 mn
201904210824	2 mn
201904210825	1 mn
201904210826	0 mn
201904210827	Train a quai
201904210828	5 mn
201904210829	4 mn
201904210830	2 mn
201904210831	1 mn
201904210832	Train a l'approche
201904210833	5 mn
201904210834	4 mn
201904210835	3 mn
201904210836	2 mn
201904210837	1 mn
201904210838	1 mn
201904210839	Train a quai
201904210840	5 mn
201904210841	4 mn
201904210842	4 mn
201904210843	2 mn
201904210844	2 mn
201904210845	1 mn
201904210846	Train a l'approche
201904210847	5 mn
201904210848	4 mn
