201904210749	2 mn
201904210750	1 mn
201904210751	Train a l'approche
201904210752	6 mn
201904210753	5 mn
201904210754	3 mn
201904210755	3 mn
201904210756	2 mn
201904210757	1 mn
201904210758	Train a l'approche
201904210759	6 mn
201904210800	3 mn
201904210801	2 mn
201904210802	1 mn
201904210804	Train a quai
201904210805	4 mn
201904210806	3 mn
201904210807	3 mn
201904210808	2 mn
201904210809	1 mn
201904210810	Train a l'approche
201904210811	5 mn
201904210812	4 mn
201904210813	3 mn
201904210814	2 mn
201904210815	1 mn
201904210816	1 mn
201904210817	Train a quai
201904210818	4 mn
201904210819	3 mn
201904210820	2 mn
201904210821	1 mn
201904210822	0 mn
201904210823	Train a quai
201904210824	4 mn
201904210825	3 mn
201904210826	2 mn
201904210827	1 mn
201904210828	0 mn
201904210829	Train a quai
201904210830	4 mn
201904210831	3 mn
201904210832	2 mn
201904210833	1 mn
201904210834	0 mn
201904210835	Train a quai
201904210836	4 mn
201904210837	3 mn
201904210838	2 mn
201904210839	1 mn
201904210840	Train a l'approche
201904210841	5 mn
201904210842	4 mn
201904210843	3 mn
201904210844	3 mn
201904210845	2 mn
201904210846	1 mn
201904210847	Train a l'approche
201904210848	4 mn
