201904210749	2 mn
201904210750	1 mn
201904210751	0 mn
201904210752	Train a quai
201904210753	4 mn
201904210754	4 mn
201904210755	3 mn
201904210756	2 mn
201904210757	1 mn
201904210758	0 mn
201904210759	5 mn
201904210800	4 mn
201904210801	3 mn
201904210802	2 mn
201904210804	0 mn
201904210805	Train a l'approche
201904210806	Train a l'approche
201904210807	Train a l'approche
201904210808	Train a quai
201904210809	3 mn
201904210810	1 mn
201904210811	0 mn
201904210812	Train a quai
201904210813	5 mn
201904210814	4 mn
201904210815	3 mn
201904210816	3 mn
201904210817	1 mn
201904210818	0 mn
201904210819	5 mn
201904210820	4 mn
201904210821	4 mn
201904210822	2 mn
201904210823	1 mn
201904210824	Train a l'approche
201904210825	5 mn
201904210826	5 mn
201904210827	3 mn
201904210828	2 mn
201904210829	1 mn
201904210830	1 mn
201904210831	Train a quai
201904210832	4 mn
201904210833	3 mn
201904210834	3 mn
201904210835	1 mn
201904210836	1 mn
201904210837	Train a l'approche
201904210838	5 mn
201904210839	4 mn
201904210840	4 mn
201904210841	4 mn
201904210842	3 mn
201904210843	2 mn
201904210844	1 mn
201904210845	Train a l'approche
201904210846	Train a quai
201904210847	3 mn
201904210848	2 mn
