201904210749	4 mn
201904210750	4 mn
201904210751	2 mn
201904210752	1 mn
201904210753	0 mn
201904210754	Train a quai
201904210755	5 mn
201904210756	4 mn
201904210757	3 mn
201904210758	2 mn
201904210759	1 mn
201904210800	1 mn
201904210801	Train a quai
201904210802	4 mn
201904210804	2 mn
201904210805	2 mn
201904210806	2 mn
201904210807	2 mn
201904210808	1 mn
201904210809	0 mn
201904210810	Train a quai
201904210811	Train a quai
201904210812	Train a quai
201904210813	2 mn
201904210814	1 mn
201904210815	1 mn
201904210816	Train a quai
201904210817	8 mn
201904210818	7 mn
201904210819	5 mn
201904210820	5 mn
201904210821	5 mn
201904210822	4 mn
201904210823	4 mn
201904210824	2 mn
201904210825	1 mn
201904210826	1 mn
201904210827	Train a l'approche
201904210828	1 mn
201904210829	0 mn
201904210830	Train a quai
201904210831	Train a l'approche
201904210832	4 mn
201904210833	2 mn
201904210834	1 mn
201904210835	0 mn
201904210836	Train a quai
201904210837	Train a quai
201904210838	Train a quai
201904210839	4 mn
201904210840	4 mn
201904210841	2 mn
201904210842	1 mn
201904210843	1 mn
201904210844	0 mn
201904210845	3 mn
201904210846	2 mn
201904210847	2 mn
201904210848	Train a l'approche
