201904210749	1 mn
201904210750	0 mn
201904210751	Train a quai
201904210752	2 mn
201904210753	1 mn
201904210754	0 mn
201904210755	Train a quai
201904210756	4 mn
201904210757	3 mn
201904210758	2 mn
201904210759	1 mn
201904210800	0 mn
201904210801	Train a quai
201904210802	Train a quai
201904210804	4 mn
201904210805	3 mn
201904210805	2 mn
201904210807	2 mn
201904210808	2 mn
201904210808	Train a l'approche
201904210809	Train a quai
201904210810	Train a l'approche
201904210812	2 mn
201904210813	1 mn
201904210814	Train a l'approche
201904210815	2 mn
201904210816	2 mn
201904210817	Train a l'approche
201904210818	Train a quai
201904210819	3 mn
201904210820	2 mn
201904210821	Train a l'approche
201904210822	4 mn
201904210823	3 mn
201904210824	2 mn
201904210825	1 mn
201904210826	Train a l'approche
201904210827	5 mn
201904210828	3 mn
201904210829	2 mn
201904210830	2 mn
201904210831	0 mn
201904210832	Train a quai
201904210833	1 mn
201904210834	1 mn
201904210835	Train a l'approche
201904210836	3 mn
201904210837	2 mn
201904210838	1 mn
201904210839	0 mn
201904210840	Train a quai
201904210841	3 mn
201904210842	2 mn
201904210843	2 mn
201904210844	1 mn
201904210845	0 mn
201904210846	Train a quai
201904210847	Train a l'approche
201904210848	Train a l'approche
