201904210749	1 mn
201904210750	Train a l'approche
201904210751	4 mn
201904210752	3 mn
201904210753	2 mn
201904210754	0 mn
201904210755	Train a l'approche
201904210756	3 mn
201904210757	3 mn
201904210758	2 mn
201904210759	1 mn
201904210800	Train a l'approche
201904210802	3 mn
201904210803	2 mn
201904210804	0 mn
201904210805	Train a l'approche
201904210806	4 mn
201904210807	3 mn
201904210808	2 mn
201904210809	1 mn
201904210810	0 mn
201904210811	Train a quai
201904210812	2 mn
201904210813	1 mn
201904210814	Train a l'approche
201904210815	4 mn
201904210816	3 mn
201904210817	2 mn
201904210818	1 mn
201904210819	0 mn
201904210820	Train a quai
201904210821	0 mn
201904210822	Train a l'approche
201904210823	5 mn
201904210824	4 mn
201904210825	4 mn
201904210826	2 mn
201904210827	1 mn
201904210828	0 mn
201904210829	1 mn
201904210830	Train a l'approche
201904210831	3 mn
201904210832	2 mn
201904210833	1 mn
201904210834	0 mn
201904210835	Train a quai
201904210836	2 mn
201904210837	1 mn
201904210838	0 mn
201904210839	2 mn
201904210840	1 mn
201904210841	0 mn
201904210842	Train a quai
201904210843	0 mn
201904210844	Train a quai
201904210845	2 mn
201904210846	2 mn
201904210847	0 mn
201904210848	Train a quai
