201904210749	1 mn
201904210750	0 mn
201904210751	2 mn
201904210752	1 mn
201904210753	Train a quai
201904210754	7 mn
201904210755	6 mn
201904210756	4 mn
201904210757	3 mn
201904210758	2 mn
201904210759	1 mn
201904210800	0 mn
201904210801	7 mn
201904210802	6 mn
201904210804	4 mn
201904210805	4 mn
201904210806	4 mn
201904210807	4 mn
201904210808	3 mn
201904210809	2 mn
201904210810	2 mn
201904210811	2 mn
201904210812	Train retarde
201904210813	1 mn
201904210814	Train a l'approche
201904210815	3 mn
201904210816	2 mn
201904210817	2 mn
201904210818	1 mn
201904210819	Train a quai
201904210820	2 mn
201904210821	2 mn
201904210822	2 mn
201904210823	2 mn
201904210824	1 mn
201904210825	Train a quai
201904210826	Train a quai
201904210827	7 mn
201904210828	7 mn
201904210829	5 mn
201904210830	5 mn
201904210831	3 mn
201904210832	2 mn
201904210833	1 mn
201904210834	Train a l'approche
201904210835	2 mn
201904210836	1 mn
201904210837	Train a l'approche
201904210838	2 mn
201904210839	1 mn
201904210840	0 mn
201904210841	3 mn
201904210842	2 mn
201904210843	2 mn
201904210844	1 mn
201904210845	Train a quai
201904210846	Train a quai
201904210847	4 mn
201904210848	3 mn
