service_id,date,exception_type
13099060,20200802,1
13099060,20200809,1
13099060,20200816,1
13099060,20200823,1
3099050,20200719,1
3099050,20200802,1
3099050,20200809,1
3099050,20200816,1
3099050,20200823,1
3099054,20200831,1
3099054,20200901,1
3099054,20200902,1
3099054,20200903,1
3099054,20200907,1
3099054,20200908,1
3099054,20200909,1
3099054,20200910,1
3099054,20200914,1
3099054,20200915,1
3099054,20200916,1
3099054,20200917,1
3099054,20200921,1
3099054,20200922,1
3099054,20200923,1
3099054,20200924,1
3099054,20200928,1
3099054,20200929,1
3099054,20200930,1
3099054,20201001,1
3099054,20201005,1
3099054,20201006,1
3099054,20201007,1
3099054,20201008,1
3099054,20201012,1
3099054,20201013,1
3099054,20201014,1
3099054,20201015,1
3099054,20201019,1
3099054,20201020,1
3099053,20200621,1
3099052,20200830,1
3099052,20200920,1
13099062,20200531,1
13099062,20200607,1
13099062,20200614,1
13099062,20200628,1
13099062,20200906,1
13099062,20200913,1
13099062,20201011,1
13099062,20201018,1
13099061,20200719,1
13099061,20200726,1
13099061,20200830,1
13099064,20200713,1
13099064,20200715,1
13099064,20200727,1
13099063,20200517,1
13099063,20200524,1
13099063,20200621,1
13099063,20200705,1
13099063,20200712,1
13099063,20200920,1
13099063,20200927,1
13099063,20201004,1
3179363,20200515,1
3179363,20200522,1
3179363,20200529,1
3179363,20200605,1
3179363,20200612,1
3179363,20200619,1
3179363,20200626,1
3179363,20200703,1
3179363,20200710,1
3179362,20200511,1
3179362,20200512,1
3179362,20200513,1
3179362,20200514,1
3179362,20200518,1
3179362,20200519,1
3179362,20200520,1
3179362,20200525,1
3179362,20200526,1
3179362,20200527,1
3179362,20200528,1
3179362,20200602,1
3179362,20200603,1
3179362,20200604,1
3179362,20200608,1
3179362,20200609,1
3179362,20200610,1
3179362,20200611,1
3179362,20200615,1
3179362,20200616,1
3179362,20200617,1
3179362,20200618,1
3179362,20200622,1
3179362,20200623,1
3179362,20200624,1
3179362,20200625,1
3179362,20200629,1
3179362,20200630,1
3179362,20200701,1
3179362,20200702,1
3179362,20200706,1
3179362,20200707,1
3179362,20200708,1
3179362,20200709,1
3181320,20200904,1
3181320,20200911,1
3181320,20200918,1
3181320,20200925,1
3181320,20201002,1
3181320,20201009,1
3181320,20201016,1
13099054,20200901,1
13099054,20200902,1
13099054,20200903,1
13099054,20200904,1
13099054,20200908,1
13099054,20200909,1
13099054,20200910,1
13099054,20200911,1
13099054,20200915,1
13099054,20200916,1
13099054,20200917,1
13099054,20200918,1
13099054,20200922,1
13099054,20200923,1
13099054,20200924,1
13099054,20200925,1
13099054,20200929,1
13099054,20200930,1
13099054,20201001,1
13099054,20201002,1
13099054,20201006,1
13099054,20201007,1
13099054,20201008,1
13099054,20201009,1
13099054,20201013,1
13099054,20201014,1
13099054,20201015,1
13099054,20201016,1
13099054,20201020,1
13099054,20201021,1
13158723,20200518,1
13158723,20200522,1
13158723,20200525,1
13158723,20200601,1
13158723,20200602,1
13158723,20200608,1
13158723,20200615,1
13158723,20200629,1
13158723,20200706,1
13158723,20200907,1
13158723,20200914,1
13158723,20200928,1
13158723,20201005,1
13158723,20201012,1
13158723,20201019,1
13099056,20200714,1
13099056,20200716,1
13099056,20200717,1
13099056,20200721,1
13099056,20200723,1
13099056,20200724,1
13099057,20200718,1
13099057,20200722,1
13099057,20200725,1
13099057,20200825,1
13099057,20200826,1
13099057,20200827,1
13099057,20200828,1
13099057,20200829,1
13099050,20200720,1
13099050,20200803,1
13099050,20200810,1
13099050,20200817,1
13099050,20200824,1
13099052,20200831,1
13099052,20200921,1
13099053,20200622,1
13179363,20200516,1
13179363,20200523,1
13179363,20200530,1
13179363,20200606,1
13179363,20200613,1
13179363,20200620,1
13179363,20200627,1
13179363,20200704,1
13179363,20200711,1
3183970,20200422,1
3183970,20200423,1
3183970,20200424,1
3183970,20200425,1
3183970,20200426,1
3183970,20200427,1
3183970,20200428,1
3183970,20200429,1
3183970,20200430,1
3183970,20200501,1
3183970,20200502,1
3183970,20200503,1
3183970,20200504,1
3183970,20200505,1
3183970,20200506,1
3183970,20200507,1
3183970,20200508,1
3183970,20200509,1
3183970,20200510,1
3099059,20200727,1
3099059,20200728,1
3099059,20200729,1
3099059,20200730,1
3099059,20200731,1
3099059,20200803,1
3099059,20200804,1
3099059,20200805,1
3099059,20200806,1
3099059,20200807,1
3099059,20200810,1
3099059,20200811,1
3099059,20200812,1
3099059,20200813,1
3099059,20200814,1
3099059,20200817,1
3099059,20200818,1
3099059,20200819,1
3099059,20200820,1
3099059,20200821,1
13181320,20200905,1
13181320,20200912,1
13181320,20200919,1
13181320,20200926,1
13181320,20201003,1
13181320,20201010,1
13181320,20201017,1
13179362,20200512,1
13179362,20200513,1
13179362,20200514,1
13179362,20200515,1
13179362,20200519,1
13179362,20200520,1
13179362,20200521,1
13179362,20200526,1
13179362,20200527,1
13179362,20200528,1
13179362,20200529,1
13179362,20200603,1
13179362,20200604,1
13179362,20200605,1
13179362,20200609,1
13179362,20200610,1
13179362,20200611,1
13179362,20200612,1
13179362,20200616,1
13179362,20200617,1
13179362,20200618,1
13179362,20200619,1
13179362,20200623,1
13179362,20200624,1
13179362,20200625,1
13179362,20200626,1
13179362,20200630,1
13179362,20200701,1
13179362,20200702,1
13179362,20200703,1
13179362,20200707,1
13179362,20200708,1
13179362,20200709,1
13179362,20200710,1
3158723,20200517,1
3158723,20200521,1
3158723,20200524,1
3158723,20200531,1
3158723,20200601,1
3158723,20200607,1
3158723,20200614,1
3158723,20200628,1
3158723,20200705,1
3158723,20200906,1
3158723,20200913,1
3158723,20200927,1
3158723,20201004,1
3158723,20201011,1
3158723,20201018,1
13099059,20200728,1
13099059,20200729,1
13099059,20200730,1
13099059,20200731,1
13099059,20200801,1
13099059,20200804,1
13099059,20200805,1
13099059,20200806,1
13099059,20200807,1
13099059,20200808,1
13099059,20200811,1
13099059,20200812,1
13099059,20200813,1
13099059,20200814,1
13099059,20200815,1
13099059,20200818,1
13099059,20200819,1
13099059,20200820,1
13099059,20200821,1
13099059,20200822,1
3099056,20200713,1
3099056,20200715,1
3099056,20200716,1
3099056,20200720,1
3099056,20200722,1
3099056,20200723,1
3099057,20200717,1
3099057,20200721,1
3099057,20200724,1
3099057,20200824,1
3099057,20200825,1
3099057,20200826,1
3099057,20200827,1
3099057,20200828,1
3099063,20200516,1
3099063,20200523,1
3099063,20200620,1
3099063,20200704,1
3099063,20200711,1
3099063,20200919,1
3099063,20200926,1
3099063,20201003,1
3099062,20200530,1
3099062,20200606,1
3099062,20200613,1
3099062,20200627,1
3099062,20200905,1
3099062,20200912,1
3099062,20201010,1
3099062,20201017,1
3099064,20200712,1
3099064,20200714,1
3099064,20200726,1
3099061,20200718,1
3099061,20200725,1
3099061,20200829,1
3099060,20200801,1
3099060,20200808,1
3099060,20200815,1
3099060,20200822,1
