201904210749	2 mn
201904210750	1 mn
201904210751	0 mn
201904210752	6 mn
201904210753	5 mn
201904210754	4 mn
201904210755	3 mn
201904210756	2 mn
201904210757	1 mn
201904210758	0 mn
201904210759	8 mn
201904210800	6 mn
201904210801	5 mn
201904210802	4 mn
201904210803	3 mn
201904210804	1 mn
201904210805	0 mn
201904210806	6 mn
201904210807	5 mn
201904210808	4 mn
201904210809	3 mn
201904210810	3 mn
201904210811	1 mn
201904210812	0 mn
201904210813	6 mn
201904210814	5 mn
201904210815	4 mn
201904210816	3 mn
201904210817	2 mn
201904210818	0 mn
201904210819	7 mn
201904210820	6 mn
201904210822	5 mn
201904210823	4 mn
201904210824	3 mn
201904210825	2 mn
201904210826	1 mn
201904210827	0 mn
201904210828	7 mn
201904210829	6 mn
201904210830	5 mn
201904210831	4 mn
201904210832	3 mn
201904210833	1 mn
201904210834	0 mn
201904210835	Train a l'approche
201904210836	4 mn
201904210837	4 mn
201904210838	3 mn
201904210839	2 mn
201904210840	0 mn
201904210841	7 mn
201904210842	6 mn
201904210843	6 mn
201904210844	4 mn
201904210845	3 mn
201904210846	3 mn
201904210847	3 mn
201904210848	0 mn
