201904210749	4 mn
201904210750	5 mn
201904210751	3 mn
201904210752	2 mn
201904210753	2 mn
201904210754	1 mn
201904210755	0 mn
201904210756	Train a quai
201904210757	1 mn
201904210758	0 mn
201904210759	Train a quai
201904210800	4 mn
201904210801	4 mn
201904210802	3 mn
201904210804	1 mn
201904210805	1 mn
201904210806	Train a l'approche
201904210807	4 mn
201904210808	3 mn
201904210809	3 mn
201904210810	2 mn
201904210811	1 mn
201904210812	Train a quai
201904210813	5 mn
201904210814	4 mn
201904210815	3 mn
201904210816	3 mn
201904210817	2 mn
201904210818	1 mn
201904210819	Train a quai
201904210820	4 mn
201904210821	3 mn
201904210822	3 mn
201904210823	1 mn
201904210824	Train a l'approche
201904210825	Train a quai
201904210826	7 mn
201904210827	5 mn
201904210828	4 mn
201904210829	3 mn
201904210830	2 mn
201904210831	2 mn
201904210832	1 mn
201904210833	Train a l'approche
201904210834	3 mn
201904210835	3 mn
201904210836	2 mn
201904210837	1 mn
201904210838	Train a l'approche
201904210839	6 mn
201904210840	4 mn
201904210841	3 mn
201904210842	2 mn
201904210843	2 mn
201904210844	0 mn
201904210845	Train a quai
201904210846	3 mn
201904210847	2 mn
201904210848	1 mn
