201904210749	1 mn
201904210750	1 mn
201904210751	Train a l'approche
201904210752	6 mn
201904210753	5 mn
201904210754	4 mn
201904210755	3 mn
201904210756	2 mn
201904210757	2 mn
201904210758	0 mn
201904210759	Train a l'approche
201904210801	6 mn
201904210802	5 mn
201904210803	4 mn
201904210804	2 mn
201904210805	3 mn
201904210806	1 mn
201904210807	Train a l'approche
201904210808	Train a quai
201904210809	5 mn
201904210810	3 mn
201904210811	2 mn
201904210812	1 mn
201904210813	Train a l'approche
201904210814	2 mn
201904210815	1 mn
201904210816	Train a l'approche
201904210817	Train a quai
201904210818	5 mn
201904210819	4 mn
201904210820	3 mn
201904210821	2 mn
201904210822	1 mn
201904210823	0 mn
201904210824	Train a quai
201904210825	6 mn
201904210826	5 mn
201904210827	4 mn
201904210828	3 mn
201904210829	2 mn
201904210830	0 mn
201904210831	Train a l'approche
201904210832	7 mn
201904210833	7 mn
201904210834	5 mn
201904210835	4 mn
201904210836	3 mn
201904210837	2 mn
201904210838	1 mn
201904210839	Train a l'approche
201904210840	Train a quai
201904210841	6 mn
201904210842	4 mn
201904210843	4 mn
201904210844	3 mn
201904210845	1 mn
201904210846	0 mn
201904210847	Train a quai
201904210848	6 mn
