201904210749	3 mn
201904210750	2 mn
201904210751	1 mn
201904210752	1 mn
201904210753	1 mn
201904210754	Train a quai
201904210755	3 mn
201904210756	2 mn
201904210757	1 mn
201904210758	0 mn
201904210759	4 mn
201904210800	3 mn
201904210801	2 mn
201904210803	1 mn
201904210804	0 mn
201904210805	0 mn
201904210806	Train a quai
201904210807	3 mn
201904210808	2 mn
201904210809	1 mn
201904210810	1 mn
201904210811	Train a l'approche
201904210812	3 mn
201904210813	2 mn
201904210814	1 mn
201904210815	Train a l'approche
201904210816	4 mn
201904210817	3 mn
201904210818	2 mn
201904210819	1 mn
201904210820	1 mn
201904210821	Train a quai
201904210822	4 mn
201904210823	2 mn
201904210824	1 mn
201904210825	Train a l'approche
201904210826	Train a quai
201904210827	3 mn
201904210828	2 mn
201904210829	1 mn
201904210830	Train a quai
201904210831	5 mn
201904210832	3 mn
201904210833	2 mn
201904210834	1 mn
201904210835	1 mn
201904210836	Train a quai
201904210837	3 mn
201904210838	2 mn
201904210839	1 mn
201904210840	Train a l'approche
201904210841	4 mn
201904210842	2 mn
201904210843	2 mn
201904210844	1 mn
201904210845	0 mn
201904210846	Train a l'approche
201904210847	2 mn
201904210848	1 mn
