201904210749	4 mn
201904210750	3 mn
201904210751	2 mn
201904210752	1 mn
201904210753	Train a l'approche
201904210754	4 mn
201904210755	3 mn
201904210756	2 mn
201904210757	1 mn
201904210758	0 mn
201904210759	Train a quai
201904210800	4 mn
201904210801	3 mn
201904210802	2 mn
201904210804	1 mn
201904210805	0 mn
201904210805	3 mn
201904210806	2 mn
201904210808	0 mn
201904210808	Train a quai
201904210809	4 mn
201904210810	3 mn
201904210812	2 mn
201904210812	0 mn
201904210813	4 mn
201904210814	3 mn
201904210816	3 mn
201904210817	2 mn
201904210818	0 mn
201904210819	Train a quai
201904210820	3 mn
201904210821	0 mn
201904210822	Train a l'approche
201904210823	4 mn
201904210824	3 mn
201904210825	2 mn
201904210826	1 mn
201904210827	0 mn
201904210828	Train a quai
201904210829	4 mn
201904210830	3 mn
201904210831	2 mn
201904210832	1 mn
201904210833	0 mn
201904210834	3 mn
201904210835	0 mn
201904210836	Train a quai
201904210837	3 mn
201904210838	1 mn
201904210839	0 mn
201904210840	Train a quai
201904210841	3 mn
201904210842	3 mn
201904210843	2 mn
201904210844	0 mn
201904210845	Train a quai
201904210846	4 mn
201904210847	3 mn
201904210848	2 mn
