201904210749	4 mn
201904210750	3 mn
201904210751	2 mn
201904210752	1 mn
201904210753	Train a quai
201904210754	2 mn
201904210755	2 mn
201904210756	1 mn
201904210757	Train a l'approche
201904210758	4 mn
201904210759	3 mn
201904210800	2 mn
201904210801	1 mn
201904210802	Train a l'approche
201904210804	10 mn
201904210805	8 mn
201904210806	8 mn
201904210807	6 mn
201904210808	5 mn
201904210809	5 mn
201904210810	4 mn
201904210811	2 mn
201904210812	2 mn
201904210813	1 mn
201904210814	Train a quai
201904210815	7 mn
201904210816	6 mn
201904210817	5 mn
201904210818	4 mn
201904210819	3 mn
201904210820	2 mn
201904210821	1 mn
201904210822	Train a quai
201904210823	7 mn
201904210824	6 mn
201904210825	5 mn
201904210826	4 mn
201904210827	3 mn
201904210828	2 mn
201904210829	1 mn
201904210830	Train a quai
201904210831	4 mn
201904210832	4 mn
201904210833	2 mn
201904210834	1 mn
201904210835	1 mn
201904210836	4 mn
201904210837	3 mn
201904210838	2 mn
201904210839	1 mn
201904210840	0 mn
201904210841	Train a quai
201904210842	7 mn
201904210843	6 mn
201904210844	5 mn
201904210845	4 mn
201904210846	2 mn
201904210847	2 mn
201904210848	0 mn
