201904210749	0 mn
201904210750	Train a quai
201904210751	7 mn
201904210752	6 mn
201904210753	5 mn
201904210754	4 mn
201904210755	2 mn
201904210756	1 mn
201904210757	1 mn
201904210758	Train a l'approche
201904210759	7 mn
201904210800	6 mn
201904210801	5 mn
201904210802	4 mn
201904210803	2 mn
201904210804	1 mn
201904210805	1 mn
201904210806	Train a l'approche
201904210807	6 mn
201904210808	5 mn
201904210809	6 mn
201904210810	4 mn
201904210811	2 mn
201904210812	1 mn
201904210813	0 mn
201904210814	Train a quai
201904210815	6 mn
201904210816	5 mn
201904210817	4 mn
201904210818	3 mn
201904210819	2 mn
201904210820	1 mn
201904210821	Train a l'approche
201904210822	6 mn
201904210823	5 mn
201904210825	4 mn
201904210826	3 mn
201904210827	2 mn
201904210828	1 mn
201904210829	Train a l'approche
201904210830	6 mn
201904210831	5 mn
201904210832	5 mn
201904210833	4 mn
201904210834	2 mn
201904210835	1 mn
201904210836	0 mn
201904210837	Train a quai
201904210838	4 mn
201904210839	2 mn
201904210840	2 mn
201904210841	1 mn
201904210842	Train a l'approche
201904210843	6 mn
201904210844	5 mn
201904210845	5 mn
201904210846	2 mn
201904210847	1 mn
201904210848	0 mn
