201904210749	1 mn
201904210750	1 mn
201904210751	Train a quai
201904210752	4 mn
201904210753	3 mn
201904210754	2 mn
201904210755	1 mn
201904210756	Train a l'approche
201904210757	5 mn
201904210758	4 mn
201904210759	3 mn
201904210800	2 mn
201904210801	1 mn
201904210802	1 mn
201904210803	Train a quai
201904210804	4 mn
201904210805	3 mn
201904210806	2 mn
201904210807	1 mn
201904210808	Train a l'approche
201904210809	3 mn
201904210810	2 mn
201904210811	1 mn
201904210812	1 mn
201904210813	Train a quai
201904210814	5 mn
201904210815	3 mn
201904210816	2 mn
201904210817	1 mn
201904210818	0 mn
201904210819	5 mn
201904210820	4 mn
201904210821	3 mn
201904210822	2 mn
201904210823	1 mn
201904210824	0 mn
201904210826	5 mn
201904210826	4 mn
201904210828	3 mn
201904210829	2 mn
201904210830	2 mn
201904210831	1 mn
201904210832	4 mn
201904210833	3 mn
201904210834	2 mn
201904210835	1 mn
201904210836	0 mn
201904210837	Train a quai
201904210838	3 mn
201904210839	2 mn
201904210840	1 mn
201904210841	0 mn
201904210842	4 mn
201904210843	4 mn
201904210844	3 mn
201904210845	2 mn
201904210846	1 mn
201904210847	1 mn
201904210848	5 mn
