201904210749	6 mn
201904210750	5 mn
201904210751	4 mn
201904210752	3 mn
201904210753	2 mn
201904210754	2 mn
201904210755	1 mn
201904210756	Train a l'approche
201904210757	7 mn
201904210758	6 mn
201904210759	5 mn
201904210800	3 mn
201904210801	2 mn
201904210802	1 mn
201904210804	0 mn
201904210805	Train a quai
201904210806	9 mn
201904210807	6 mn
201904210808	6 mn
201904210809	1 mn
201904210810	Train a quai
201904210811	3 mn
201904210812	2 mn
201904210813	1 mn
201904210814	Train a l'approche
201904210815	9 mn
201904210816	6 mn
201904210817	5 mn
201904210818	4 mn
201904210819	3 mn
201904210820	2 mn
201904210821	1 mn
201904210822	1 mn
201904210823	Train a l'approche
201904210824	7 mn
201904210825	6 mn
201904210826	6 mn
201904210827	4 mn
201904210828	3 mn
201904210829	3 mn
201904210830	1 mn
201904210831	2 mn
201904210832	Train a quai
201904210833	6 mn
201904210834	5 mn
201904210835	4 mn
201904210836	4 mn
201904210837	3 mn
201904210838	2 mn
201904210839	1 mn
201904210840	0 mn
201904210841	Train a quai
201904210842	1 mn
201904210843	Train a l'approche
201904210844	5 mn
201904210845	4 mn
201904210846	4 mn
201904210847	3 mn
201904210848	1 mn
