201904210749	2 mn
201904210750	1 mn
201904210751	0 mn
201904210752	Train a quai
201904210753	1 mn
201904210754	Train a quai
201904210755	5 mn
201904210756	5 mn
201904210757	3 mn
201904210758	2 mn
201904210759	1 mn
201904210800	Train a l'approche
201904210801	Train a quai
201904210802	1 mn
201904210804	Train a l'approche
201904210805	Train a quai
201904210806	Train a quai
201904210807	Train a quai
201904210808	10 mn
201904210809	8 mn
201904210810	7 mn
201904210811	6 mn
201904210812	4 mn
201904210813	4 mn
201904210814	3 mn
201904210815	2 mn
201904210816	1 mn
201904210817	0 mn
201904210818	3 mn
201904210819	3 mn
201904210820	1 mn
201904210821	1 mn
201904210822	Train a quai
201904210823	7 mn
201904210824	6 mn
201904210825	4 mn
201904210826	4 mn
201904210827	3 mn
201904210828	2 mn
201904210829	1 mn
201904210830	Train a l'approche
201904210831	5 mn
201904210832	4 mn
201904210833	3 mn
201904210834	3 mn
201904210835	1 mn
201904210836	1 mn
201904210837	Train a quai
201904210838	3 mn
201904210839	2 mn
201904210840	1 mn
201904210841	Train a l'approche
201904210842	3 mn
201904210843	1 mn
201904210844	1 mn
201904210845	Train a quai
201904210846	Train a quai
201904210847	Train a quai
201904210848	2 mn
