201904210749	2 mn
201904210750	1 mn
201904210751	Train a quai
201904210752	6 mn
201904210753	5 mn
201904210754	5 mn
201904210755	3 mn
201904210756	2 mn
201904210757	1 mn
201904210758	Train a l'approche
201904210759	6 mn
201904210800	6 mn
201904210801	5 mn
201904210802	3 mn
201904210804	2 mn
201904210805	2 mn
201904210806	2 mn
201904210807	2 mn
201904210808	1 mn
201904210809	Train a quai
201904210810	Train a quai
201904210811	Train a quai
201904210812	Train a quai
201904210813	3 mn
201904210814	2 mn
201904210815	1 mn
201904210816	0 mn
201904210817	4 mn
201904210818	2 mn
201904210819	1 mn
201904210820	Train a l'approche
201904210821	Train a quai
201904210822	Train a quai
201904210823	Train a quai
201904210824	7 mn
201904210825	6 mn
201904210826	6 mn
201904210827	5 mn
201904210828	5 mn
201904210829	3 mn
201904210830	3 mn
201904210831	1 mn
201904210832	Train a l'approche
201904210833	2 mn
201904210834	1 mn
201904210835	Train a quai
201904210836	2 mn
201904210837	1 mn
201904210838	Train a l'approche
201904210839	3 mn
201904210840	2 mn
201904210841	1 mn
201904210842	0 mn
201904210843	Train a quai
201904210844	5 mn
201904210845	4 mn
201904210846	3 mn
201904210847	2 mn
201904210848	1 mn
