201904210749	3 mn
201904210750	2 mn
201904210751	1 mn
201904210752	1 mn
201904210753	2 mn
201904210754	1 mn
201904210755	Train a l'approche
201904210756	7 mn
201904210757	4 mn
201904210758	3 mn
201904210759	2 mn
201904210800	1 mn
201904210801	1 mn
201904210802	Train a l'approche
201904210804	1 mn
201904210805	1 mn
201904210806	1 mn
201904210807	1 mn
201904210808	Train a l'approche
201904210809	9 mn
201904210810	8 mn
201904210811	8 mn
201904210812	6 mn
201904210813	6 mn
201904210814	4 mn
201904210815	3 mn
201904210816	2 mn
201904210817	1 mn
201904210818	0 mn
201904210819	4 mn
201904210820	3 mn
201904210821	2 mn
201904210822	1 mn
201904210823	Train a l'approche
201904210824	8 mn
201904210825	6 mn
201904210826	6 mn
201904210827	4 mn
201904210828	3 mn
201904210829	2 mn
201904210830	1 mn
201904210831	0 mn
201904210832	6 mn
201904210833	5 mn
201904210834	4 mn
201904210835	3 mn
201904210836	2 mn
201904210837	2 mn
201904210838	Train a l'approche
201904210839	3 mn
201904210840	2 mn
201904210841	2 mn
201904210842	0 mn
201904210843	Train a l'approche
201904210844	2 mn
201904210845	1 mn
201904210846	1 mn
201904210847	1 mn
201904210848	3 mn
