201904210749	Train a l'approche
201904210750	Train a quai
201904210751	7 mn
201904210752	7 mn
201904210753	5 mn
201904210754	4 mn
201904210755	3 mn
201904210756	2 mn
201904210757	1 mn
201904210758	0 mn
201904210759	Train a quai
201904210800	5 mn
201904210802	4 mn
201904210803	3 mn
201904210804	1 mn
201904210805	1 mn
201904210806	Train a l'approche
201904210807	Train a quai
201904210808	5 mn
201904210809	5 mn
201904210810	4 mn
201904210811	3 mn
201904210812	2 mn
201904210813	1 mn
201904210814	Train a l'approche
201904210815	8 mn
201904210816	6 mn
201904210817	5 mn
201904210818	4 mn
201904210819	3 mn
201904210820	2 mn
201904210821	1 mn
201904210822	0 mn
201904210823	Train a quai
201904210824	6 mn
201904210825	4 mn
201904210826	3 mn
201904210827	3 mn
201904210828	1 mn
201904210829	0 mn
201904210830	Train a l'approche
201904210831	6 mn
201904210832	5 mn
201904210833	4 mn
201904210834	3 mn
201904210835	2 mn
201904210836	1 mn
201904210837	0 mn
201904210838	Train a quai
201904210839	7 mn
201904210840	5 mn
201904210841	4 mn
201904210842	3 mn
201904210843	2 mn
201904210844	1 mn
201904210845	0 mn
201904210846	0 mn
201904210847	6 mn
201904210848	5 mn
