201904210749	0 mn
201904210750	8 mn
201904210751	8 mn
201904210752	6 mn
201904210753	5 mn
201904210754	5 mn
201904210755	4 mn
201904210756	2 mn
201904210757	1 mn
201904210758	1 mn
201904210759	Train a quai
201904210800	3 mn
201904210801	2 mn
201904210802	1 mn
201904210804	Train a quai
201904210805	5 mn
201904210806	5 mn
201904210807	5 mn
201904210808	4 mn
201904210809	4 mn
201904210810	2 mn
201904210811	2 mn
201904210812	2 mn
201904210813	1 mn
201904210814	0 mn
201904210815	5 mn
201904210816	4 mn
201904210817	4 mn
201904210818	2 mn
201904210819	1 mn
201904210820	0 mn
201904210821	0 mn
201904210822	Train a quai
201904210823	Train retarde
201904210824	3 mn
201904210825	1 mn
201904210826	1 mn
201904210827	Train a quai
201904210828	2 mn
201904210829	1 mn
201904210830	Train a quai
201904210831	4 mn
201904210832	2 mn
201904210833	1 mn
201904210834	1 mn
201904210835	Train a quai
201904210836	2 mn
201904210837	1 mn
201904210838	0 mn
201904210839	Train a quai
201904210840	6 mn
201904210841	4 mn
201904210842	2 mn
201904210843	1 mn
201904210844	0 mn
201904210845	Train a quai
201904210846	6 mn
201904210847	5 mn
201904210848	4 mn
