201904210749	2 mn
201904210750	1 mn
201904210751	0 mn
201904210752	Train a quai
201904210753	6 mn
201904210754	5 mn
201904210755	4 mn
201904210756	3 mn
201904210757	2 mn
201904210758	1 mn
201904210759	Train a l'approche
201904210800	7 mn
201904210801	6 mn
201904210802	5 mn
201904210803	4 mn
201904210804	3 mn
201904210805	2 mn
201904210806	0 mn
201904210807	Train a l'approche
201904210808	7 mn
201904210809	6 mn
201904210810	5 mn
201904210811	5 mn
201904210812	4 mn
201904210813	3 mn
201904210814	1 mn
201904210815	Train a l'approche
201904210816	7 mn
201904210817	6 mn
201904210818	5 mn
201904210819	4 mn
201904210820	3 mn
201904210821	2 mn
201904210822	1 mn
201904210823	1 mn
201904210825	Train a l'approche
201904210826	7 mn
201904210827	6 mn
201904210828	2 mn
201904210829	2 mn
201904210830	Train a l'approche
201904210831	6 mn
201904210832	5 mn
201904210833	4 mn
201904210834	1 mn
201904210835	0 mn
201904210836	Train a l'approche
201904210837	4 mn
201904210838	3 mn
201904210839	2 mn
201904210840	1 mn
201904210841	0 mn
201904210842	Train a quai
201904210843	4 mn
201904210844	4 mn
201904210845	2 mn
201904210846	1 mn
201904210847	1 mn
201904210848	4 mn
