201904210749	3 mn
201904210750	3 mn
201904210751	2 mn
201904210752	0 mn
201904210753	Train a quai
201904210754	5 mn
201904210755	4 mn
201904210756	3 mn
201904210757	2 mn
201904210758	0 mn
201904210759	Train a l'approche
201904210800	4 mn
201904210801	3 mn
201904210802	2 mn
201904210804	0 mn
201904210804	Train a quai
201904210805	5 mn
201904210806	3 mn
201904210808	3 mn
201904210808	2 mn
201904210809	0 mn
201904210810	Train a quai
201904210812	3 mn
201904210812	3 mn
201904210813	2 mn
201904210814	0 mn
201904210816	Train a quai
201904210817	4 mn
201904210818	3 mn
201904210819	3 mn
201904210820	2 mn
201904210821	1 mn
201904210822	Train a l'approche
201904210823	3 mn
201904210824	2 mn
201904210825	1 mn
201904210826	0 mn
201904210827	6 mn
201904210828	4 mn
201904210829	3 mn
201904210830	2 mn
201904210831	1 mn
201904210832	0 mn
201904210833	5 mn
201904210834	4 mn
201904210835	3 mn
201904210836	3 mn
201904210837	1 mn
201904210838	Train a l'approche
201904210839	6 mn
201904210840	4 mn
201904210841	3 mn
201904210842	2 mn
201904210843	0 mn
201904210844	Train a l'approche
201904210845	3 mn
201904210846	2 mn
201904210847	0 mn
201904210848	Train a quai
