201904210749	2 mn
201904210750	1 mn
201904210751	Train a l'approche
201904210752	3 mn
201904210753	3 mn
201904210754	2 mn
201904210755	1 mn
201904210756	Train a l'approche
201904210757	3 mn
201904210758	2 mn
201904210759	1 mn
201904210800	Train a l'approche
201904210801	3 mn
201904210802	3 mn
201904210804	1 mn
201904210805	0 mn
201904210806	Train a l'approche
201904210807	2 mn
201904210808	1 mn
201904210809	1 mn
201904210810	Train a quai
201904210811	3 mn
201904210812	2 mn
201904210813	1 mn
201904210814	Train a l'approche
201904210815	2 mn
201904210816	1 mn
201904210817	0 mn
201904210818	Train a quai
201904210819	2 mn
201904210820	1 mn
201904210821	Train a l'approche
201904210822	2 mn
201904210823	1 mn
201904210824	Train a l'approche
201904210825	2 mn
201904210826	1 mn
201904210827	2 mn
201904210828	Train a quai
201904210829	2 mn
201904210830	2 mn
201904210831	0 mn
201904210832	Train a l'approche
201904210833	3 mn
201904210834	2 mn
201904210835	1 mn
201904210836	0 mn
201904210837	3 mn
201904210838	2 mn
201904210839	1 mn
201904210840	Train a l'approche
201904210841	2 mn
201904210842	2 mn
201904210843	Train a l'approche
201904210844	5 mn
201904210845	2 mn
201904210846	2 mn
201904210847	1 mn
201904210848	2 mn
