201904210749	5 mn
201904210750	4 mn
201904210751	2 mn
201904210752	2 mn
201904210753	0 mn
201904210754	10 mn
201904210755	9 mn
201904210756	9 mn
201904210757	7 mn
201904210758	6 mn
201904210759	5 mn
201904210800	4 mn
201904210801	4 mn
201904210802	2 mn
201904210804	1 mn
201904210805	Train a l'approche
201904210806	Train a l'approche
201904210807	Train a l'approche
201904210808	Train a quai
201904210809	1 mn
201904210810	1 mn
201904210811	Train a quai
201904210812	6 mn
201904210813	5 mn
201904210814	4 mn
201904210815	2 mn
201904210816	3 mn
201904210817	1 mn
201904210818	Train a quai
201904210819	9 mn
201904210820	7 mn
201904210821	7 mn
201904210822	5 mn
201904210823	4 mn
201904210824	2 mn
201904210825	2 mn
201904210826	2 mn
201904210827	Train a l'approche
201904210828	4 mn
201904210829	2 mn
201904210830	3 mn
201904210831	2 mn
201904210832	2 mn
201904210833	1 mn
201904210834	Train a l'approche
201904210835	5 mn
201904210836	5 mn
201904210837	4 mn
201904210838	2 mn
201904210839	1 mn
201904210840	0 mn
201904210841	6 mn
201904210842	5 mn
201904210843	5 mn
201904210844	3 mn
201904210845	2 mn
201904210846	2 mn
201904210847	1 mn
201904210848	Train a l'approche
