201904210749	1 mn
201904210750	1 mn
201904210751	Train a quai
201904210752	5 mn
201904210753	4 mn
201904210754	3 mn
201904210755	2 mn
201904210756	1 mn
201904210757	0 mn
201904210758	Train a quai
201904210759	3 mn
201904210800	2 mn
201904210801	1 mn
201904210802	0 mn
201904210803	Train a quai
201904210804	4 mn
201904210805	3 mn
201904210806	2 mn
201904210807	1 mn
201904210808	0 mn
201904210809	Train a quai
201904210810	4 mn
201904210811	3 mn
201904210812	2 mn
201904210813	1 mn
201904210814	0 mn
201904210815	Train a quai
201904210816	4 mn
201904210817	2 mn
201904210818	2 mn
201904210819	1 mn
201904210820	Train a l'approche
201904210821	5 mn
201904210822	3 mn
201904210823	2 mn
201904210824	2 mn
201904210825	1 mn
201904210826	Train a l'approche
201904210827	5 mn
201904210829	4 mn
201904210830	3 mn
201904210831	2 mn
201904210832	2 mn
201904210833	Train a l'approche
201904210834	5 mn
201904210835	3 mn
201904210836	2 mn
201904210837	1 mn
201904210838	1 mn
201904210839	Train a l'approche
201904210840	5 mn
201904210841	3 mn
201904210842	2 mn
201904210843	2 mn
201904210844	1 mn
201904210845	Train a l'approche
201904210846	Train a quai
201904210847	3 mn
201904210848	2 mn
