201904210749	3 mn
201904210750	2 mn
201904210751	1 mn
201904210752	0 mn
201904210753	Train a quai
201904210754	2 mn
201904210755	1 mn
201904210756	1 mn
201904210757	Train a quai
201904210758	3 mn
201904210759	2 mn
201904210800	2 mn
201904210801	1 mn
201904210803	Train a l'approche
201904210804	Train a quai
201904210805	2 mn
201904210806	1 mn
201904210807	Train a l'approche
201904210808	4 mn
201904210809	3 mn
201904210810	1 mn
201904210811	2 mn
201904210812	Train a quai
201904210813	2 mn
201904210814	1 mn
201904210815	0 mn
201904210816	Train a quai
201904210817	3 mn
201904210818	2 mn
201904210819	1 mn
201904210820	1 mn
201904210821	Train a quai
201904210822	5 mn
201904210823	4 mn
201904210824	3 mn
201904210825	2 mn
201904210826	1 mn
201904210827	0 mn
201904210828	4 mn
201904210829	3 mn
201904210830	2 mn
201904210831	1 mn
201904210832	Train a l'approche
201904210833	3 mn
201904210834	2 mn
201904210835	1 mn
201904210836	Train a l'approche
201904210837	4 mn
201904210838	3 mn
201904210839	2 mn
201904210840	1 mn
201904210841	0 mn
201904210842	Train a quai
201904210843	Train a quai
201904210844	3 mn
201904210845	2 mn
201904210846	1 mn
201904210847	0 mn
201904210848	3 mn
