201904210749	1 mn
201904210750	0 mn
201904210751	Train a quai
201904210752	8 mn
201904210753	7 mn
201904210754	6 mn
201904210755	5 mn
201904210756	4 mn
201904210757	3 mn
201904210758	2 mn
201904210759	1 mn
201904210800	Train a l'approche
201904210801	3 mn
201904210802	2 mn
201904210804	1 mn
201904210805	Train a l'approche
201904210806	Train a l'approche
201904210807	Train a l'approche
201904210808	Train a l'approche
201904210809	5 mn
201904210810	3 mn
201904210811	3 mn
201904210812	3 mn
201904210813	2 mn
201904210814	1 mn
201904210815	1 mn
201904210816	Train a quai
201904210817	5 mn
201904210818	4 mn
201904210819	3 mn
201904210820	2 mn
201904210821	1 mn
201904210822	1 mn
201904210823	Train a l'approche
201904210824	5 mn
201904210825	3 mn
201904210826	2 mn
201904210827	1 mn
201904210828	Train a l'approche
201904210829	2 mn
201904210830	1 mn
201904210831	Train a l'approche
201904210832	4 mn
201904210833	2 mn
201904210834	2 mn
201904210835	1 mn
201904210836	0 mn
201904210837	Train a quai
201904210838	1 mn
201904210839	1 mn
201904210840	Train a quai
201904210841	5 mn
201904210842	4 mn
201904210843	2 mn
201904210844	1 mn
201904210845	1 mn
201904210846	Train a l'approche
201904210847	6 mn
201904210848	5 mn
