201904210749	1 mn
201904210750	0 mn
201904210751	Train a l'approche
201904210752	3 mn
201904210753	2 mn
201904210754	1 mn
201904210755	1 mn
201904210756	Train a l'approche
201904210757	4 mn
201904210758	3 mn
201904210759	2 mn
201904210800	1 mn
201904210801	0 mn
201904210803	Train a l'approche
201904210804	3 mn
201904210805	3 mn
201904210806	2 mn
201904210807	0 mn
201904210808	Train a l'approche
201904210809	4 mn
201904210810	3 mn
201904210811	2 mn
201904210812	1 mn
201904210813	0 mn
201904210814	Train a quai
201904210815	4 mn
201904210816	3 mn
201904210817	1 mn
201904210818	Train a l'approche
201904210819	4 mn
201904210820	3 mn
201904210821	2 mn
201904210822	0 mn
201904210823	Train a quai
201904210824	3 mn
201904210825	2 mn
201904210826	1 mn
201904210827	0 mn
201904210828	Train a l'approche
201904210829	3 mn
201904210830	2 mn
201904210831	1 mn
201904210832	0 mn
201904210833	Train a l'approche
201904210834	3 mn
201904210835	2 mn
201904210836	0 mn
201904210837	Train a l'approche
201904210838	3 mn
201904210839	2 mn
201904210840	1 mn
201904210841	0 mn
201904210842	Train a quai
201904210843	Train a quai
201904210844	2 mn
201904210845	0 mn
201904210846	Train a l'approche
201904210847	3 mn
201904210848	2 mn
