201904210749	Train a quai
201904210750	4 mn
201904210751	3 mn
201904210752	2 mn
201904210753	1 mn
201904210754	1 mn
201904210755	Train a quai
201904210756	2 mn
201904210757	1 mn
201904210758	1 mn
201904210759	9 mn
201904210800	8 mn
201904210801	8 mn
201904210802	6 mn
201904210804	4 mn
201904210805	4 mn
201904210806	4 mn
201904210807	4 mn
201904210808	4 mn
201904210809	2 mn
201904210810	1 mn
201904210811	1 mn
201904210812	3 mn
201904210813	3 mn
201904210814	2 mn
201904210815	1 mn
201904210816	Train a l'approche
201904210817	6 mn
201904210818	5 mn
201904210819	5 mn
201904210820	5 mn
201904210821	3 mn
201904210822	2 mn
201904210823	2 mn
201904210824	Train a l'approche
201904210825	6 mn
201904210826	5 mn
201904210827	5 mn
201904210828	3 mn
201904210829	2 mn
201904210830	1 mn
201904210831	Train a l'approche
201904210832	4 mn
201904210833	3 mn
201904210834	2 mn
201904210835	1 mn
201904210836	Train a l'approche
201904210837	3 mn
201904210838	1 mn
201904210839	1 mn
201904210840	Train a quai
201904210841	5 mn
201904210842	3 mn
201904210843	2 mn
201904210844	1 mn
201904210845	Train a l'approche
201904210846	1 mn
201904210847	1 mn
201904210848	5 mn
