201904210749	Train retarde
201904210750	0 mn
201904210751	0 mn
201904210752	0 mn
201904210753	0 mn
201904210754	Train a l'approche
201904210755	1 mn
201904210756	1 mn
201904210757	0 mn
201904210758	0 mn
201904210759	0 mn
201904210800	0 mn
201904210801	Train a l'approche
201904210802	Train retarde
201904210803	Train retarde
201904210804	1 mn
201904210805	1 mn
201904210806	0 mn
201904210807	0 mn
201904210808	Train a l'approche
201904210809	1 mn
201904210810	Train retarde
201904210811	Train retarde
201904210812	0 mn
201904210813	0 mn
201904210814	0 mn
201904210815	Train a l'approche
201904210816	Train a quai
201904210817	Train retarde
201904210818	0 mn
201904210819	0 mn
201904210820	0 mn
201904210822	0 mn
201904210822	Train a l'approche
201904210824	Train retarde
201904210825	Train retarde
201904210826	0 mn
201904210827	1 mn
201904210828	0 mn
201904210829	0 mn
201904210830	0 mn
201904210831	Train a quai
201904210832	1 mn
201904210833	0 mn
201904210834	0 mn
201904210835	0 mn
201904210836	Train retarde
201904210837	Train a l'approche
201904210838	Train retarde
201904210839	Train retarde
201904210840	Train retarde
201904210841	0 mn
201904210842	1 mn
201904210843	0 mn
201904210844	Train a quai
201904210845	0 mn
201904210846	0 mn
201904210847	0 mn
201904210848	Train retarde
