201904210749	2 mn
201904210750	1 mn
201904210751	0 mn
201904210752	8 mn
201904210753	7 mn
201904210754	6 mn
201904210755	5 mn
201904210756	4 mn
201904210757	3 mn
201904210758	2 mn
201904210759	2 mn
201904210800	1 mn
201904210801	Train a l'approche
201904210802	6 mn
201904210804	5 mn
201904210805	4 mn
201904210805	3 mn
201904210807	2 mn
201904210808	2 mn
201904210808	9 mn
201904210809	8 mn
201904210810	7 mn
201904210812	6 mn
201904210813	5 mn
201904210814	4 mn
201904210815	3 mn
201904210816	3 mn
201904210817	3 mn
201904210818	2 mn
201904210819	Train a l'approche
201904210820	8 mn
201904210821	6 mn
201904210822	5 mn
201904210823	4 mn
201904210824	3 mn
201904210825	2 mn
201904210826	1 mn
201904210827	Train a l'approche
201904210828	Train a quai
201904210829	6 mn
201904210830	6 mn
201904210831	4 mn
201904210832	3 mn
201904210833	2 mn
201904210834	1 mn
201904210835	2 mn
201904210836	Train a quai
201904210837	9 mn
201904210838	8 mn
201904210839	7 mn
201904210840	6 mn
201904210841	5 mn
201904210842	4 mn
201904210843	3 mn
201904210844	2 mn
201904210845	1 mn
201904210846	1 mn
201904210847	1 mn
201904210848	6 mn
