201904210749	8 mn
201904210750	7 mn
201904210751	6 mn
201904210752	6 mn
201904210753	4 mn
201904210754	3 mn
201904210755	2 mn
201904210756	1 mn
201904210757	0 mn
201904210758	Train a quai
201904210759	5 mn
201904210800	4 mn
201904210802	3 mn
201904210803	2 mn
201904210804	0 mn
201904210805	Train a l'approche
201904210806	6 mn
201904210807	5 mn
201904210808	4 mn
201904210809	4 mn
201904210810	3 mn
201904210811	2 mn
201904210812	0 mn
201904210813	Train a l'approche
201904210814	8 mn
201904210815	7 mn
201904210816	4 mn
201904210817	4 mn
201904210818	3 mn
201904210819	1 mn
201904210820	0 mn
201904210821	0 mn
201904210822	Train a quai
201904210823	5 mn
201904210824	4 mn
201904210825	3 mn
201904210826	2 mn
201904210827	1 mn
201904210828	0 mn
201904210829	Train a quai
201904210830	6 mn
201904210831	5 mn
201904210832	4 mn
201904210833	3 mn
201904210834	2 mn
201904210835	1 mn
201904210836	0 mn
201904210837	Train a quai
201904210838	6 mn
201904210839	5 mn
201904210840	4 mn
201904210841	3 mn
201904210842	2 mn
201904210843	1 mn
201904210844	0 mn
201904210845	Train a quai
201904210846	6 mn
201904210847	5 mn
201904210848	4 mn
