201904210749	2 mn
201904210750	2 mn
201904210751	1 mn
201904210752	Train a quai
201904210753	1 mn
201904210754	1 mn
201904210755	Train retarde
201904210756	1 mn
201904210757	0 mn
201904210758	Train a quai
201904210759	Train a quai
201904210800	5 mn
201904210801	4 mn
201904210802	3 mn
201904210804	2 mn
201904210805	1 mn
201904210805	Train a l'approche
201904210807	1 mn
201904210808	Train a l'approche
201904210808	2 mn
201904210809	1 mn
201904210810	1 mn
201904210812	2 mn
201904210813	1 mn
201904210814	1 mn
201904210815	Train a quai
201904210816	3 mn
201904210817	2 mn
201904210818	1 mn
201904210819	Train a quai
201904210820	3 mn
201904210821	2 mn
201904210822	1 mn
201904210823	0 mn
201904210824	Train a quai
201904210825	3 mn
201904210826	2 mn
201904210827	2 mn
201904210828	1 mn
201904210829	Train a quai
201904210830	3 mn
201904210831	1 mn
201904210832	Train a l'approche
201904210833	3 mn
201904210834	2 mn
201904210835	2 mn
201904210836	1 mn
201904210837	Train a quai
201904210838	3 mn
201904210839	2 mn
201904210840	2 mn
201904210841	1 mn
201904210842	Train a l'approche
201904210843	Train a quai
201904210844	1 mn
201904210845	0 mn
201904210846	Train a quai
201904210847	1 mn
201904210848	Train a quai
