201904210749	1 mn
201904210750	Train a l'approche
201904210751	6 mn
201904210752	5 mn
201904210753	4 mn
201904210754	3 mn
201904210755	2 mn
201904210756	1 mn
201904210757	Train a l'approche
201904210758	7 mn
201904210759	7 mn
201904210800	5 mn
201904210801	4 mn
201904210802	3 mn
201904210803	2 mn
201904210804	0 mn
201904210805	Train a quai
201904210806	5 mn
201904210807	4 mn
201904210808	3 mn
201904210809	2 mn
201904210810	2 mn
201904210811	0 mn
201904210812	Train a quai
201904210813	5 mn
201904210814	4 mn
201904210815	3 mn
201904210816	2 mn
201904210817	0 mn
201904210818	Train a l'approche
201904210819	6 mn
201904210820	5 mn
201904210822	4 mn
201904210823	3 mn
201904210824	2 mn
201904210825	1 mn
201904210826	Train a l'approche
201904210827	6 mn
201904210828	5 mn
201904210829	5 mn
201904210830	4 mn
201904210831	3 mn
201904210832	1 mn
201904210833	0 mn
201904210834	Train a l'approche
201904210835	5 mn
201904210836	3 mn
201904210837	3 mn
201904210838	2 mn
201904210839	0 mn
201904210840	Train a l'approche
201904210841	6 mn
201904210842	5 mn
201904210843	5 mn
201904210844	3 mn
201904210845	2 mn
201904210846	2 mn
201904210847	0 mn
201904210848	Train a quai
