201904210749	2 mn
201904210750	0 mn
201904210751	Train a quai
201904210752	4 mn
201904210753	2 mn
201904210754	1 mn
201904210755	0 mn
201904210756	Train a quai
201904210757	3 mn
201904210758	2 mn
201904210759	1 mn
201904210800	Train a l'approche
201904210802	4 mn
201904210803	3 mn
201904210804	1 mn
201904210805	1 mn
201904210806	Train a l'approche
201904210807	2 mn
201904210808	1 mn
201904210809	0 mn
201904210810	Train a quai
201904210811	4 mn
201904210812	3 mn
201904210813	2 mn
201904210814	1 mn
201904210815	Train a l'approche
201904210816	1 mn
201904210817	0 mn
201904210818	Train a quai
201904210819	4 mn
201904210820	3 mn
201904210821	2 mn
201904210822	1 mn
201904210823	0 mn
201904210824	Train a quai
201904210825	0 mn
201904210826	Train a quai
201904210827	3 mn
201904210828	2 mn
201904210829	1 mn
201904210830	0 mn
201904210831	3 mn
201904210832	1 mn
201904210833	0 mn
201904210834	Train a quai
201904210835	1 mn
201904210836	0 mn
201904210837	Train a l'approche
201904210838	1 mn
201904210839	Train a l'approche
201904210840	3 mn
201904210841	2 mn
201904210842	1 mn
201904210843	0 mn
201904210844	2 mn
201904210845	1 mn
201904210846	0 mn
201904210847	Train a quai
201904210848	1 mn
