201904210749	8 mn
201904210750	7 mn
201904210751	6 mn
201904210752	5 mn
201904210753	3 mn
201904210754	2 mn
201904210755	1 mn
201904210756	0 mn
201904210757	8 mn
201904210758	7 mn
201904210759	6 mn
201904210800	5 mn
201904210801	3 mn
201904210802	2 mn
201904210803	1 mn
201904210804	1 mn
201904210805	Train a quai
201904210806	7 mn
201904210807	5 mn
201904210808	3 mn
201904210809	4 mn
201904210810	2 mn
201904210811	1 mn
201904210812	Train a l'approche
201904210813	7 mn
201904210814	6 mn
201904210815	5 mn
201904210816	3 mn
201904210817	2 mn
201904210818	1 mn
201904210819	1 mn
201904210820	Train a quai
201904210821	6 mn
201904210822	5 mn
201904210823	3 mn
201904210825	2 mn
201904210826	2 mn
201904210827	1 mn
201904210828	8 mn
201904210829	6 mn
201904210830	5 mn
201904210831	4 mn
201904210832	3 mn
201904210833	2 mn
201904210834	1 mn
201904210835	Train a l'approche
201904210836	5 mn
201904210837	3 mn
201904210838	2 mn
201904210839	1 mn
201904210840	1 mn
201904210841	Train a quai
201904210842	6 mn
201904210843	5 mn
201904210844	3 mn
201904210845	3 mn
201904210846	1 mn
201904210847	1 mn
201904210848	7 mn
