201904210749	2 mn
201904210750	2 mn
201904210751	Train a l'approche
201904210752	4 mn
201904210753	4 mn
201904210754	2 mn
201904210755	1 mn
201904210756	0 mn
201904210757	Train a quai
201904210758	3 mn
201904210759	2 mn
201904210800	1 mn
201904210801	Train a quai
201904210802	4 mn
201904210804	2 mn
201904210804	2 mn
201904210805	1 mn
201904210806	Train a quai
201904210807	4 mn
201904210808	3 mn
201904210809	2 mn
201904210810	1 mn
201904210812	Train a quai
201904210812	4 mn
201904210813	3 mn
201904210814	2 mn
201904210815	1 mn
201904210816	Train a quai
201904210817	4 mn
201904210819	4 mn
201904210820	2 mn
201904210821	1 mn
201904210822	Train a l'approche
201904210823	5 mn
201904210824	3 mn
201904210825	1 mn
201904210826	0 mn
201904210827	5 mn
201904210828	4 mn
201904210829	3 mn
201904210830	2 mn
201904210831	1 mn
201904210832	Train a quai
201904210833	4 mn
201904210834	2 mn
201904210835	2 mn
201904210836	1 mn
201904210837	Train a quai
201904210838	5 mn
201904210839	4 mn
201904210840	3 mn
201904210841	2 mn
201904210842	1 mn
201904210843	Train a quai
201904210844	4 mn
201904210845	2 mn
201904210846	1 mn
201904210847	1 mn
201904210848	Train a quai
