201904210749	5 mn
201904210750	4 mn
201904210751	4 mn
201904210752	3 mn
201904210753	2 mn
201904210754	0 mn
201904210755	Train a l'approche
201904210756	8 mn
201904210757	7 mn
201904210758	6 mn
201904210759	5 mn
201904210801	4 mn
201904210802	3 mn
201904210803	1 mn
201904210804	0 mn
201904210805	Train a quai
201904210806	5 mn
201904210807	4 mn
201904210808	3 mn
201904210809	3 mn
201904210810	2 mn
201904210811	0 mn
201904210812	Train a quai
201904210813	6 mn
201904210814	5 mn
201904210815	4 mn
201904210816	3 mn
201904210817	2 mn
201904210818	1 mn
201904210819	0 mn
201904210820	Train a quai
201904210821	6 mn
201904210822	6 mn
201904210823	5 mn
201904210824	4 mn
201904210825	3 mn
201904210826	2 mn
201904210827	1 mn
201904210828	0 mn
201904210829	Train a quai
201904210830	5 mn
201904210831	4 mn
201904210832	3 mn
201904210833	2 mn
201904210834	1 mn
201904210835	0 mn
201904210836	Train a quai
201904210837	6 mn
201904210838	5 mn
201904210839	4 mn
201904210840	3 mn
201904210841	2 mn
201904210842	1 mn
201904210843	0 mn
201904210844	Train a quai
201904210845	6 mn
201904210846	5 mn
201904210847	4 mn
201904210848	3 mn
