201904210749	2 mn
201904210750	0 mn
201904210751	Train a quai
201904210752	4 mn
201904210753	3 mn
201904210754	2 mn
201904210755	1 mn
201904210756	0 mn
201904210757	5 mn
201904210758	4 mn
201904210759	3 mn
201904210800	2 mn
201904210801	0 mn
201904210802	Train a quai
201904210803	4 mn
201904210804	3 mn
201904210805	3 mn
201904210806	1 mn
201904210807	0 mn
201904210808	1 mn
201904210809	0 mn
201904210810	Train a quai
201904210811	1 mn
201904210812	Train retarde
201904210813	0 mn
201904210814	Train a l'approche
201904210815	5 mn
201904210816	4 mn
201904210817	0 mn
201904210818	Train a quai
201904210819	4 mn
201904210820	3 mn
201904210822	2 mn
201904210822	1 mn
201904210823	0 mn
201904210825	5 mn
201904210826	3 mn
201904210827	3 mn
201904210828	1 mn
201904210829	0 mn
201904210830	4 mn
201904210831	3 mn
201904210832	2 mn
201904210833	Train retarde
201904210834	0 mn
201904210835	Train a quai
201904210836	4 mn
201904210837	3 mn
201904210838	2 mn
201904210839	1 mn
201904210840	0 mn
201904210841	Train a quai
201904210842	4 mn
201904210843	3 mn
201904210844	1 mn
201904210845	0 mn
201904210846	0 mn
201904210847	4 mn
201904210848	3 mn
