201904210749	1 mn
201904210750	0 mn
201904210751	3 mn
201904210752	2 mn
201904210753	1 mn
201904210754	Train a l'approche
201904210755	3 mn
201904210756	2 mn
201904210757	1 mn
201904210758	Train a l'approche
201904210759	3 mn
201904210800	3 mn
201904210802	1 mn
201904210803	0 mn
201904210804	2 mn
201904210805	1 mn
201904210806	0 mn
201904210807	3 mn
201904210808	2 mn
201904210809	1 mn
201904210810	1 mn
201904210811	Train a l'approche
201904210812	3 mn
201904210813	2 mn
201904210814	0 mn
201904210815	3 mn
201904210816	2 mn
201904210817	1 mn
201904210818	Train a l'approche
201904210819	1 mn
201904210820	0 mn
201904210821	4 mn
201904210822	2 mn
201904210823	0 mn
201904210824	3 mn
201904210825	1 mn
201904210826	0 mn
201904210827	4 mn
201904210828	3 mn
201904210829	2 mn
201904210830	0 mn
201904210831	3 mn
201904210832	1 mn
201904210833	0 mn
201904210834	4 mn
201904210835	3 mn
201904210836	2 mn
201904210837	1 mn
201904210838	Train a l'approche
201904210839	3 mn
201904210840	2 mn
201904210841	1 mn
201904210842	Train a l'approche
201904210843	3 mn
201904210844	2 mn
201904210845	1 mn
201904210846	1 mn
201904210847	3 mn
201904210848	2 mn
