201904210749	1 mn
201904210750	0 mn
201904210751	Train a quai
201904210752	1 mn
201904210753	0 mn
201904210754	Train a l'approche
201904210755	4 mn
201904210756	3 mn
201904210757	2 mn
201904210758	2 mn
201904210759	1 mn
201904210800	0 mn
201904210801	Train a quai
201904210803	4 mn
201904210804	3 mn
201904210805	2 mn
201904210806	1 mn
201904210807	0 mn
201904210808	Train a l'approche
201904210809	4 mn
201904210810	3 mn
201904210811	1 mn
201904210812	0 mn
201904210813	Train a l'approche
201904210814	1 mn
201904210815	0 mn
201904210816	Train a quai
201904210817	3 mn
201904210818	2 mn
201904210819	1 mn
201904210820	0 mn
201904210821	Train a l'approche
201904210822	2 mn
201904210823	1 mn
201904210824	0 mn
201904210825	Train a quai
201904210826	6 mn
201904210827	5 mn
201904210828	4 mn
201904210829	2 mn
201904210830	2 mn
201904210831	1 mn
201904210832	Train a l'approche
201904210833	Train a quai
201904210834	1 mn
201904210835	0 mn
201904210836	Train a quai
201904210837	3 mn
201904210838	2 mn
201904210839	1 mn
201904210840	0 mn
201904210841	Train a quai
201904210842	2 mn
201904210843	2 mn
201904210844	2 mn
201904210845	1 mn
201904210846	Train a l'approche
201904210847	5 mn
201904210848	4 mn
