201904210749	0 mn
201904210750	Train a l'approche
201904210751	5 mn
201904210752	4 mn
201904210753	4 mn
201904210754	4 mn
201904210755	1 mn
201904210756	0 mn
201904210757	Train a l'approche
201904210758	8 mn
201904210759	7 mn
201904210800	6 mn
201904210801	5 mn
201904210802	4 mn
201904210804	3 mn
201904210805	2 mn
201904210806	1 mn
201904210807	Train a l'approche
201904210808	0 mn
201904210809	Train a l'approche
201904210810	6 mn
201904210811	5 mn
201904210812	4 mn
201904210813	4 mn
201904210814	3 mn
201904210815	1 mn
201904210816	0 mn
201904210817	Train a quai
201904210818	4 mn
201904210819	3 mn
201904210820	2 mn
201904210821	1 mn
201904210822	0 mn
201904210823	6 mn
201904210824	5 mn
201904210825	4 mn
201904210826	3 mn
201904210827	3 mn
201904210828	1 mn
201904210829	0 mn
201904210830	Train a quai
201904210831	4 mn
201904210832	4 mn
201904210833	3 mn
201904210834	1 mn
201904210835	0 mn
201904210836	Train a quai
201904210837	6 mn
201904210838	5 mn
201904210839	5 mn
201904210840	4 mn
201904210841	3 mn
201904210842	1 mn
201904210843	0 mn
201904210844	Train a quai
201904210845	4 mn
201904210846	3 mn
201904210847	3 mn
201904210848	0 mn
