1;Bowtech Compound Bow;A1;Z1;2020-10-28;8;455;src/img/coumpoundbow.jpg;
2;Easton Arrow;A2;Z2;2020-10-20;150;5;src/img/carbonarrow.jpg;
3;test;A2;Z2;2020-10-20;150;5;src/img/default_product.jpg;
2;Easton Arrow;A2;Z2;2020-10-25;1500;6;src/img/carbonarrow.jpg;
1;Bowtech Compound Bow;A1;Z1;2020-10-28;8;500;src/img/coumpoundbow.jpg;