Pour le biscuit Joconde :
	Poudre d’amande : 100 g
	Sucre glace : 100 g
	Oeuf(s) : 3 pièce(s)
	Blanc(s) d’oeuf : 3 pièce(s)
	Beurre doux : 20 g
	Sucre en poudre : 15 g
	Farine de blé : 30 g
	Chocolat noir : 200 g
	Beurre doux : 100 g