{"message":"bjr tt le monde moi c personne\n","user":"personne","user_id":"kuDRRb1ytmqw4iX0","date":1651678099866,"lastEdit":1651678116348,"signal":0,"_id":"0LJ6JmSHimVRDOqj","whosignal":[]}
{"message":"lmfsdlf","user":"electro274","user_id":"r45sThvpkP4xvhMG","date":1651508029413,"lastEdit":1651508029413,"_id":"3yJ6d7VLGEOK4W4K","signal":0,"whosignal":[]}
{"message":"fl,msdlfmsd\ndsf,;sdf\n","user":"electro274","user_id":"r45sThvpkP4xvhMG","date":1651674635807,"lastEdit":1651674640717,"_id":"4M0OgC8w1XQZDGAZ","signal":0,"whosignal":[]}
{"message":"f e:;s;fe s:f; es:fs\n","user":"lul","user_id":"53yBFAqt97mZBnx2","date":1651519671025,"lastEdit":1651519671025,"_id":"5P73cfszKXF7Qida","signal":0,"whosignal":[]}
{"message":"snq;qsfnlqsnk","user":"1234","user_id":"oEiwwZ6PnkiOqgl4","date":1651687755618,"lastEdit":1651687755618,"_id":"7OUqBwLm8aAXQ9fx","signal":0,"whosignal":[]}
{"message":"dklnqdzlqnkd","user":"1234","user_id":"oEiwwZ6PnkiOqgl4","date":1651687764481,"lastEdit":1651687764481,"_id":"82W0g0tEg4ZWlcSf","signal":0,"whosignal":[]}
{"message":"kljkzelzelktez\n\n\n\n\nede","user":"lul","user_id":"53yBFAqt97mZBnx2","date":1651509747241,"lastEdit":1651513163965,"_id":"CYZ1mJ1GXfPUto3x","signal":0,"whosignal":[]}
{"message":"lul ezkcnezk\n","user":"electro274","user_id":"r45sThvpkP4xvhMG","date":1651677039212,"lastEdit":1651677039212,"_id":"DMxYkSfFQYcSdQwl","signal":0,"whosignal":[]}
{"message":"test","user":"opif","user_id":"N2avyxp8TSESgOuE","date":1651494935926,"lastEdit":1651494935926,"_id":"Ebo3vCDIxBT2Vi5s","signal":0,"whosignal":[]}
{"message":"test2","user":"opif","user_id":"N2avyxp8TSESgOuE","date":1651168958505,"lastEdit":1651171818059,"_id":"Ehi4MyrFtg1wvuQS","signal":0,"whosignal":[]}
{"message":"test2","user":"opif","user_id":"N2avyxp8TSESgOuE","date":1651494938733,"lastEdit":1651494960356,"_id":"GH4uQ0NfaEe3WaFJ","signal":0,"whosignal":[]}
{"message":"nds;knvdskvnkdslvs","user":"electro274","user_id":"r45sThvpkP4xvhMG","date":1651507987088,"lastEdit":1651507987088,"_id":"NQNxjRXUh03OFdJB","signal":0,"whosignal":[]}
{"message":",ez,fmlzefmlz,fmz","user":"lul","user_id":"53yBFAqt97mZBnx2","date":1651515442984,"lastEdit":1651515442984,"_id":"OtypjM10dYrDhtEw","signal":0,"whosignal":[]}
{"message":"test","user":"opif","user_id":"N2avyxp8TSESgOuE","date":1651687547579,"lastEdit":1651687547579,"_id":"Ox4VvZjR7UoGvMDZ","signal":0,"whosignal":[]}
{"message":",sdnfdf;s\n","user":"lul","user_id":"53yBFAqt97mZBnx2","date":1651512760334,"lastEdit":1651584925201,"_id":"SIYCCYy7qqSmNHWD","signal":0,"whosignal":[]}
{"message":"elf,zemlf","user":"lul","user_id":"53yBFAqt97mZBnx2","date":1651515805767,"lastEdit":1651515805767,"_id":"SJSEVrHSCwNcMuYs","signal":0,"whosignal":[]}
{"message":"klvdskflsnfks\n\nsfnskjnfqsj\n","user":"abcd","user_id":"qyjooPTbegUBnp3U","date":1651687629451,"lastEdit":1651687651403,"_id":"T6Fgd4hBgTgaxM3A","signal":0,"whosignal":[]}
{"message":"test13","user":"opif","user_id":"N2avyxp8TSESgOuE","date":1652028528293,"lastEdit":1652028528293,"_id":"TuVDvlb3H8VEElxq","signal":29,"whosignal":["N2avyxp8TSESgOuE","N2avyxp8TSESgOuE","N2avyxp8TSESgOuE","N2avyxp8TSESgOuE","N2avyxp8TSESgOuE","N2avyxp8TSESgOuE","N2avyxp8TSESgOuE","N2avyxp8TSESgOuE","N2avyxp8TSESgOuE","N2avyxp8TSESgOuE","N2avyxp8TSESgOuE","N2avyxp8TSESgOuE","N2avyxp8TSESgOuE","N2avyxp8TSESgOuE","N2avyxp8TSESgOuE","N2avyxp8TSESgOuE","N2avyxp8TSESgOuE","N2avyxp8TSESgOuE","N2avyxp8TSESgOuE","N2avyxp8TSESgOuE","N2avyxp8TSESgOuE","N2avyxp8TSESgOuE","N2avyxp8TSESgOuE","N2avyxp8TSESgOuE","N2avyxp8TSESgOuE","N2avyxp8TSESgOuE","N2avyxp8TSESgOuE","N2avyxp8TSESgOuE","N2avyxp8TSESgOuE"]}
{"message":"zqd,:zqd","user":"lul","user_id":"53yBFAqt97mZBnx2","date":1651515653648,"lastEdit":1651515653648,"_id":"U6jxHsFCxvjDpF7b","signal":0,"whosignal":[]}
{"message":"Cc, qui v au concert d'Indochine ?\n","user":"vicky","user_id":"vV8LQFPdjmJl9yg6","date":1651686647670,"lastEdit":1651686656800,"_id":"UMWq86tI76OYICVe","signal":0,"whosignal":[]}
{"message":"test12","user":"opif","user_id":"N2avyxp8TSESgOuE","date":1652028521315,"lastEdit":1652028521315,"_id":"V4vIVozSb5amgc9D","signal":17,"whosignal":["N2avyxp8TSESgOuE","N2avyxp8TSESgOuE","N2avyxp8TSESgOuE","N2avyxp8TSESgOuE","N2avyxp8TSESgOuE","N2avyxp8TSESgOuE","N2avyxp8TSESgOuE","N2avyxp8TSESgOuE","N2avyxp8TSESgOuE","N2avyxp8TSESgOuE","N2avyxp8TSESgOuE","N2avyxp8TSESgOuE","N2avyxp8TSESgOuE","N2avyxp8TSESgOuE","N2avyxp8TSESgOuE","N2avyxp8TSESgOuE","N2avyxp8TSESgOuE"]}
{"message":"test14","user":"opif","user_id":"N2avyxp8TSESgOuE","date":1652028532551,"lastEdit":1652028532551,"_id":"V5lgKc6SPcOrnnLr","signal":15,"whosignal":[]}
{"message":";sq,:fs,f:;sd,:f,ds:f\nf\n ds\nf\nds\nf\nds\n\ndsf dsfds\n\nsdfds\n","user":"lul","user_id":"53yBFAqt97mZBnx2","date":1651513508025,"lastEdit":1651514726285,"_id":"ViKhG0FUu7hUi4nN","signal":0,"whosignal":[]}
{"message":"esf;:ezfze","user":"lul","user_id":"53yBFAqt97mZBnx2","date":1651515511842,"lastEdit":1651515511842,"_id":"bpra9alruOJWp2nO","signal":0,"whosignal":[]}
{"message":"test","user":"opif","user_id":"N2avyxp8TSESgOuE","date":1651494937830,"lastEdit":1651494937830,"_id":"ccIekrPa4pRwHBs6","signal":0,"whosignal":[]}
{"message":"qzdk,lqzkd,zlq,d","user":"azer","user_id":"PfkIf3qlafOm988b","date":1651688173618,"lastEdit":1651688173618,"_id":"clUs9wRFmYNNPoof","signal":0,"whosignal":[]}
{"message":"qs cq f,ds , cds,v ;s,v\nds\nvds\nvsvdsvslvsdv\n","user":"electro274","user_id":"r45sThvpkP4xvhMG","date":1651608012094,"lastEdit":1651608012094,"_id":"cscSociR9fgcj3G2","signal":0,"whosignal":[]}
{"message":"ksnflskqn","user":"1234","user_id":"oEiwwZ6PnkiOqgl4","date":1651687752756,"lastEdit":1651687752756,"_id":"f2L9TTP9RorCRZTx","signal":0,"whosignal":[]}
{"message":"f,f;e, f;,jkdnkq\n\nsqdsq\n","user":"lul","user_id":"53yBFAqt97mZBnx2","date":1651519661990,"lastEdit":1651587792425,"_id":"fPWoge5OzdfEpR7Z","signal":0,"whosignal":[]}
{"message":"qzkd,lqz,fklqz","user":"lul","user_id":"53yBFAqt97mZBnx2","date":1651515637192,"lastEdit":1651515637192,"_id":"iGDuSjd065MUyUQ6","signal":0,"whosignal":[]}
{"message":"dklzkd,zlq,dkqzlk,d","user":"azer","user_id":"PfkIf3qlafOm988b","date":1651688170815,"lastEdit":1651688170815,"_id":"k5f3unCZlWu1y82e","signal":0,"whosignal":[]}
{"message":"dlkf,sdlf,dslfk","user":"abcd","user_id":"MNG88v1H3wUl910o","date":1651679334754,"lastEdit":1651679334754,"_id":"l1xXIt1d9FOOSzG6","signal":0,"whosignal":[]}
{"message":"de d;e fjezfz\n","user":"electro274","user_id":"r45sThvpkP4xvhMG","date":1651519901970,"lastEdit":1651519901970,"_id":"lXu1dFXgUbHQ8dxB","signal":0,"whosignal":[]}
{"message":"test","user":"opif","user_id":"N2avyxp8TSESgOuE","date":1651168923442,"lastEdit":1651168923442,"_id":"n8uA23YOGrQvFQZ7","signal":0,"whosignal":[]}
{"message":"skl,cqks,f","user":"lul","user_id":"53yBFAqt97mZBnx2","date":1651515728276,"lastEdit":1651515728276,"_id":"nFkyUxNt5tGC7gyx","signal":0,"whosignal":[]}
{"message":"dsklf,sdl\n\ndsfds\n","user":"abcd","user_id":"MNG88v1H3wUl910o","date":1651679337996,"lastEdit":1651679342339,"_id":"pdGaRKj67Pfq3rm5","signal":0,"whosignal":[]}
{"message":"dql,dqkd","user":"electro274","user_id":"r45sThvpkP4xvhMG","date":1651677043351,"lastEdit":1651677043351,"_id":"r2X77uMFCK1g0tIu","signal":0,"whosignal":[]}
{"message":"lqmsfsl mfmldgl\n","user":"lul","user_id":"53yBFAqt97mZBnx2","date":1651515743879,"lastEdit":1651515743879,"_id":"syspxE8ciYXcVZaq","signal":0,"whosignal":[]}
{"message":"kqsflqsnlfnqskl","user":"lul","user_id":"53yBFAqt97mZBnx2","date":1651515676728,"lastEdit":1651515676728,"_id":"ySYIUtzElQlZsfGT","signal":0,"whosignal":[]}
