{
    "dev": {
        "awscloudformation": {
            "AuthRoleName": "amplify-communitystartup-dev-211455-authRole",
            "UnauthRoleArn": "arn:aws:iam::296742116870:role/amplify-communitystartup-dev-211455-unauthRole",
            "AuthRoleArn": "arn:aws:iam::296742116870:role/amplify-communitystartup-dev-211455-authRole",
            "Region": "eu-west-1",
            "DeploymentBucketName": "amplify-communitystartup-dev-211455-deployment",
            "UnauthRoleName": "amplify-communitystartup-dev-211455-unauthRole",
            "StackName": "amplify-communitystartup-dev-211455",
            "StackId": "arn:aws:cloudformation:eu-west-1:296742116870:stack/amplify-communitystartup-dev-211455/e85ec3c0-2135-11eb-879a-02201fce1aec",
            "AmplifyAppId": "d30rgurw929yi6"
        },
        "categories": {
            "auth": {
                "communitystartup83dabf57": {}
            },
            "hosting": {
                "amplifyhosting": {
                    "appId": "d30rgurw929yi6",
                    "type": "manual"
                }
            }
        }
    }
}