{
  "project_info": {
    "project_number": "1029877122203",
    "firebase_url": "https://pedidos-de-restaurante-9c0db.firebaseio.com",
    "project_id": "pedidos-de-restaurante-9c0db",
    "storage_bucket": "pedidos-de-restaurante-9c0db.appspot.com"
  },
  "client": [
    {
      "client_info": {
        "mobilesdk_app_id": "1:1029877122203:android:98ad332cbd06b1e5",
        "android_client_info": {
          "package_name": "com.example.restaurante"
        }
      },
      "oauth_client": [
        {
          "client_id": "1029877122203-4jh30j4q4ed4fi5qv6bj6usv406c5nsk.apps.googleusercontent.com",
          "client_type": 3
        }
      ],
      "api_key": [
        {
          "current_key": "AIzaSyDf8j8UvknzlYeiNUlMiU3ljcU-rg0j2k8"
        }
      ],
      "services": {
        "appinvite_service": {
          "other_platform_oauth_client": [
            {
              "client_id": "1029877122203-4jh30j4q4ed4fi5qv6bj6usv406c5nsk.apps.googleusercontent.com",
              "client_type": 3
            }
          ]
        }
      }
    }
  ],
  "configuration_version": "1"
}