-- Merging decision tree log ---
manifest
ADDED from /home/thiagowallass/Área de Trabalho/development/flutter(atual)/.pub-cache/hosted/pub.dartlang.org/firebase_core-0.3.4/android/src/main/AndroidManifest.xml:1:1-3:12
INJECTED from /home/thiagowallass/Área de Trabalho/development/flutter(atual)/.pub-cache/hosted/pub.dartlang.org/firebase_core-0.3.4/android/src/main/AndroidManifest.xml:1:1-3:12
INJECTED from /home/thiagowallass/Área de Trabalho/development/flutter(atual)/.pub-cache/hosted/pub.dartlang.org/firebase_core-0.3.4/android/src/main/AndroidManifest.xml:1:1-3:12
	package
		ADDED from /home/thiagowallass/Área de Trabalho/development/flutter(atual)/.pub-cache/hosted/pub.dartlang.org/firebase_core-0.3.4/android/src/main/AndroidManifest.xml:2:3-45
		INJECTED from /home/thiagowallass/Área de Trabalho/development/flutter(atual)/.pub-cache/hosted/pub.dartlang.org/firebase_core-0.3.4/android/src/main/AndroidManifest.xml
		INJECTED from /home/thiagowallass/Área de Trabalho/development/flutter(atual)/.pub-cache/hosted/pub.dartlang.org/firebase_core-0.3.4/android/src/main/AndroidManifest.xml
	xmlns:android
		ADDED from /home/thiagowallass/Área de Trabalho/development/flutter(atual)/.pub-cache/hosted/pub.dartlang.org/firebase_core-0.3.4/android/src/main/AndroidManifest.xml:1:11-69
uses-sdk
INJECTED from /home/thiagowallass/Área de Trabalho/development/flutter(atual)/.pub-cache/hosted/pub.dartlang.org/firebase_core-0.3.4/android/src/main/AndroidManifest.xml reason: use-sdk injection requested
INJECTED from /home/thiagowallass/Área de Trabalho/development/flutter(atual)/.pub-cache/hosted/pub.dartlang.org/firebase_core-0.3.4/android/src/main/AndroidManifest.xml
INJECTED from /home/thiagowallass/Área de Trabalho/development/flutter(atual)/.pub-cache/hosted/pub.dartlang.org/firebase_core-0.3.4/android/src/main/AndroidManifest.xml
	android:minSdkVersion
		INJECTED from /home/thiagowallass/Área de Trabalho/development/flutter(atual)/.pub-cache/hosted/pub.dartlang.org/firebase_core-0.3.4/android/src/main/AndroidManifest.xml
		ADDED from /home/thiagowallass/Área de Trabalho/development/flutter(atual)/.pub-cache/hosted/pub.dartlang.org/firebase_core-0.3.4/android/src/main/AndroidManifest.xml
		INJECTED from /home/thiagowallass/Área de Trabalho/development/flutter(atual)/.pub-cache/hosted/pub.dartlang.org/firebase_core-0.3.4/android/src/main/AndroidManifest.xml
