%YAML 1.1
%TAG !u! tag:unity3d.com,2011:
--- !u!114 &11400000
MonoBehaviour:
  m_ObjectHideFlags: 0
  m_CorrespondingSourceObject: {fileID: 0}
  m_PrefabInstance: {fileID: 0}
  m_PrefabAsset: {fileID: 0}
  m_GameObject: {fileID: 0}
  m_Enabled: 1
  m_EditorHideFlags: 0
  m_Script: {fileID: 11500000, guid: 8650d77be55485948af1c0e9e6854cbc, type: 3}
  m_Name: Herman
  m_EditorClassIdentifier: 
  name: Herman
  sprite: {fileID: 2800000, guid: 06e191013d77b18419b152969938f0fe, type: 3}
  strength: 14
  dexterity: 20
  speed: 10
  constitution: 11
  inteligence: 16
  will: 24
  charm: 12
  overall: 107
  lp: 4
  baseLearningType: 8
  specialLearningType1: 0
  weaponNeededSpecial1: 0
  specialLearningType2: 0
  weaponNeededSpecial2: 0
  magicSpecializations: 03000000
