%YAML 1.1
%TAG !u! tag:unity3d.com,2011:
--- !u!114 &11400000
MonoBehaviour:
  m_ObjectHideFlags: 0
  m_CorrespondingSourceObject: {fileID: 0}
  m_PrefabInstance: {fileID: 0}
  m_PrefabAsset: {fileID: 0}
  m_GameObject: {fileID: 0}
  m_Enabled: 1
  m_EditorHideFlags: 0
  m_Script: {fileID: 11500000, guid: 8650d77be55485948af1c0e9e6854cbc, type: 3}
  m_Name: Leonid
  m_EditorClassIdentifier: 
  name: Leonid
  sprite: {fileID: 2800000, guid: bd15f0292a6a4d641958b9bbb8c1356a, type: 3}
  strength: 19
  dexterity: 13
  speed: 21
  constitution: 17
  inteligence: 25
  will: 13
  charm: 27
  overall: 135
  lp: 0
  baseLearningType: 32
  specialLearningType1: 0
  weaponNeededSpecial1: 0
  specialLearningType2: 0
  weaponNeededSpecial2: 0
  magicSpecializations: 07000000
