%YAML 1.1
%TAG !u! tag:unity3d.com,2011:
--- !u!114 &11400000
MonoBehaviour:
  m_ObjectHideFlags: 0
  m_CorrespondingSourceObject: {fileID: 0}
  m_PrefabInstance: {fileID: 0}
  m_PrefabAsset: {fileID: 0}
  m_GameObject: {fileID: 0}
  m_Enabled: 1
  m_EditorHideFlags: 0
  m_Script: {fileID: 11500000, guid: 8650d77be55485948af1c0e9e6854cbc, type: 3}
  m_Name: Mikhail
  m_EditorClassIdentifier: 
  name: Michael
  sprite: {fileID: 2800000, guid: fc0bd175294686549b6459204e30f2ca, type: 3}
  strength: 16
  dexterity: 17
  speed: 19
  constitution: 15
  inteligence: 18
  will: 21
  charm: 21
  overall: 127
  lp: 10
  baseLearningType: 32
  specialLearningType1: 1024
  weaponNeededSpecial1: 3
  specialLearningType2: 0
  weaponNeededSpecial2: 0
  magicSpecializations: 05000000
