%YAML 1.1
%TAG !u! tag:unity3d.com,2011:
--- !u!114 &11400000
MonoBehaviour:
  m_ObjectHideFlags: 0
  m_CorrespondingSourceObject: {fileID: 0}
  m_PrefabInstance: {fileID: 0}
  m_PrefabAsset: {fileID: 0}
  m_GameObject: {fileID: 0}
  m_Enabled: 1
  m_EditorHideFlags: 0
  m_Script: {fileID: 11500000, guid: 8650d77be55485948af1c0e9e6854cbc, type: 3}
  m_Name: Bard
  m_EditorClassIdentifier: 
  name: Bard
  sprite: {fileID: 2800000, guid: ea4c615d5134fc446b3f0eee49f539d4, type: 3}
  strength: 20
  dexterity: 18
  speed: 17
  constitution: 16
  inteligence: 13
  will: 14
  charm: 22
  overall: 120
  lp: 10
  baseLearningType: 2
  specialLearningType1: 0
  weaponNeededSpecial1: 0
  specialLearningType2: 0
  weaponNeededSpecial2: 0
  magicSpecializations: 00000000
