%YAML 1.1
%TAG !u! tag:unity3d.com,2011:
--- !u!114 &11400000
MonoBehaviour:
  m_ObjectHideFlags: 0
  m_CorrespondingSourceObject: {fileID: 0}
  m_PrefabInstance: {fileID: 0}
  m_PrefabAsset: {fileID: 0}
  m_GameObject: {fileID: 0}
  m_Enabled: 1
  m_EditorHideFlags: 0
  m_Script: {fileID: 11500000, guid: 8650d77be55485948af1c0e9e6854cbc, type: 3}
  m_Name: Tatyana
  m_EditorClassIdentifier: 
  name: Tatyana
  sprite: {fileID: 2800000, guid: 4c22d413eccefbf4fab6966770f63e6a, type: 3}
  strength: 18
  dexterity: 16
  speed: 15
  constitution: 19
  inteligence: 17
  will: 13
  charm: 20
  overall: 118
  lp: 10
  baseLearningType: 2
  specialLearningType1: 0
  weaponNeededSpecial1: 0
  specialLearningType2: 0
  weaponNeededSpecial2: 0
  magicSpecializations: 00000000
