%YAML 1.1
%TAG !u! tag:unity3d.com,2011:
--- !u!114 &11400000
MonoBehaviour:
  m_ObjectHideFlags: 0
  m_CorrespondingSourceObject: {fileID: 0}
  m_PrefabInstance: {fileID: 0}
  m_PrefabAsset: {fileID: 0}
  m_GameObject: {fileID: 0}
  m_Enabled: 1
  m_EditorHideFlags: 0
  m_Script: {fileID: 11500000, guid: 8650d77be55485948af1c0e9e6854cbc, type: 3}
  m_Name: Monica
  m_EditorClassIdentifier: 
  name: Monica
  sprite: {fileID: 2800000, guid: df1732a802622784996e229d0343901a, type: 3}
  strength: 14
  dexterity: 19
  speed: 20
  constitution: 14
  inteligence: 16
  will: 17
  charm: 24
  overall: 124
  lp: 10
  baseLearningType: 32
  specialLearningType1: 0
  weaponNeededSpecial1: 0
  specialLearningType2: 0
  weaponNeededSpecial2: 0
  magicSpecializations: 00000000
