%YAML 1.1
%TAG !u! tag:unity3d.com,2011:
--- !u!114 &11400000
MonoBehaviour:
  m_ObjectHideFlags: 0
  m_CorrespondingSourceObject: {fileID: 0}
  m_PrefabInstance: {fileID: 0}
  m_PrefabAsset: {fileID: 0}
  m_GameObject: {fileID: 0}
  m_Enabled: 1
  m_EditorHideFlags: 0
  m_Script: {fileID: 11500000, guid: 8650d77be55485948af1c0e9e6854cbc, type: 3}
  m_Name: Shonen
  m_EditorClassIdentifier: 
  name: Shonen
  sprite: {fileID: 2800000, guid: 0490c751a7027244f83e67c00c20d647, type: 3}
  strength: 23
  dexterity: 14
  speed: 16
  constitution: 16
  inteligence: 17
  will: 13
  charm: 17
  overall: 116
  lp: 10
  baseLearningType: 512
  specialLearningType1: 0
  weaponNeededSpecial1: 0
  specialLearningType2: 0
  weaponNeededSpecial2: 0
  magicSpecializations: 00000000
