%YAML 1.1
%TAG !u! tag:unity3d.com,2011:
--- !u!114 &11400000
MonoBehaviour:
  m_ObjectHideFlags: 0
  m_CorrespondingSourceObject: {fileID: 0}
  m_PrefabInstance: {fileID: 0}
  m_PrefabAsset: {fileID: 0}
  m_GameObject: {fileID: 0}
  m_Enabled: 1
  m_EditorHideFlags: 0
  m_Script: {fileID: 11500000, guid: 23bc95f59027f594f90407189eb340b2, type: 3}
  m_Name: DynamicHit
  m_EditorClassIdentifier: 
  number: 65
  name: Dynamic Hit
  learningTypes: 2526
  dependency: {fileID: 11400000, guid: bcdad7a1d7c44de4ea3389862ccd0831, type: 2}
  weaponExclusive: 0
  weaponNeed: 
