%YAML 1.1
%TAG !u! tag:unity3d.com,2011:
--- !u!114 &11400000
MonoBehaviour:
  m_ObjectHideFlags: 0
  m_CorrespondingSourceObject: {fileID: 0}
  m_PrefabInstance: {fileID: 0}
  m_PrefabAsset: {fileID: 0}
  m_GameObject: {fileID: 0}
  m_Enabled: 1
  m_EditorHideFlags: 0
  m_Script: {fileID: 11500000, guid: 8650d77be55485948af1c0e9e6854cbc, type: 3}
  m_Name: Katarina
  m_EditorClassIdentifier: 
  name: Katarina
  sprite: {fileID: 2800000, guid: dcf4f9aca1677444f94c13d59b5bad91, type: 3}
  strength: 17
  dexterity: 21
  speed: 23
  constitution: 18
  inteligence: 10
  will: 16
  charm: 17
  overall: 122
  lp: 10
  baseLearningType: 4
  specialLearningType1: 512
  weaponNeededSpecial1: 1
  specialLearningType2: 1024
  weaponNeededSpecial2: 3
  magicSpecializations: 00000000
