%YAML 1.1
%TAG !u! tag:unity3d.com,2011:
--- !u!114 &11400000
MonoBehaviour:
  m_ObjectHideFlags: 0
  m_CorrespondingSourceObject: {fileID: 0}
  m_PrefabInstance: {fileID: 0}
  m_PrefabAsset: {fileID: 0}
  m_GameObject: {fileID: 0}
  m_Enabled: 1
  m_EditorHideFlags: 0
  m_Script: {fileID: 11500000, guid: 8650d77be55485948af1c0e9e6854cbc, type: 3}
  m_Name: FatRobin
  m_EditorClassIdentifier: 
  name: Fat Robin
  sprite: {fileID: 2800000, guid: b00e699bc8f58064ea690bc6df47577a, type: 3}
  strength: 15
  dexterity: 17
  speed: 22
  constitution: 17
  inteligence: 14
  will: 15
  charm: 19
  overall: 119
  lp: 9
  baseLearningType: 32
  specialLearningType1: 0
  weaponNeededSpecial1: 0
  specialLearningType2: 0
  weaponNeededSpecial2: 0
  magicSpecializations: 00000000
