<?xml version="1.0" encoding="UTF-8" standalone="no"?>
<!-- Created with Inkscape (http://www.inkscape.org/) -->

<svg
   width="1339.6938"
   height="1045.9369"
   viewBox="0 0 354.46066 276.73747"
   version="1.1"
   id="svg5"
   xml:space="preserve"
   inkscape:version="1.2.2 (b0a8486541, 2022-12-01)"
   sodipodi:docname="calibration.svg"
   xmlns:inkscape="http://www.inkscape.org/namespaces/inkscape"
   xmlns:sodipodi="http://sodipodi.sourceforge.net/DTD/sodipodi-0.dtd"
   xmlns="http://www.w3.org/2000/svg"
   xmlns:svg="http://www.w3.org/2000/svg"><sodipodi:namedview
     id="namedview7"
     pagecolor="#ffffff"
     bordercolor="#666666"
     borderopacity="1.0"
     inkscape:showpageshadow="2"
     inkscape:pageopacity="0.0"
     inkscape:pagecheckerboard="0"
     inkscape:deskcolor="#d1d1d1"
     inkscape:document-units="px"
     showgrid="false"
     inkscape:zoom="0.89263468"
     inkscape:cx="857.57367"
     inkscape:cy="547.25635"
     inkscape:window-width="2560"
     inkscape:window-height="1532"
     inkscape:window-x="1920"
     inkscape:window-y="0"
     inkscape:window-maximized="1"
     inkscape:current-layer="layer1" /><defs
     id="defs2" /><g
     inkscape:label="Ebene 1"
     inkscape:groupmode="layer"
     id="layer1"
     transform="translate(-8.0960811,-3.9164722)"><g
       id="layer1-3"
       stroke="#000000"
       transform="matrix(1.172454,0,0,1.172454,-270.25907,-635.97652)"><path
         id="path5627"
         stroke-linejoin="round"
         d="m 307.22,762.57 c -7.6031,3.6558 -7.1512,12.267 -7.0841,17.41 67.626,1.4094 112.28,0.9362 178.32,-0.83361 -0.0327,-7.1654 -0.89025,-15.727 -7.5008,-17.41 z"
         stroke-linecap="round"
         stroke-width="2"
         fill="#ffffff" /><path
         id="path5621"
         stroke-width="2"
         fill="#ffffff"
         d="m 375.8,736.39 -0.46976,31.83 c 13.359,6.1343 25.149,4.3034 32.413,2e-5 l -0.46974,-33.009 z" /><path
         id="path7903"
         stroke-linejoin="round"
         d="m 238.25,550.99 c -0.0694,-2.1004 1.1498,-4.6847 5.2661,-4.2764 97.015,-1.0987 193.71,-0.90131 290.05,0.69023 4.2176,0.0431 4.2362,0.78598 4.4702,4.0473 l 1.388,182.51 c 0.2247,2.0778 -0.0783,3.4476 -2.6364,3.7504 -100.89,10.828 -191.99,13.572 -295.39,4.103 -3.9666,-0.32082 -3.7413,-2.7952 -3.7283,-3.7516 z"
         stroke-linecap="round"
         stroke-width="0.5"
         fill="none" /><path
         id="path5615"
         stroke-linejoin="round"
         d="m 242.22,550.13 -0.7631,171.94 0.33871,15.06 c 94.363,9.614 200.41,6.8065 294.77,-3.0105 l -2.02,-182.81 c -97.297,-1.7423 -199.02,-0.33159 -292.34,-1.1789 z"
         stroke-linecap="round"
         stroke-width="2"
         fill="#ffffff" /><path
         id="path5617"
         stroke-linejoin="round"
         stroke-linecap="round"
         fill="#ffffff"
         d="m 254.14,562.66 v 145.93 l 268.36,0.39336 -1.2501,-146.7 z" /><path
         id="path5619"
         fill="none"
         d="m 369.73,716.35 0.58932,10.61 43.02,2e-5 v -10.61 h -30.474 l -5.834,0.2084 z" /><path
         id="path5648"
         stroke-linejoin="round"
         d="m 443.4,483.11 c 0,1.8108 -1.468,3.2788 -3.2788,3.2788 -1.8108,0 -3.2788,-1.468 -3.2788,-3.2788 0,-1.8108 1.468,-3.2788 3.2788,-3.2788 1.8108,0 3.2788,1.468 3.2788,3.2788 z"
         transform="matrix(1.1683,0,0,1.1685,3.4659,154.47)"
         stroke-linecap="round"
         stroke-width="0.85586"
         fill="#ffffff" /><path
         id="path5650"
         stroke-linejoin="round"
         d="m 443.4,483.11 c 0,1.8108 -1.468,3.2788 -3.2788,3.2788 -1.8108,0 -3.2788,-1.468 -3.2788,-3.2788 0,-1.8108 1.468,-3.2788 3.2788,-3.2788 1.8108,0 3.2788,1.468 3.2788,3.2788 z"
         transform="matrix(0.80881,0,0,0.80899,151.07,328.77)"
         stroke-linecap="round"
         stroke-width="1.2362"
         fill="#ffffff" /><path
         id="path8737"
         stroke-linejoin="round"
         d="m 443.4,483.11 c 0,1.8108 -1.468,3.2788 -3.2788,3.2788 -1.8108,0 -3.2788,-1.468 -3.2788,-3.2788 0,-1.8108 1.468,-3.2788 3.2788,-3.2788 1.8108,0 3.2788,1.468 3.2788,3.2788 z"
         transform="matrix(0.80881,0,0,0.80899,141.79,328.77)"
         stroke-linecap="round"
         stroke-width="1.2362"
         fill="#ffffff" /></g></g></svg>
