# I'm not sure how this needs to be layed out to work html wise
<b>
<blockquote>
<br />
<code>
<dd>
<dl>
<dt>
<em>
<h1>
<h2>
<h3>
<h4>
<h5>
<h6>
<i>
<li>
<ol>
<p>
<pre>
<small> 
<strike>
<strong>
<sub>
<sup>
<u>
<ul>
<!--...-->