[
	{
		"item" : "appliedenergistics2:quartz_ore",
		"color" : 0,
		"rarity" : [
			{
				"whitelist" : "",
				"blacklist" : "minecraft:hell, minecraft:sky",
				"depth_min" : 12,
				"depth_max" : 72,
				"weight" : 20
			},
			{
				"whitelist": "",
				"blacklist": "minecraft:hell, minecraft:sky",
				"depth_min": 0,
				"depth_max": 255,
				"weight": 1
			}
		]
	},
	{
		"item" : "appliedenergistics2:charged_quartz_ore",
		"color" : 0,
		"rarity" : [
			{
				"whitelist" : "",
				"blacklist" : "minecraft:hell, minecraft:sky",
				"depth_min" : 7,
				"depth_max" : 72,
				"weight" : 1
			},
			{
				"whitelist": "",
				"blacklist": "minecraft:hell, minecraft:sky",
				"depth_min": 0,
				"depth_max": 255,
				"weight": 1
			}
		]
	}
]