<svg width="154" height="120" viewBox="0 0 154 120" fill="none" xmlns="http://www.w3.org/2000/svg">
<path d="M115.126 42.7505L153.262 80.9349L115.127 80.9349L76.9912 42.7505L115.126 42.7505Z" fill="black"/>
<path d="M153.273 80.9338L115.138 119.116L77.0029 80.9338H153.273Z" fill="black"/>
<path d="M115.137 42.75L153.272 80.9337L115.137 119.116V42.75Z" fill="black"/>
<path d="M115.137 80.9348V42.751L153.272 80.9348H115.137Z" fill="black"/>
<path d="M38.8668 42.7501L0.732584 80.9342L38.8665 80.9345L77.0016 42.7494L38.8668 42.7501Z" fill="black"/>
<path d="M0.726562 80.9338L38.8604 119.116L76.9956 80.9338H0.726562Z" fill="black"/>
<path d="M38.8633 42.75L0.729492 80.9337L38.8633 119.116V42.75Z" fill="black"/>
<path d="M38.8633 80.9348V42.751L0.729492 80.9348H38.8633Z" fill="black"/>
<path fill-rule="evenodd" clip-rule="evenodd" d="M76.3366 0.884033L47.8708 29.4192H104.907L76.3366 0.884033Z" fill="black"/>
</svg>
