Location, Latitude, Longitude, Field_1, Field_2, Field_3, Field_4, Field_5, Field_6
"Boreal North America",47.0,-87.0,Evergreen Needleleaf Forest,Climate Hotspot Regions,None,None
"Boreal Eurasia",47.0,45.0,Evergreen Needleleaf Forest,Climate Hotspot Regions,None,None
"Tropical/Dry Transition 1",-12.0,-67.0,Evergreen Broadleaf Forest,Climate Hotspot Regions,None,None
"Tropical/Dry Transition 2",-16.0,-50.0,Evergreen Broadleaf Forest/Woody Savanna,Climate Hotspot Regions,None,None
"Tropical/Dry Transition 3",20.0,-103.0,Evergreen Broadleaf Forest/Woody Savanna,Climate Hotspot Regions,None,None
"Tropical/Dry Transition 4",9.0,4.0,Woody Savanna/Savanna,Climate Hotspot Regions,None,None
"Tropical/Dry Transition 5",-23.0,22.0,Woody Savanna/Savanna,Climate Hotspot Regions,None,None
"Agricultural North America 1",35.7,-121.0,Cropland,Agricultural Regions,None,None
"Agricultural North America 2",41.5,-98.7,Cropland,Agricultural Regions,None,None
"Agricultural Eurasia 1",44.2,18.0,Cropland,Agricultural Regions,None,None
"Agricultural Eurasia 2",25.0,78.0,Cropland,Agricultural Regions,None,None
"Agricultural Eurasia 3",47.0,0.0,Cropland,Agricultural Regions,None,None
"Campbell River, Canada",49.9,-125.3,Evergreen Needleleaf Forest,FLUXNET and Calibration/Validation Sites,http://fluxnet.ornl.gov/site/120,None
"Hartheim, Germany",47.9,7.6,Evergreen Needleleaf Forest,FLUXNET and Calibration/Validation Sites,http://fluxnet.ornl.gov/site/2649,None
"Howland Forest, ME, USA",45.2,-68.7,Evergreen Needleleaf Forest,FLUXNET and Calibration/Validation Sites,http://fluxnet.ornl.gov/site/890,None
"Metolius, OR, USA",44.5,-121.6,Evergreen Needleleaf Forest,FLUXNET and Calibration/Validation Sites,http://fluxnet.ornl.gov/site/955,None
"Quebec Boreal, Canada",49.7,-74.3,Evergreen Needleleaf Forest,FLUXNET and Calibration/Validation Sites,http://fluxnet.ornl.gov/site/2840,None
"Tatra, Slovak Republic",49.1,20.2,Evergreen Needleleaf Forest,FLUXNET and Calibration/Validation Sites,http://fluxnet.ornl.gov/site/2636,None
"Wind River Crane, WA, USA",45.8,-122.0,Evergreen Needleleaf Forest,FLUXNET and Calibration/Validation Sites,http://fluxnet.ornl.gov/site/1103,None
"Guyaflux, French Guiana",5.3,-52.9,Evergreen Broadleaf Forest,FLUXNET and Calibration/Validation Sites,http://fluxnet.ornl.gov/site/498,None
"La Selva, Costa Rica",10.4,-84.0,Evergreen Broadleaf Forest,FLUXNET and Calibration/Validation Sites,http://fluxnet.ornl.gov/site/382,None
"Manaus K34, Brazil",-2.6,-60.2,Evergreen Broadleaf Forest,FLUXNET and Calibration/Validation Sites,http://fluxnet.ornl.gov/site/76,None
"Santarem KM67, Brazil",-2.9,-55.0,Evergreen Broadleaf Forest,FLUXNET and Calibration/Validation Sites,http://fluxnet.ornl.gov/site/83,None
"Santarem KM83, Brazil",-3.0,-55.0,Deciduous Broadleaf Forest,FLUXNET and Calibration/Validation Sites,http://fluxnet.ornl.gov/site/85,None
"Chamela, Mexico",19.5,-105.0,Deciduous Broadleaf Forest,FLUXNET and Calibration/Validation Sites,http://fluxnet.ornl.gov/site/644,None
"Duke Forest, NC, USA",36.0,-79.1,Deciduous Broadleaf Forest,FLUXNET and Calibration/Validation Sites,http://fluxnet.ornl.gov/site/868,None
"Hainich, Germany",51.1,10.5,Deciduous Broadleaf Forest, Radiance at sensor, LANDSAT  Calibration/Validation site,FLUXNET and Calibration/Validation Sites,http://fluxnet.ornl.gov/site/392,None
"Harvard Forest, MA, USA",42.5,-72.2,Deciduous Broadleaf Forest,FLUXNET and Calibration/Validation Sites,http://fluxnet.ornl.gov/site/886,None
"Hesse Forest, France",48.7,7.1,Deciduous Broadleaf Forest,FLUXNET and Calibration/Validation Sites,http://fluxnet.ornl.gov/site/476,None
"Tonzi Ranch, CA, USA",38.4,-121.1,Deciduous Broadleaf Forest/WBA,FLUXNET and Calibration/Validation Sites,http://fluxnet.ornl.gov/site/1078,None
"ARM S. Great Plains, OK, USA",36.6,-97.5,Cropland, Radiance at sensor, LANDSAT  Calibration/Validation site,FLUXNET and Calibration/Validation Sites,http://fluxnet.ornl.gov/site/929,None
"Aurade, France",43.5,1.1,Cropland,FLUXNET and Calibration/Validation Sites,http://fluxnet.ornl.gov/site/462,None
"Bondville, IL, USA",40.0,-88.3,Cropland, Radiance at sensor, LANDSAT  Calibration/Validation site,FLUXNET and Calibration/Validation Sites,http://fluxnet.ornl.gov/site/830,None
"El Saler-Sueca, Spain",39.3,-0.3,Cropland,FLUXNET and Calibration/Validation Sites,http://fluxnet.ornl.gov/site/438,None
"Mead 1, 2, 3 NE,USA",41.2,-96.5,Cropland,FLUXNET and Calibration/Validation Sites,http://fluxnet.ornl.gov/site/951, http://fluxnet.ornl.gov/site/952, http://fluxnet.ornl.gov/site/953,None
"Salton Sea, CA",33.3,-115.7,Radiance at sensor, LANDSAT  Calibration/Validation site,FLUXNET and Calibration/Validation Sites,http://saltonsea.jpl.nasa.gov/,None
"Lake Tahoe, CA ",39.2,-120.0,Radiance at sensor, LANDSAT  Calibration/Validation site,FLUXNET and Calibration/Validation Sites,http://laketahoe.jpl.nasa.gov/,None
"Gobabeb, Namibia",-23.5,15.1,Radiance at sensor, LANDSAT  Calibration/Validation site,FLUXNET and Calibration/Validation Sites,http://www.gobabebtrc.org/index.php/research/atmospheric-sciences-and-meteorology,None
"Algodones Dunes, CA",33.0,-115.1,Radiance at sensor, LANDSAT  Calibration/Validation site,FLUXNET and Calibration/Validation Sites,http://emissivity.jpl.nasa.gov/validation/algodones-dunes,None
