{
  "metadata": [
    {
      "src": [
        {
          
          "src": "csproj",
          "files": [
            "ThereItIs.DataPalette.csproj"
          ],
        }
      ],
      "dest": "api",
      "includePrivateMembers": false,
      "disableGitFeatures": false,
      "disableDefaultFilter": false,
      "noRestore": false,
      "namespaceLayout": "flattened",
      "memberLayout": "separatePages",
      "allowCompilationErrors": false
    }
  ],
  "build": {
    "xref": [
        "xrefmap-Unity.yml"
    ],
    "content": [
      {
        "files": [
          "api/**.yml",
          "api/index.md"
        ]
      },
      {
        "files": [
          "articles/**.md",
          "articles/**/toc.yml",
          "toc.yml",
          "*.md"
        ]
      }
    ],
    "resource": [
      {
        "files": [
          "images/**"
        ]
      }
    ],
    "output": "_site",
    "globalMetadataFiles": [],
    "fileMetadataFiles": [],
    "template": [
      "statictoc",
      "default",
      "modern",
      "templates/there-it-is"
    ],
    "postProcessors": [],
    "keepFileLink": false,
    "disableGitFeatures": false
  }
}